<?xml version="1.0" encoding="utf-8"?>
<!-- Generator: Adobe Illustrator 21.0.0, SVG Export Plug-In . SVG Version: 6.00 Build 0)  -->
<svg version="1.1" id="Layer_1" xmlns="http://www.w3.org/2000/svg" xmlns:xlink="http://www.w3.org/1999/xlink" x="0px" y="0px"
	 width="1545px" height="744px" viewBox="0 0 1545 744" style="enable-background:new 0 0 1545 744;" xml:space="preserve">
	<g>
		<path style="fill:#333333;" d="M291,681V537H23.4v-92L251.9,77.1h172.8v354h72.5V537h-72.5v144H291z M291,431.1V297.3
			c0-36.2,1.9-73.4,4.6-112.4h-3.7c-19.5,39-35.3,74.3-55.7,112.4l-80.8,131.9v1.9L291,431.1L291,431.1z"/>
		<path style="fill:#666666;" d="M999.7,376.3c0,186.8-75.3,315-229.5,315C614.1,691.3,545.3,551,544.4,380c0-174.7,74.3-313.1,230.4-313.1
			C936.5,66.9,999.7,210.9,999.7,376.3z M686.6,380c-0.9,138.4,32.5,204.4,87.3,204.4s84.6-68.8,84.6-206.3
			c0-133.8-28.8-204.4-85.5-204.4C720.9,173.7,685.6,239.7,686.6,380z"/>
		<path style="fill:#F3BB41;" d="M1319.3,681V537h-267.6v-92l228.6-367.9h172.8v354h72.5V537h-72.5v144H1319.3z M1319.3,431.1V297.3
			c0-36.2,1.9-73.4,4.6-112.4h-3.7c-19.5,39-35.3,74.3-55.7,112.4l-80.8,131.9v1.9L1319.3,431.1L1319.3,431.1z"/>
	</g>
	<g  style="opacity:0.26;">
		<g>
			<g>
				<path style="fill:#FFFFFF;stroke:#000000;stroke-miterlimit:20;" d="M607.5,714c-85.6,0-108.4-188.2-108.4-299.3c0-22.6-10.7-52.2-22.2-83.4c-24.8-68.1-55.7-152.8-1.9-231.2
					c34.2-49.8,71.1-73,116.4-73c29.3,0,57.5,9.4,87.5,19.5c29.7,9.9,60.4,20.2,91.9,20.2c32,0,62.5-10,92-19.8
					c29.5-9.7,57.3-18.9,86.5-18.9c45.2,0,83.2,22.8,119.5,71.7c56.4,75.8,25.5,162.7,0.7,232.6c-11.1,31.1-21.5,60.6-21.5,82.4
					c0,49.8-5.2,298-108.4,298c-71.3,0-88-73.8-102.7-138.8c-15-66.1-26.8-106.3-63.8-106.3c-42.5,0-57.5,56.5-73.5,116.4
					C682.7,647.9,665.1,714,607.5,714z"/>
			</g>
		</g>
	</g>
</svg>
