<svg width="265" height="111" viewBox="0 0 265 111" fill="none" xmlns="http://www.w3.org/2000/svg">
<mask id="mask0" style="mask-type:alpha" maskUnits="userSpaceOnUse" x="0" y="0" width="265" height="111">
<path d="M0 8C0 3.58172 3.58172 0 8 0H257C261.418 0 265 3.58172 265 8V111H0V8Z" fill="#EFE29E"/>
</mask>
<g mask="url(#mask0)">
<path d="M247.382 76.3L249.587 8.1L197.231 25.15L247.382 76.3Z" fill="url(#paint0_linear)"/>
<path d="M193.924 43.3L197.231 70.8L174.084 51.55L193.924 43.3Z" fill="url(#paint1_linear)"/>
<path d="M249.587 108.2L222.582 82.9L225.338 117L249.587 108.2Z" fill="url(#paint2_linear)"/>
<path d="M278.244 63.65L265.569 47.7V70.8L278.244 63.65Z" fill="url(#paint3_linear)"/>
<path d="M174.084 18.55L198.884 8.1L164.716 -4L174.084 18.55Z" fill="url(#paint4_linear)"/>
<path d="M220.378 8.1L228.093 -4H214.316L220.378 8.1Z" fill="url(#paint5_linear)"/>
<path d="M180.698 76.3L164.716 104.35L197.231 98.85L180.698 76.3Z" fill="url(#paint6_linear)"/>
<path d="M281 2.6L268.876 15.25V-4L281 2.6Z" fill="url(#paint7_linear)"/>
<path d="M218.173 70.8V63.65L211.009 68.6L218.173 70.8Z" fill="url(#paint8_linear)"/>
<path d="M174.084 43.3L170.778 29L157 40L174.084 43.3Z" fill="url(#paint9_linear)"/>
<path d="M164.716 76.3V68.6L157 70.8L164.716 76.3Z" fill="url(#paint10_linear)"/>
</g>
<defs>
<linearGradient id="paint0_linear" x1="462.453" y1="42.0952" x2="147.495" y2="41.4611" gradientUnits="userSpaceOnUse">
<stop stop-color="#FEFEFF"/>
<stop offset="1" stop-color="#FEFEFF" stop-opacity="0"/>
</linearGradient>
<linearGradient id="paint1_linear" x1="462.453" y1="42.0952" x2="147.495" y2="41.4611" gradientUnits="userSpaceOnUse">
<stop stop-color="#FEFEFF"/>
<stop offset="1" stop-color="#FEFEFF" stop-opacity="0"/>
</linearGradient>
<linearGradient id="paint2_linear" x1="462.453" y1="42.0952" x2="147.495" y2="41.4611" gradientUnits="userSpaceOnUse">
<stop stop-color="#FEFEFF"/>
<stop offset="1" stop-color="#FEFEFF" stop-opacity="0"/>
</linearGradient>
<linearGradient id="paint3_linear" x1="462.453" y1="42.0952" x2="147.495" y2="41.4611" gradientUnits="userSpaceOnUse">
<stop stop-color="#FEFEFF"/>
<stop offset="1" stop-color="#FEFEFF" stop-opacity="0"/>
</linearGradient>
<linearGradient id="paint4_linear" x1="462.453" y1="42.0952" x2="147.495" y2="41.4611" gradientUnits="userSpaceOnUse">
<stop stop-color="#FEFEFF"/>
<stop offset="1" stop-color="#FEFEFF" stop-opacity="0"/>
</linearGradient>
<linearGradient id="paint5_linear" x1="462.453" y1="42.0952" x2="147.495" y2="41.4611" gradientUnits="userSpaceOnUse">
<stop stop-color="#FEFEFF"/>
<stop offset="1" stop-color="#FEFEFF" stop-opacity="0"/>
</linearGradient>
<linearGradient id="paint6_linear" x1="462.453" y1="42.0952" x2="147.495" y2="41.4611" gradientUnits="userSpaceOnUse">
<stop stop-color="#FEFEFF"/>
<stop offset="1" stop-color="#FEFEFF" stop-opacity="0"/>
</linearGradient>
<linearGradient id="paint7_linear" x1="462.453" y1="42.0952" x2="147.495" y2="41.4611" gradientUnits="userSpaceOnUse">
<stop stop-color="#FEFEFF"/>
<stop offset="1" stop-color="#FEFEFF" stop-opacity="0"/>
</linearGradient>
<linearGradient id="paint8_linear" x1="462.453" y1="42.0952" x2="147.495" y2="41.4611" gradientUnits="userSpaceOnUse">
<stop stop-color="#FEFEFF"/>
<stop offset="1" stop-color="#FEFEFF" stop-opacity="0"/>
</linearGradient>
<linearGradient id="paint9_linear" x1="462.453" y1="42.0952" x2="147.495" y2="41.4611" gradientUnits="userSpaceOnUse">
<stop stop-color="#FEFEFF"/>
<stop offset="1" stop-color="#FEFEFF" stop-opacity="0"/>
</linearGradient>
<linearGradient id="paint10_linear" x1="462.453" y1="42.0952" x2="147.495" y2="41.4611" gradientUnits="userSpaceOnUse">
<stop stop-color="#FEFEFF"/>
<stop offset="1" stop-color="#FEFEFF" stop-opacity="0"/>
</linearGradient>
</defs>
</svg>
