<svg width="22" height="22" viewBox="0 0 22 22" fill="none" xmlns="http://www.w3.org/2000/svg">
<path d="M7.78914 5.47455L10.028 1.35353C10.349 0.762538 11.1941 0.753322 11.528 1.33717L13.9061 5.49569C14.3536 6.27827 15.105 6.84084 15.9819 7.04995L20.7289 8.18189C21.3973 8.34128 21.6171 9.18214 21.1122 9.64821L17.6367 12.8562C16.8262 13.6044 16.4485 14.7114 16.6327 15.7989L17.4002 20.3312C17.5176 21.0243 16.7979 21.5571 16.1692 21.2425L12.2664 19.2893C11.3232 18.8173 10.2101 18.8302 9.27811 19.324L5.63876 21.2525C5.03418 21.5729 4.31604 21.0921 4.38195 20.411L4.85776 15.4944C4.94644 14.5781 4.64395 13.667 4.02487 12.9857L0.95693 9.6092C0.522167 9.13072 0.752089 8.36156 1.37812 8.20018L5.73637 7.07667C6.61329 6.85061 7.35684 6.2703 7.78914 5.47455Z" fill="#FFD600"/>
</svg>
