<svg width="266" height="112" viewBox="0 0 266 112" fill="none" xmlns="http://www.w3.org/2000/svg">
<mask id="mask0" style="mask-type:alpha" maskUnits="userSpaceOnUse" x="0" y="0" width="266" height="112">
<path d="M0 8C0 3.58172 3.58172 0 8 0H258C262.418 0 266 3.58172 266 8V112H0V8Z" fill="#9EEFAB"/>
</mask>
<g mask="url(#mask0)">
<path opacity="0.54" d="M309.509 35.4999C309.509 62.5666 287.567 84.5084 260.5 84.5084C233.434 84.5084 211.492 62.5666 211.492 35.4999C211.492 8.4333 233.434 -13.5085 260.5 -13.5085C287.567 -13.5085 309.509 8.4333 309.509 35.4999ZM260.5 87.5084C289.224 87.5084 312.509 64.2234 312.509 35.4999C312.509 6.77644 289.224 -16.5085 260.5 -16.5085C231.777 -16.5085 208.492 6.77644 208.492 35.4999C208.492 64.2234 231.777 87.5084 260.5 87.5084ZM333.5 35.5C333.5 75.8168 300.817 108.5 260.5 108.5C220.183 108.5 187.5 75.8168 187.5 35.5C187.5 -4.81679 220.183 -37.5 260.5 -37.5C300.817 -37.5 333.5 -4.81679 333.5 35.5ZM284.254 35.5001C284.254 48.6192 273.619 59.2543 260.5 59.2543C247.381 59.2543 236.746 48.6192 236.746 35.5001C236.746 22.381 247.381 11.7458 260.5 11.7458C273.619 11.7458 284.254 22.381 284.254 35.5001ZM260.5 62.2543C275.276 62.2543 287.254 50.2761 287.254 35.5001C287.254 20.7241 275.276 8.74585 260.5 8.74585C245.724 8.74585 233.746 20.7241 233.746 35.5001C233.746 50.2761 245.724 62.2543 260.5 62.2543Z" stroke="url(#paint0_linear)" stroke-width="3"/>
</g>
<defs>
<linearGradient id="paint0_linear" x1="289" y1="-7.5" x2="168.5" y2="77" gradientUnits="userSpaceOnUse">
<stop stop-color="#FEFEFF"/>
<stop offset="1" stop-color="#FEFEFF" stop-opacity="0"/>
</linearGradient>
</defs>
</svg>
