<svg width="32" height="32" viewBox="0 0 32 32" fill="none" xmlns="http://www.w3.org/2000/svg">
<g opacity="0.88">
<path d="M20.9044 11.4264C20.8563 11.452 15.5044 14.741 12.8993 16.3522C12.5069 16.5948 12.3646 16.8995 12.4805 17.3246C12.7466 18.2985 13.0379 19.2656 13.3148 20.2367C13.3529 20.3702 13.3903 20.5014 13.5541 20.5036C13.7576 20.5062 13.7669 20.3294 13.7878 20.1945C13.8561 19.7518 13.93 19.3085 13.9639 18.8625C13.9782 18.6457 14.0353 18.4339 14.1319 18.2393C14.2286 18.0447 14.3628 17.8712 14.5269 17.7289C16.3033 16.0878 20.6186 12.0732 21.0033 11.7107C21.1296 11.5919 21.1194 11.4057 20.9044 11.4264Z" fill="white"/>
<path d="M26.25 2.25H5.75C4.82174 2.25 3.9315 2.61875 3.27513 3.27513C2.61875 3.9315 2.25 4.82174 2.25 5.75V26.25C2.25 27.1783 2.61875 28.0685 3.27513 28.7249C3.9315 29.3813 4.82174 29.75 5.75 29.75H26.25C27.1783 29.75 28.0685 29.3813 28.7249 28.7249C29.3813 28.0685 29.75 27.1783 29.75 26.25V5.75C29.75 4.82174 29.3813 3.9315 28.7249 3.27513C28.0685 2.61875 27.1783 2.25 26.25 2.25ZM21.9232 23.1901C21.7982 23.7915 21.4756 23.9217 20.9737 23.5572C19.7143 22.6429 18.4554 21.728 17.197 20.8125C16.6678 20.4277 16.4512 20.4402 15.9366 20.8654C15.3052 21.3872 14.6706 21.9052 14.0327 22.4193C13.5192 22.8321 13.2182 22.738 13.0251 22.1172C12.55 20.5889 12.0677 19.0625 11.6062 17.5304C11.5332 17.2879 11.4138 17.1601 11.1828 17.0767C10.011 16.6531 8.84381 16.2169 7.67494 15.7852C7.44369 15.6996 7.216 15.6074 7.06494 15.3958C7.06494 15.0171 7.17625 14.8364 7.53994 14.6966C13.0639 12.5728 18.5866 10.4457 24.1079 8.31538C24.4751 8.17344 24.7386 8.21969 24.9356 8.56538C24.9353 8.67106 22.7869 19.0454 21.9232 23.1901Z" fill="white"/>
</g>
</svg>
