<svg width="20" height="18" viewBox="0 0 20 18" fill="none" xmlns="http://www.w3.org/2000/svg">
<path d="M19.5 6.59877C19.5 7.35877 18.7879 8.07129 17.7942 8.07129L14.3236 8.07129L14.3236 0.686765C14.5672 0.568538 14.8469 0.49986 15.1471 0.49986L17.7942 0.499861C18.7879 0.499861 19.5 1.21238 19.5 1.97238L19.5 6.59877Z" stroke="#B6B4BF"/>
<path d="M0.905446 8.37716L1.23343 8.02221L0.889829 7.68235C0.641499 7.43673 0.499712 7.10587 0.499712 6.75C0.499712 6.2385 0.795209 5.78474 1.24413 5.56121L1.69503 5.33671L1.46721 4.88748C1.37552 4.70668 1.3269 4.50683 1.3269 4.29546C1.3269 3.78344 1.62298 3.32952 2.07217 3.10586L2.52327 2.88126L2.29515 2.43193C2.15895 2.16366 2.11746 1.85284 2.18756 1.53843C2.31734 0.957887 2.88644 0.499999 3.57402 0.499999L11.1669 0.5C11.4501 0.5 11.8622 0.556667 12.2895 0.673029C12.5372 0.740492 12.7349 0.997156 12.7349 1.34969L12.7349 8.94252C12.7349 9.07168 12.7058 9.19918 12.6497 9.31555L10.4374 13.9109C10.3162 14.1626 10.2533 14.4384 10.2533 14.7177L10.2533 17.1342C10.1121 17.231 9.66986 17.5 9.0989 17.5C8.98213 17.5 8.79767 17.4507 8.56652 17.3106C8.34136 17.1741 8.10176 16.9692 7.8821 16.7076C7.44004 16.1812 7.11731 15.4731 7.11731 14.7273C7.11731 13.9132 7.35549 12.9076 7.58495 12.1365C7.75651 11.56 7.33408 10.9546 6.70987 10.9546L2.16614 10.9546C1.28474 10.9546 0.577363 10.311 0.506702 9.55372C0.466148 9.1135 0.613995 8.69258 0.905446 8.37716Z" stroke="#B6B4BF"/>
</svg>
