<svg width="24" height="22" viewBox="0 0 24 22" fill="none" xmlns="http://www.w3.org/2000/svg">
<path d="M22.3776 4.96345L22.3795 7.49553C20.8176 7.87393 19.6603 9.27633 19.6603 10.957C19.6603 12.6367 20.8177 14.0402 22.38 14.4186V16.9476C22.38 18.7525 20.9166 20.2166 19.1068 20.2166H4.88305C3.07469 20.2166 1.61103 18.7527 1.61103 16.9476V14.4185C3.1725 14.0399 4.32952 12.6364 4.32952 10.957C4.32952 9.24494 3.14745 7.94779 1.6113 7.59567L1.61225 4.96313V4.96282C1.61225 3.15809 3.07679 1.6938 4.88548 1.6938H19.1056C20.914 1.6938 22.3776 3.15776 22.3776 4.96282V4.96345Z" stroke="#FF3D12" stroke-width="1.69277" stroke-linecap="round" stroke-linejoin="round"/>
<path fill-rule="evenodd" clip-rule="evenodd" d="M11.9948 13.1031L14.1075 14.213C14.3054 14.3161 14.5373 14.1487 14.4996 13.9291L14.0953 11.5773L15.8061 9.9144C15.9663 9.75793 15.8777 9.48745 15.6567 9.45471L13.294 9.11145L12.2365 6.97188C12.1381 6.77174 11.8528 6.77174 11.7532 6.97188L10.6957 9.11145L8.33418 9.45471C8.1132 9.48745 8.02457 9.75793 8.18484 9.9144L9.89436 11.5773L9.49005 13.9291C9.45241 14.1487 9.68431 14.3161 9.88222 14.213L11.9948 13.1031Z" fill="#FF3D12"/>
</svg>
