<svg width="25" height="24" viewBox="0 0 25 24" fill="none" xmlns="http://www.w3.org/2000/svg">
<path d="M12.0319 12.2597C13.6932 12.2597 15.0399 10.9682 15.0399 9.37509C15.0399 7.78197 13.6932 6.49048 12.0319 6.49048C10.3707 6.49048 9.02393 7.78197 9.02393 9.37509C9.02393 10.9682 10.3707 12.2597 12.0319 12.2597Z" stroke="#9B9FA4" stroke-width="1.5" stroke-linecap="round" stroke-linejoin="round"/>
<path d="M19.552 9.37511C19.552 14.3254 15.1774 18.4366 13.1013 20.109C12.4689 20.6184 11.595 20.6184 10.9626 20.109C8.88651 18.4366 4.51196 14.3254 4.51196 9.37511C4.51196 7.46249 5.30425 5.62821 6.71452 4.27578C8.12479 2.92336 10.0375 2.16357 12.032 2.16357C14.0264 2.16357 15.9391 2.92336 17.3494 4.27578C18.7597 5.62821 19.552 7.46249 19.552 9.37511Z" stroke="#9B9FA4" stroke-width="1.5" stroke-linecap="round" stroke-linejoin="round"/>
</svg>
