<svg width="266" height="23" viewBox="0 0 266 23" fill="none" xmlns="http://www.w3.org/2000/svg">
<rect x="243" width="23" height="23" fill="#9EEFBF"/>
<rect x="216" width="23" height="23" fill="#9EEFBF"/>
<rect x="189" width="23" height="23" fill="#9EEFBF"/>
<rect x="162" width="23" height="23" fill="#9EEFBF"/>
<rect x="135" width="23" height="23" fill="#9EEFBF"/>
<rect x="108" width="23" height="23" fill="#9EEFBF"/>
<rect x="81" width="23" height="23" fill="#9EEFBF"/>
<rect x="54" width="23" height="23" fill="#9EEFBF"/>
<rect x="27" width="23" height="23" fill="#9EEFBF"/>
<rect width="23" height="23" fill="#9EEFBF"/>
</svg>
