<svg width="24" height="23" viewBox="0 0 24 23" fill="none" xmlns="http://www.w3.org/2000/svg">
<g clip-path="url(#clip0_187_10209)">
<path d="M12.25 22.9314C18.6013 22.9314 23.75 18.0065 23.75 11.9314C23.75 5.85626 18.6013 0.931396 12.25 0.931396C5.89873 0.931396 0.75 5.85626 0.75 11.9314C0.75 18.0065 5.89873 22.9314 12.25 22.9314Z" fill="#FEFEFF"/>
<path d="M6.01185 11.693L17.0998 7.60376C17.6144 7.42593 18.0638 7.72384 17.8971 8.46818L17.8981 8.46726L16.0101 16.9748C15.8702 17.578 15.4955 17.7247 14.9713 17.4405L12.0963 15.4138L10.7096 16.6916C10.5563 16.8383 10.4269 16.962 10.1298 16.962L10.3339 14.1634L15.6623 9.55901C15.8942 9.36376 15.6105 9.25376 15.3048 9.44809L8.7201 13.4136L5.88152 12.5666C5.26531 12.3796 5.25189 11.9772 6.01185 11.693Z" fill="#0071C2"/>
</g>
<defs>
<clipPath id="clip0_187_10209">
<rect width="23" height="22" fill="white" transform="translate(0.75 0.931396)"/>
</clipPath>
</defs>
</svg>
