<svg xmlns="http://www.w3.org/2000/svg" width="28" height="10" viewBox="0 0 28 10">
  <defs>
    <style>
      .cls-1 {
        fill: #4b91ee;
        fill-rule: evenodd;
      }
    </style>
  </defs>
  <path id="arrow-slider-hover.svg" class="cls-1" d="M1267.06,6098.26a0.87,0.87,0,0,0-1.26,0,0.931,0.931,0,0,0,0,1.28l3.4,2.54h-24.07a0.894,0.894,0,0,0-.89.9,0.905,0.905,0,0,0,.89.92h24.07l-3.4,2.53a0.943,0.943,0,0,0,0,1.29,0.87,0.87,0,0,0,1.26,0l4.92-4.09a0.931,0.931,0,0,0,0-1.28Zm0,0" transform="translate(-1244.25 -6098)"/>
</svg>
