<svg xmlns="http://www.w3.org/2000/svg" width="35.03" height="18" viewBox="0 0 35.03 18">
  <defs>
    <style>
      .cls-1 {
        fill-rule: evenodd;
      }
    </style>
  </defs>
  <path id="arrow-hover.svg" class="cls-1" d="M1515.8,6845.26a0.87,0.87,0,0,0-1.26,0,0.931,0.931,0,0,0,0,1.28l6.4,6.54h-31.06a0.9,0.9,0,0,0-.9.9,0.907,0.907,0,0,0,.9.92h31.06l-6.4,6.53a0.943,0.943,0,0,0,0,1.29,0.87,0.87,0,0,0,1.26,0l7.92-8.09a0.931,0.931,0,0,0,0-1.28Zm0,0" transform="translate(-1488.97 -6845)"/>
</svg>
