[gd_scene load_steps=5 format=3 uid="uid://bmcsssrxsdytg"]

[ext_resource type="PackedScene" uid="uid://bbe6fpxufe3cx" path="res://device.tscn" id="1_djhte"]

[sub_resource type="PlaneMesh" id="PlaneMesh_5uw7d"]

[sub_resource type="StandardMaterial3D" id="StandardMaterial3D_4fl56"]
albedo_color = Color(0.768627, 0.713726, 0.854902, 1)

[sub_resource type="Environment" id="Environment_ubrbo"]
background_energy_multiplier = 11.17
ambient_light_color = Color(0.952941, 0.952941, 0.952941, 1)

[node name="simple" type="Node3D"]

[node name="device" parent="." instance=ExtResource("1_djhte")]
transform = Transform3D(-4.37114e-08, -4.37114e-08, -1, 4.37114e-08, 1, -4.37114e-08, 1, -4.37114e-08, -4.37114e-08, -0.00471532, 0, -0.000225186)

[node name="Camera3D" type="Camera3D" parent="."]
transform = Transform3D(1, 0, 0, 0, -4.37114e-08, 1, 0, -1, -4.37114e-08, 0, 1.11375, 0)

[node name="SpotLight3D" type="SpotLight3D" parent="Camera3D"]
transform = Transform3D(0.931875, -0.330797, 0.148937, 0.36278, 0.849722, -0.382576, 1.58576e-08, 0.410544, 0.911841, 0.870626, -0.986545, 1.5521)
light_energy = 3.937
spot_range = 1697.94

[node name="MeshInstance3D" type="MeshInstance3D" parent="."]
transform = Transform3D(10.497, 0, 0, 0, 1, 0, 0, 0, 5.07534, 0, -0.211617, 0)
mesh = SubResource("PlaneMesh_5uw7d")
surface_material_override/0 = SubResource("StandardMaterial3D_4fl56")

[node name="WorldEnvironment" type="WorldEnvironment" parent="."]
environment = SubResource("Environment_ubrbo")
