[gd_scene load_steps=6 format=3 uid="uid://q6mwb67q40qi"]

[ext_resource type="Shader" path="res://display.gdshader" id="1_17enl"]
[ext_resource type="Script" path="res://display.gd" id="1_744k8"]
[ext_resource type="Script" path="res://shader.gd" id="3_uhdok"]

[sub_resource type="ShaderMaterial" id="ShaderMaterial_v31kk"]
shader = ExtResource("1_17enl")
shader_parameter/color = Vector4(0.929, 0.348, 2.283, 1)
shader_parameter/color1 = Vector4(0.859, 0.74, 0.252, 1)
shader_parameter/color2 = Vector4(0.526, 0.69, 0.137, 1)
shader_parameter/color3 = Vector4(0.215, 0.769, 0.601, 1)
shader_parameter/background = Vector4(0.663, 0.988, 0.856, 1)
shader_parameter/size = 0.019
shader_parameter/scale1 = 0.2
shader_parameter/scale2 = 0.2
shader_parameter/scale3 = 0.2
shader_parameter/frequency1 = 0.0
shader_parameter/frequency2 = 1.0
shader_parameter/frequency3 = 2.0
shader_parameter/phase1 = 0.0
shader_parameter/phase2 = 0.0
shader_parameter/phase3 = 0.0
shader_parameter/time = 53.7029
shader_parameter/speed = 5.0

[sub_resource type="PlaceholderTexture2D" id="PlaceholderTexture2D_b72df"]

[node name="display" type="Node2D"]
script = ExtResource("1_744k8")

[node name="shader" type="TextureRect" parent="."]
material = SubResource("ShaderMaterial_v31kk")
offset_right = 1152.0
offset_bottom = 648.0
texture = SubResource("PlaceholderTexture2D_b72df")
script = ExtResource("3_uhdok")
