<?xml version="1.0" encoding="UTF-8" standalone="no"?>
<!DOCTYPE svg PUBLIC "-//W3C//DTD SVG 1.1//EN" "http://www.w3.org/Graphics/SVG/1.1/DTD/svg11.dtd">
<svg width="100%" height="100%" viewBox="0 0 256 256" version="1.1" xmlns="http://www.w3.org/2000/svg" xmlns:xlink="http://www.w3.org/1999/xlink" xml:space="preserve" xmlns:serif="http://www.serif.com/" style="fill-rule:evenodd;clip-rule:evenodd;stroke-linejoin:round;stroke-miterlimit:2;">
    <g id="g24" transform="matrix(1,0,0,1,0,31.9476)">
        <path id="path22" d="M192.44,144.645L224.22,144.645L224.22,68.339L188.415,32.535L165.943,55.007L192.44,81.504L192.44,144.645ZM224.304,160.576L113.452,160.576L86.954,134.079L98.191,122.843L120.076,144.728L165.104,144.728L120.747,100.287L132.067,88.967L176.425,133.325L176.425,88.296L154.623,66.495L165.775,55.342L110.685,0L0,0L31.696,31.696L31.696,31.78L97.436,31.78L120.663,55.007L86.703,88.967L63.476,65.74L63.476,47.712L31.696,47.712L31.696,78.905L86.703,133.912L64.314,156.3L100.119,192.105L256,192.105L224.304,160.576Z" style="fill:rgb(0,153,255);fill-rule:nonzero;"/>
    </g>
</svg>
