﻿stim1;stim2;diff
C:\Users\Admin\Desktop\stimuli\low\01_practice_absent_plant.jpg;C:\Users\Admin\Desktop\stimuli\low\01_practice_present_plant.jpg;low
C:\Users\Admin\Desktop\stimuli\low\0106_L_mirrorONLY_in_toweldispenser.jpg;C:\Users\Admin\Desktop\stimuli\low\0106_L_mirrorONLY_neither_toweldispenser.jpg;low
C:\Users\Admin\Desktop\stimuli\low\0107_L_mirrorONLY_in_shirts.jpg;C:\Users\Admin\Desktop\stimuli\low\0107_L_mirrorONLY_neither_shirts.jpg;low
C:\Users\Admin\Desktop\stimuli\low\012_L_filler_absent_tubaccesory.jpg;C:\Users\Admin\Desktop\stimuli\low\012_L_filler_present_tubaccesory.jpg;low
C:\Users\Admin\Desktop\stimuli\low\0127_R_window_in_light.jpg;C:\Users\Admin\Desktop\stimuli\low\0127_R_window_neither_light.jpg;low
C:\Users\Admin\Desktop\stimuli\low\016_L_filler_absent_art.jpg;C:\Users\Admin\Desktop\stimuli\low\016_L_filler_present_art.jpg;low
C:\Users\Admin\Desktop\stimuli\low\020_L_filler_absent_walldeco.jpg;C:\Users\Admin\Desktop\stimuli\low\020_L_filler_present_walldeco.jpg;low
C:\Users\Admin\Desktop\stimuli\low\027_L_filler_absent_soapdish.jpg;C:\Users\Admin\Desktop\stimuli\low\027_L_filler_present_soapdish.jpg;low
C:\Users\Admin\Desktop\stimuli\low\037_L_filler_absent_towel.jpg;C:\Users\Admin\Desktop\stimuli\low\037_L_filler_present_towel.jpg;low
C:\Users\Admin\Desktop\stimuli\low\077_L_filler_absent_footrest.jpg;C:\Users\Admin\Desktop\stimuli\low\077_L_filler_present_footrest.jpg;low
C:\Users\Admin\Desktop\stimuli\high\0104_R_mirrorONLY_in_bottle.jpg;C:\Users\Admin\Desktop\stimuli\high\0104_R_mirrorONLY_neither_bottle.jpg;high
C:\Users\Admin\Desktop\stimuli\high\0109_L_window_in_pillow.jpg;C:\Users\Admin\Desktop\stimuli\high\0109_L_window_neither_pillow.jpg;high
C:\Users\Admin\Desktop\stimuli\high\0111_R_window_in_pot.jpg;C:\Users\Admin\Desktop\stimuli\high\0111_R_window_neither_pot.jpg;high
C:\Users\Admin\Desktop\stimuli\high\0113_R_window_in_plant.jpg;C:\Users\Admin\Desktop\stimuli\high\0113_R_window_neither_plant.jpg;high
C:\Users\Admin\Desktop\stimuli\high\02_L_filler_absent_napkin.jpg;C:\Users\Admin\Desktop\stimuli\high\02_L_filler_present_napkin.jpg;high
C:\Users\Admin\Desktop\stimuli\high\021_R_filler_absent_keyboard.jpg;C:\Users\Admin\Desktop\stimuli\high\021_R_filler_present_keyboard.jpg;high
C:\Users\Admin\Desktop\stimuli\high\024_L_filler_absent_towels.jpg;C:\Users\Admin\Desktop\stimuli\high\024_L_filler_present_towels.jpg;high
C:\Users\Admin\Desktop\stimuli\high\040_R_filler_absent_painting.jpg;C:\Users\Admin\Desktop\stimuli\high\040_R_filler_present_painting.jpg;high
C:\Users\Admin\Desktop\stimuli\high\041_L_filler_absent_fruit.jpg;C:\Users\Admin\Desktop\stimuli\high\041_L_filler_present_fruit.jpg;high
C:\Users\Admin\Desktop\stimuli\high\062_L_filler_absent_flowers.jpg;C:\Users\Admin\Desktop\stimuli\high\062_L_filler_present_flowers.jpg;high
