strain,salinity,temp,growth_rate
MED1,17.56038716,1.250027092,0.2615616879
MED1,13.70038762,2.187767758,8.155566926
MED1,13.75416261,3.174239523,13.29165486
MED1,24.82202661,4.179684827,15.28807916
ATL1,10.7615681,5.192061062,9.054943982
MED1,23.92435736,6.182378109,16.28823985
MED1,18.04578863,7.601538636,6.915015628
MED1,19.48124516,8.87216804,11.33845412
MED1,15.07265441,9.270690643,8.313427852
ATL1,7.792696,10.62358468,13.3838296
MED1,20.54196693,11.38579766,6.517806253
MED1,7.914747902,12.06169379,18.51791882
MED1,6.51577401,13.67366064,12.59420047
MED1,19.63553352,14.27126194,14.23025558
MED1,22.55121653,15.0945396,17.87250287
MED1,12.42092554,16.7531006,14.88978783
ATL1,23.29310378,17.65918053,10.82718503
ATL1,9.777830528,18.29678635,25.47909749
MED1,16.76458866,19.77741579,18.32344903
MED1,8.441705568,20.8942424,15.59401443
ATL1,11.10192024,21.50510176,28.6594513
ATL1,12.21984153,22.36972812,21.87483816
ATL1,17.41416214,23.16635331,21.97460835
ATL1,21.84616463,24.31598935,25.82199614
MED1,16.93840752,25.02450872,18.25104568
ATL1,18.42387246,26.15042876,20.41355603
MED1,20.45640036,27.78526832,21.14194023
MED1,19.62258051,28.09548662,15.73599116
ATL1,5.878508643,29.48771166,32.77236252
ATL1,12.88661473,30.58220034,33.78639904