"","location","nitrate.conc","diameter_um"
"1","north sea",11.04,1.45
"2","north sea",14.91,3.76
"3","north sea",13.27,4.73
"4","north sea",15.55,5.32
"5","north sea",5.52,0.09
"7","north sea",14.42,5.02
"8","north sea",15.73,3.25
"9","north sea",9.85,2.51
"10","north sea",14.43,2.58
"11","north sea",20.57,1.56
"12","north sea",13.93,0.09
"13","north sea",14.33,2.65
"14","north sea",19.32,2.28
"15","north sea",5,2.14
"16","north sea",18,1.89
"17","north sea",12.19,0.48
"18","north sea",10.26,1.87
"19","north sea",11.04,1.34
"20","north sea",16.76,3.28
"21","north sea",8.11,4.29
"22","north sea",13.12,1.74
"23","north sea",12.89,1.63
"24","north sea",18.37,1.74
"25","north sea",8.34,4.02
"26","north sea",5.52,3.82
"27","north sea",12.83,2.1
"28","north sea",12.83,2.3
"29","north sea",12.42,2.47
"30","north sea",15.86,4.19
"31","north sea",13,0.76
"32","north sea",8.72,2.19
"33","north sea",10.83,4.39
"34","north sea",13.97,4.5
"35","north sea",9.76,5.22
"36","north sea",15.17,3.09
"37","north sea",11.73,5.22
"38","north sea",14.63,3.55
"39","north sea",12.27,3.12
"40","north sea",6.74,1.72
"41","north sea",1.84,3.97
"42","north sea",4.96,3.38
"43","north sea",14.2,3.83
"44","north sea",19.06,7.14
"45","north sea",15.79,2.03
"46","north sea",15.01,2.41
"47","north sea",14.18,1.92
"48","north sea",12.06,2.11
"49","north sea",14.13,0.75
"50","north sea",11.69,7.57
"51","north sea",13.79,1.97
"52","north sea",9.21,1.28
"53","north sea",17.08,1.85
"54","north sea",10.01,1.9
"55","north sea",17.93,0.49
"56","north sea",15.17,1.38
"57","north sea",9.49,4.82
"58","north sea",10.7,1
"59","north sea",16.05,2.31
"60","north sea",15.73,3.27
"61","north sea",14.55,3.13
"62","north sea",10.92,2.29
"63","north sea",3.46,1
"64","north sea",10.11,1.95
"65","north sea",11.28,3.99
"66","north sea",8.45,1.73
"67","north sea",13.08,7.23
"68","north sea",11.42,0.75
"69","north sea",14.63,3.06
"70","north sea",15.89,2.25
"71","north sea",16.65,3.93
"72","north sea",0.63,2.17
"73","north sea",7.19,2.48
"74","north sea",11.77,3.53
"75","north sea",6.66,1.83
"76","north sea",8.12,1.05
"77","north sea",14.31,2.83
"78","north sea",16.34,1.94
"79","north sea",9.79,2.36
"80","north sea",15.53,7.3
"81","north sea",7.57,4.83
"82","north sea",13.72,4.8
"83","north sea",11.72,3.39
"84","north sea",12.16,1.22
"85","north sea",20.4,0.72
"86","north sea",16.44,2.33
"87","north sea",11.82,4.3
"88","north sea",10.6,2.86
"89","north sea",15.79,3.4
"90","north sea",13.75,2.02
"91","north sea",8.26,4.36
"92","north sea",7.37,2.77
"93","north sea",12.95,4.49
"94","north sea",9.87,5.16
"95","north sea",11.51,3.68
"96","north sea",15.38,3.56
"98","north sea",14.48,1.79
"99","north sea",13.14,2.92
"100","north sea",13.62,3.68
"101","north sea",18.8,4.39
"102","north sea",7.59,0.87
"104","north sea",15,3.95
"105","north sea",8.67,2.11
"106","north sea",11.28,4.97
"107","north sea",7.23,3.68
"108","north sea",12.56,4.88
"109","north sea",0.84,2.96
"110","north sea",15.87,6.33
"111","north sea",12.86,2.53
"112","north sea",9.49,4.56
"113","north sea",15.53,4.45
"114","north sea",13.44,2.93
"115","north sea",14.79,2.36
"116","north sea",13.18,1.41
"118","north sea",14.82,2.08
"119","north sea",12.2,2.66
"120","north sea",4.85,2.23
"121","north sea",15.51,1.93
"122","north sea",16.13,1.37
"123","north sea",5.71,4.56
"124","north sea",10.21,2.53
"125","north sea",14.54,1.09
"126","north sea",6.68,3.19
"127","north sea",13.46,4.98
"128","north sea",17.64,0.36
"129","north sea",10.95,3.82
"130","north sea",7.51,1.48
"131","north sea",10.22,1.05
"132","north sea",15.04,3.63
"133","north sea",6.4,5.02
"134","north sea",7.45,3.72
"135","north sea",9.82,3.23
"136","north sea",17.67,0.22
"137","north sea",14.85,3.17
"138","north sea",10.91,8.38
"139","north sea",10.47,4.59
"140","north sea",8.48,3.25
"141","north sea",1.53,0.19
"142","north sea",16.41,1.8
"143","north sea",9.97,8.03
"144","north sea",12.84,2.75
"145","north sea",18.79,3.43
"146","north sea",9.94,1.61
"147","north sea",12.7,1.37
"148","north sea",13.27,0.02
"149","north sea",15.7,4.85
"150","north sea",12.36,1.72
"151","east med",5.59,2.91
"152","east med",4.54,1.89
"153","east med",9.82,1.21
"154","east med",7.15,2.02
"155","east med",12.58,3.03
"156","east med",2.84,0.73
"157","east med",1.66,4.18
"158","east med",5.48,4.01
"159","east med",8.69,0.38
"160","east med",6.64,1.46
"161","east med",0.67,2.46
"162","east med",9.89,0.08
"163","east med",6.53,0.7
"164","east med",4.27,7.25
"165","east med",10.24,2.56
"166","east med",10.97,0.49
"167","east med",-1.27,1.71
"168","east med",6.55,4.62
"169","east med",1.8,1.02
"170","east med",3.5,2.69
"171","east med",4.09,1.14
"172","east med",3.36,2.87
"173","east med",5.77,2.19
"174","east med",0,1.19
"175","east med",2.16,1
"176","east med",0.54,1.1
"177","east med",1.41,0.36
"178","east med",9.74,2.12
"179","east med",3.87,1.32
"180","east med",11.56,0.95
"181","east med",9.8,4.11
"182","east med",6.54,2.94
"183","east med",2.29,1.32
"184","east med",1.34,3.13
"185","east med",5.82,0.74
"186","east med",10.08,0.77
"187","east med",12.36,2.19
"188","east med",-2.6,1.47
"189","east med",8.7,1.29
"190","east med",11.74,0.35
"191","east med",2.49,3.75
"192","east med",-3.35,3.47
"193","east med",8.55,2.03
"194","east med",1.33,0.36
"195","east med",12.11,1.51
"196","east med",1.81,2.68
"197","east med",6.44,1.25
"198","east med",1.57,1.64
"199","east med",7.83,2.05
"200","east med",11.99,2.5
"201","east med",0.95,4.75
"202","east med",5.11,1.23
"203","east med",7.55,1.19
"204","east med",7.74,1.88
"205","east med",-1.86,0.68
"206","east med",0.47,1.59
"207","east med",3.66,0.12
"208","east med",6.54,0.05
"209","east med",7.58,1.5
"210","east med",6.85,0.9
"211","east med",2.33,0.96
"212","east med",2.65,0.2
"213","east med",4.88,4.01
"214","east med",10.65,0.09
"215","east med",9.64,1.24
"216","east med",-2.09,0.44
"217","east med",2.44,1.48
"218","east med",9.54,1.71
"219","east med",4.07,1.32
"220","east med",4.82,4.68
"221","east med",-1.45,0.63
"222","east med",3.32,3.03
"223","east med",7.02,0.56
"224","east med",6.11,0.39
"225","east med",6.44,2.44
"226","east med",2.07,0.71
"227","east med",1.42,0.03
"228","east med",10.89,1.59
"229","east med",11.79,3.21
"230","east med",-3.8,0.54
"231","east med",7.5,0.85
"232","east med",5.14,0.48
"233","east med",11.81,0.87
"234","east med",7.59,0.48
"235","east med",1.99,0.73
"236","east med",6.85,0.14
"237","east med",8.8,0.23
"238","east med",3.03,0.28
"239","east med",7.45,2.37
"240","east med",3.94,1.26
"241","east med",9.66,1.21
"242","east med",11.55,0.02
"243","east med",2.62,0.73
"244","east med",10.54,0.28
"245","east med",2.88,0.55
"246","east med",0.22,1.14
"247","east med",9.82,2.55
"248","east med",2.85,3.89
"249","east med",15.32,2.02
"250","east med",0.3,0.22
"251","east med",9.47,1.4
"252","east med",10.46,5.05
"253","east med",11.11,3.27
"254","east med",12.22,0.15
"255","east med",6.97,1.72
"256","east med",9.5,4.8
"257","east med",7.45,1.91
"258","east med",5.54,0.58
"260","east med",6.45,2.07
"261","east med",13.15,0.9
"262","east med",6.48,0.03
"263","east med",4.57,1.51
"264","east med",5.64,1.46
"265","east med",5.56,1.76
"266","east med",8.02,1.39
"267","east med",6.2,0.69
"268","east med",4.78,1.11
"269","east med",4.41,0.08
"270","east med",6.71,1.35
"271","east med",3.91,0.36
"272","east med",8.16,2.83
"273","east med",8.02,2.72
"274","east med",4.23,0.33
"275","east med",1.34,3.32
"276","east med",7.46,0.15
"277","east med",0.94,1.64
"278","east med",6.51,1.6
"279","east med",1.16,0.57
"280","east med",7.85,3.43
"281","east med",8.63,0.31
"283","east med",4.72,2.86
"285","east med",12.21,4.99
"286","east med",7.23,1
"287","east med",9.56,1.23
"288","east med",3.36,1.57
"289","east med",2.96,4.3
"290","east med",13.38,0.45
"291","east med",10.16,0.96
"292","east med",4.63,0.71
"293","east med",10.14,1.2
"294","east med",5.11,0.4
"295","east med",6.13,0.65
"296","east med",13.65,1.42
"297","east med",6.67,5.01
"298","east med",7.96,2.72
"299","east med",6.1,0.2
"300","east med",9.44,3.85
