location,nitrate.conc,diameter_um
north sea,11.04,1.45
north sea,14.91,3.76
north sea,13.27,4.73
north sea,15.55,5.32
north sea,5.52,0.09
north sea,NA,2.17
north sea,14.42,5.02
north sea,15.73,3.25
north sea,9.85,2.51
north sea,14.43,2.58
north sea,20.57,1.56
north sea,13.93,0.09
north sea,14.33,2.65
north sea,19.32,2.28
north sea,5.00,2.14
north sea,18.00,1.89
north sea,12.19,0.48
north sea,10.26,1.87
north sea,11.04,1.34
north sea,16.76,3.28
north sea,8.11,4.29
north sea,13.12,1.74
north sea,12.89,1.63
north sea,18.37,1.74
north sea,8.34,4.02
north sea,5.52,3.82
north sea,12.83,2.10
north sea,12.83,2.30
north sea,12.42,2.47
north sea,15.86,4.19
north sea,13.00,0.76
north sea,8.72,2.19
north sea,10.83,4.39
north sea,13.97,4.50
north sea,9.76,5.22
north sea,15.17,3.09
north sea,11.73,5.22
north sea,14.63,3.55
north sea,12.27,3.12
north sea,6.74,1.72
north sea,1.84,3.97
north sea,4.96,3.38
north sea,14.20,3.83
north sea,19.06,7.14
north sea,15.79,2.03
north sea,15.01,2.41
north sea,14.18,1.92
north sea,12.06,2.11
north sea,14.13,0.75
north sea,11.69,7.57
north sea,13.79,1.97
north sea,9.21,1.28
north sea,17.08,1.85
north sea,10.01,1.90
north sea,17.93,0.49
north sea,15.17,1.38
north sea,9.49,4.82
north sea,10.70,1.00
north sea,16.05,2.31
north sea,15.73,3.27
north sea,14.55,3.13
north sea,10.92,2.29
north sea,3.46,1.00
north sea,10.11,1.95
north sea,11.28,3.99
north sea,8.45,1.73
north sea,13.08,7.23
north sea,11.42,0.75
north sea,14.63,3.06
north sea,15.89,2.25
north sea,16.65,3.93
north sea,0.63,2.17
north sea,7.19,2.48
north sea,11.77,3.53
north sea,6.66,1.83
north sea,8.12,1.05
north sea,14.31,2.83
north sea,16.34,1.94
north sea,9.79,2.36
north sea,15.53,7.30
north sea,7.57,4.83
north sea,13.72,4.80
north sea,11.72,3.39
north sea,12.16,1.22
north sea,20.40,0.72
north sea,16.44,2.33
north sea,11.82,4.30
north sea,10.60,2.86
north sea,15.79,3.40
north sea,13.75,2.02
north sea,8.26,4.36
north sea,7.37,2.77
north sea,12.95,4.49
north sea,9.87,5.16
north sea,11.51,3.68
north sea,15.38,3.56
north sea,NA,6.59
north sea,14.48,1.79
north sea,13.14,2.92
north sea,13.62,3.68
north sea,18.80,4.39
north sea,7.59,0.87
north sea,NA,0.06
north sea,15.00,3.95
north sea,8.67,2.11
north sea,11.28,4.97
north sea,7.23,3.68
north sea,12.56,4.88
north sea,0.84,2.96
north sea,15.87,6.33
north sea,12.86,2.53
north sea,9.49,4.56
north sea,15.53,4.45
north sea,13.44,2.93
north sea,14.79,2.36
north sea,13.18,1.41
north sea,NA,1.78
north sea,14.82,2.08
north sea,12.20,2.66
north sea,4.85,2.23
north sea,15.51,1.93
north sea,16.13,1.37
north sea,5.71,4.56
north sea,10.21,2.53
north sea,14.54,1.09
north sea,6.68,3.19
north sea,13.46,4.98
north sea,17.64,0.36
north sea,10.95,3.82
north sea,7.51,1.48
north sea,10.22,1.05
north sea,15.04,3.63
north sea,6.40,5.02
north sea,7.45,3.72
north sea,9.82,3.23
north sea,17.67,0.22
north sea,14.85,3.17
north sea,10.91,8.38
north sea,10.47,4.59
north sea,8.48,3.25
north sea,1.53,0.19
north sea,16.41,1.80
north sea,9.97,8.03
north sea,12.84,2.75
north sea,18.79,3.43
north sea,9.94,1.61
north sea,12.70,1.37
north sea,13.27,0.02
north sea,15.70,4.85
north sea,12.36,1.72
east med,5.59,2.91
east med,4.54,1.89
east med,9.82,1.21
east med,7.15,2.02
east med,12.58,3.03
east med,2.84,0.73
east med,1.66,4.18
east med,5.48,4.01
east med,8.69,0.38
east med,6.64,1.46
east med,0.67,2.46
east med,9.89,0.08
east med,6.53,0.70
east med,4.27,7.25
east med,10.24,2.56
east med,10.97,0.49
east med,-1.27,1.71
east med,6.55,4.62
east med,1.80,1.02
east med,3.50,2.69
east med,4.09,1.14
east med,3.36,2.87
east med,5.77,2.19
east med,0.00,1.19
east med,2.16,1.00
east med,0.54,1.10
east med,1.41,0.36
east med,9.74,2.12
east med,3.87,1.32
east med,11.56,0.95
east med,9.80,4.11
east med,6.54,2.94
east med,2.29,1.32
east med,1.34,3.13
east med,5.82,0.74
east med,10.08,0.77
east med,12.36,2.19
east med,-2.60,1.47
east med,8.70,1.29
east med,11.74,0.35
east med,2.49,3.75
east med,-3.35,3.47
east med,8.55,2.03
east med,1.33,0.36
east med,12.11,1.51
east med,1.81,2.68
east med,6.44,1.25
east med,1.57,1.64
east med,7.83,2.05
east med,11.99,2.50
east med,0.95,4.75
east med,5.11,1.23
east med,7.55,1.19
east med,7.74,1.88
east med,-1.86,0.68
east med,0.47,1.59
east med,3.66,0.12
east med,6.54,0.05
east med,7.58,1.50
east med,6.85,0.90
east med,2.33,0.96
east med,2.65,0.20
east med,4.88,4.01
east med,10.65,0.09
east med,9.64,1.24
east med,-2.09,0.44
east med,2.44,1.48
east med,9.54,1.71
east med,4.07,1.32
east med,4.82,4.68
east med,-1.45,0.63
east med,3.32,3.03
east med,7.02,0.56
east med,6.11,0.39
east med,6.44,2.44
east med,2.07,0.71
east med,1.42,0.03
east med,10.89,1.59
east med,11.79,3.21
east med,-3.80,0.54
east med,7.50,0.85
east med,5.14,0.48
east med,11.81,0.87
east med,7.59,0.48
east med,1.99,0.73
east med,6.85,0.14
east med,8.80,0.23
east med,3.03,0.28
east med,7.45,2.37
east med,3.94,1.26
east med,9.66,1.21
east med,11.55,0.02
east med,2.62,0.73
east med,10.54,0.28
east med,2.88,0.55
east med,0.22,1.14
east med,9.82,2.55
east med,2.85,3.89
east med,15.32,2.02
east med,0.30,0.22
east med,9.47,1.40
east med,10.46,5.05
east med,11.11,3.27
east med,12.22,0.15
east med,6.97,1.72
east med,9.50,4.80
east med,7.45,1.91
east med,5.54,0.58
east med,NA,1.10
east med,6.45,2.07
east med,13.15,0.90
east med,6.48,0.03
east med,4.57,1.51
east med,5.64,1.46
east med,5.56,1.76
east med,8.02,1.39
east med,6.20,0.69
east med,4.78,1.11
east med,4.41,0.08
east med,6.71,1.35
east med,3.91,0.36
east med,8.16,2.83
east med,8.02,2.72
east med,4.23,0.33
east med,1.34,3.32
east med,7.46,0.15
east med,0.94,1.64
east med,6.51,1.60
east med,1.16,0.57
east med,7.85,3.43
east med,8.63,0.31
east med,NA,0.92
east med,4.72,2.86
east med,NA,0.40
east med,12.21,4.99
east med,7.23,1.00
east med,9.56,1.23
east med,3.36,1.57
east med,2.96,4.30
east med,13.38,0.45
east med,10.16,0.96
east med,4.63,0.71
east med,10.14,1.20
east med,5.11,0.40
east med,6.13,0.65
east med,13.65,1.42
east med,6.67,5.01
east med,7.96,2.72
east med,6.10,0.20
east med,9.44,3.85