[
  {
    "id": "minivan_hs_rev1",
    "config": {
      "vendorId": "0xFEAE",
      "productId": "0x8847",
      "deviceVersion": "0x0001",
      "manufacturer": "TheVan Keyboards",
      "product": "MiniVan",
      "description": "Hotswap MiniVan 40%",
      "matrixRowPins": {
        "0": "D7",
        "1": "B5",
        "2": "F7",
        "3": "D4"
      },
      "matrixColumnPins": {
        "0": "D2",
        "1": "D3",
        "2": "D5",
        "3": "D6",
        "4": "B4",
        "5": "B6",
        "6": "F6",
        "7": "F5",
        "8": "F4",
        "9": "F1",
        "10": "F0",
        "11": "B3"
      },
      "diodeDirection": "COL2ROW",
      "matrixHasGhost": false,
      "backlightLevels": 1,
      "backlightPin": "B7",
      "usbMaxPowerConsumption": 100,
      "debouncingDelay": 5,
      "tappingTerm": 175,
      "lockingSupportEnabled": true,
      "lockingResyncEnabled": true,
      "commandKeyCombination": "keyboard_report->mods == (MOD_BIT(KC_LSHIFT) | MOD_BIT(KC_RSHIFT))",
      "debugEnabled": true,
      "printEnabled": true,
      "actionLayerEnabled": true,
      "actionTappingEnabled": true,
      "actionOneShotEnabled": true,
      "actionMacroEnabled": true,
      "actionFunctionEnabled": true,
      "rgbDiPin": "D0",
      "rgbLedNum": 3,
      "permissiveHold": true
    },
    "rules": {
      "mcu": "atmega32u4",
      "processorFrequency": 16000000,
      "architecture": "AVR8",
      "inputClockFrequency": 16000000,
      "bootloaderSize": 4096,
      "bootmagicEnabled": true,
      "mousekeyEnabled": true,
      "extrakeyEnabled": true,
      "consoleEnabled": true,
      "commandEnabled": true,
      "sleepLedEnabled": false,
      "nkroEnabled": true,
      "backlightEnabled": false,
      "rgbLightEnabled": true
    },
    "indicators": {
      "0": {
        "0": {
          "red": 218,
          "green": 23,
          "blue": 180,
          "action": "power",
          "type": "power"
        },
        "1": {
          "red": 215,
          "green": 30,
          "blue": 125,
          "action": "L3",
          "type": "layer"
        }
      },
      "1": {
        "0": {
          "red": 32,
          "green": 104,
          "blue": 255,
          "action": "L3",
          "type": "layer"
        }
      },
      "2": {
        "0": {
          "red": 10,
          "green": 255,
          "blue": 125,
          "action": "L3",
          "type": "layer"
        }
      }
    },
    "configKeymap": {
      "keys": {
        "0": "K00",
        "1": "K01",
        "2": "K02",
        "3": "K03",
        "4": "K04",
        "5": "K05",
        "6": "K06",
        "7": "K07",
        "8": "K08",
        "9": "K09",
        "10": "K0A",
        "11": "K0B",
        "12": "K10",
        "13": "K11",
        "14": "K12",
        "15": "K13",
        "16": "K14",
        "17": "K15",
        "18": "K16",
        "19": "K17",
        "20": "K18",
        "21": "K19",
        "22": "K1A",
        "23": "K1B",
        "24": "K20",
        "25": "K21",
        "26": "K22",
        "27": "K23",
        "28": "K24",
        "29": "K25",
        "30": "K26",
        "31": "K27",
        "32": "K28",
        "33": "K29",
        "34": "K2A",
        "35": "K2B",
        "36": "K30",
        "37": "K31",
        "38": "K32",
        "39": "K34",
        "40": "K33",
        "41": "K37",
        "42": "K38",
        "43": "K39",
        "44": "K3A",
        "45": "K3B"
      },
      "positions": {
        "0": {
          "0": "K00",
          "1": "K01",
          "2": "K02",
          "3": "K03",
          "4": "K04",
          "5": "K05",
          "6": "K06",
          "7": "K07",
          "8": "K08",
          "9": "K09",
          "10": "K0A",
          "11": "K0B"
        },
        "1": {
          "0": "K10",
          "1": "K11",
          "2": "K12",
          "3": "K13",
          "4": "K14",
          "5": "K15",
          "6": "K16",
          "7": "K17",
          "8": "K18",
          "9": "K19",
          "10": "K1A",
          "11": "K1B"
        },
        "2": {
          "0": "K20",
          "1": "K21",
          "2": "K22",
          "3": "K23",
          "4": "K24",
          "5": "K25",
          "6": "K26",
          "7": "K27",
          "8": "K28",
          "9": "K29",
          "10": "K2A",
          "11": "K2B"
        },
        "3": {
          "0": "K30",
          "1": "K31",
          "2": "K32",
          "3": "K33",
          "4": "K34",
          "5": "KC_NO",
          "6": "KC_NO",
          "7": "K37",
          "8": "K38",
          "9": "K39",
          "10": "K3A",
          "11": "K3B"
        }
      }
    },
    "zones": {
      "0": {
        "label": "Left Hand",
        "value": 1,
        "choices": {
          "0": {
            "code": 0,
            "name": "Standard"
          },
          "1": {
            "code": 1,
            "name": "South Paw"
          }
        }
      },
      "1": {
        "label": "Right Hand",
        "value": 1,
        "choices": {
          "0": {
            "code": 0,
            "name": "Standard"
          },
          "1": {
            "code": 1,
            "name": "Arrow"
          }
        }
      }
    },
    "keySections": {
      "0": {
        "row1": {
          "0": {
            "id": "k00",
            "value": "TAB",
            "type": "normal",
            "secondary": {},
            "showMenu": false,
            "shape": "k100"
          },
          "1": {
            "id": "k01",
            "value": "Q",
            "type": "normal",
            "secondary": {},
            "showMenu": false,
            "shape": "k100"
          },
          "2": {
            "id": "k02",
            "value": "W",
            "type": "normal",
            "secondary": {},
            "showMenu": false,
            "shape": "k100"
          },
          "3": {
            "id": "k03",
            "value": "E",
            "type": "normal",
            "secondary": {},
            "showMenu": false,
            "shape": "k100"
          },
          "4": {
            "id": "k04",
            "value": "R",
            "type": "normal",
            "secondary": {},
            "showMenu": false,
            "shape": "k100"
          },
          "5": {
            "id": "k05",
            "value": "T",
            "type": "normal",
            "secondary": {},
            "showMenu": false,
            "shape": "k100"
          },
          "6": {
            "id": "k06",
            "value": "Y",
            "type": "normal",
            "secondary": {},
            "showMenu": false,
            "shape": "k100"
          },
          "7": {
            "id": "k07",
            "value": "U",
            "type": "normal",
            "secondary": {},
            "showMenu": false,
            "shape": "k100"
          },
          "8": {
            "id": "k08",
            "value": "I",
            "type": "normal",
            "secondary": {},
            "showMenu": false,
            "shape": "k100"
          },
          "9": {
            "id": "k09",
            "value": "O",
            "type": "normal",
            "secondary": {},
            "showMenu": false,
            "shape": "k100"
          },
          "10": {
            "id": "k0A",
            "value": "P",
            "type": "normal",
            "secondary": {},
            "showMenu": false,
            "shape": "k100"
          },
          "11": {
            "id": "k0B",
            "value": "BSPC",
            "type": "normal",
            "secondary": {},
            "showMenu": false,
            "shape": "k175"
          }
        },
        "row2": {
          "0": {
            "id": "k10",
            "value": "ESC",
            "type": "tapkey",
            "secondary": "L1",
            "showMenu": false,
            "shape": "k125"
          },
          "1": {
            "id": "k11",
            "value": "A",
            "type": "normal",
            "secondary": {},
            "showMenu": false,
            "shape": "k100"
          },
          "2": {
            "id": "k12",
            "value": "S",
            "type": "normal",
            "secondary": {},
            "showMenu": false,
            "shape": "k100"
          },
          "3": {
            "id": "k13",
            "value": "D",
            "type": "normal",
            "secondary": {},
            "showMenu": false,
            "shape": "k100"
          },
          "4": {
            "id": "k14",
            "value": "F",
            "type": "normal",
            "secondary": {},
            "showMenu": false,
            "shape": "k100"
          },
          "5": {
            "id": "k15",
            "value": "G",
            "type": "normal",
            "secondary": {},
            "showMenu": false,
            "shape": "k100"
          },
          "6": {
            "id": "k16",
            "value": "H",
            "type": "normal",
            "secondary": {},
            "showMenu": false,
            "shape": "k100"
          },
          "7": {
            "id": "k17",
            "value": "J",
            "type": "normal",
            "secondary": {},
            "showMenu": false,
            "shape": "k100"
          },
          "8": {
            "id": "k18",
            "value": "K",
            "type": "normal",
            "secondary": {},
            "showMenu": false,
            "shape": "k100"
          },
          "9": {
            "id": "k19",
            "value": "L",
            "type": "normal",
            "secondary": {},
            "showMenu": false,
            "shape": "k100"
          },
          "10": {
            "id": "k1A",
            "value": "SCLN",
            "type": "normal",
            "secondary": {},
            "showMenu": false,
            "shape": "k100"
          },
          "11": {
            "id": "k1B",
            "value": "QUOT",
            "type": "tapkey",
            "secondary": "L1",
            "showMenu": false,
            "shape": "k150"
          }
        },
        "row3": {
          "0": {
            "id": "k20",
            "value": "LSFT",
            "type": "normal",
            "secondary": {},
            "showMenu": false,
            "shape": "k175"
          },
          "1": {
            "id": "k21",
            "value": "Z",
            "type": "normal",
            "secondary": {},
            "showMenu": false,
            "shape": "k100"
          },
          "2": {
            "id": "k22",
            "value": "X",
            "type": "normal",
            "secondary": {},
            "showMenu": false,
            "shape": "k100"
          },
          "3": {
            "id": "k23",
            "value": "C",
            "type": "normal",
            "secondary": {},
            "showMenu": false,
            "shape": "k100"
          },
          "4": {
            "id": "k24",
            "value": "V",
            "type": "normal",
            "secondary": {},
            "showMenu": false,
            "shape": "k100"
          },
          "5": {
            "id": "k25",
            "value": "B",
            "type": "normal",
            "secondary": {},
            "showMenu": false,
            "shape": "k100"
          },
          "6": {
            "id": "k26",
            "value": "N",
            "type": "normal",
            "secondary": {},
            "showMenu": false,
            "shape": "k100"
          },
          "7": {
            "id": "k27",
            "value": "M",
            "type": "normal",
            "secondary": {},
            "showMenu": false,
            "shape": "k100"
          },
          "8": {
            "id": "k28",
            "value": "COMM",
            "type": "normal",
            "secondary": {},
            "showMenu": false,
            "shape": "k100"
          },
          "9": {
            "id": "k29",
            "value": "DOT",
            "type": "normal",
            "secondary": {},
            "showMenu": false,
            "shape": "k100"
          },
          "10": {
            "id": "k2A",
            "value": "SLSH",
            "type": "normal",
            "secondary": {},
            "showMenu": false,
            "shape": "k100"
          },
          "11": {
            "id": "k2B",
            "value": "L2",
            "type": "momentary",
            "secondary": {},
            "showMenu": false,
            "shape": "k100"
          }
        },
        "leftHand": {
          "0": {
            "0": {
              "id": "k30",
              "value": "LCTL",
              "type": "normal",
              "secondary": {},
              "showMenu": false,
              "shape": "k125",
              "zone": "Left Hand"
            },
            "1": {
              "id": "k31",
              "value": "L2",
              "type": "momentary",
              "secondary": {},
              "showMenu": false,
              "shape": "k150",
              "zone": "Left Hand"
            },
            "2": {
              "id": "k32",
              "value": "LGUI",
              "type": "normal",
              "secondary": {},
              "showMenu": false,
              "shape": "k125",
              "zone": "Left Hand"
            },
            "3": {
              "id": "k34",
              "value": "NO",
              "type": "nodisplay"
            }
          },
          "1": {
            "0": {
              "id": "k30",
              "value": "LCTL",
              "type": "normal",
              "secondary": {},
              "showMenu": false,
              "shape": "k100",
              "zone": "Left Hand"
            },
            "1": {
              "id": "k31",
              "value": "L2",
              "type": "momentary",
              "secondary": {},
              "showMenu": false,
              "shape": "k100",
              "zone": "Left Hand"
            },
            "2": {
              "id": "k32",
              "value": "LALT",
              "type": "normal",
              "secondary": {},
              "showMenu": false,
              "shape": "k100",
              "zone": "Left Hand"
            },
            "3": {
              "id": "k34",
              "value": "LGUI",
              "type": "normal",
              "secondary": {},
              "showMenu": false,
              "shape": "k100",
              "zone": "Left Hand"
            }
          }
        },
        "row4": {
          "0": {
            "id": "k33",
            "value": "ENT",
            "type": "normal",
            "secondary": {},
            "showMenu": false,
            "shape": "k225"
          },
          "1": {
            "id": "k37",
            "value": "SPC",
            "type": "normal",
            "secondary": {},
            "showMenu": false,
            "shape": "k200"
          }
        },
        "rightHand": {
          "0": {
            "0": {
              "id": "k38",
              "value": "RALT",
              "type": "normal",
              "secondary": {},
              "showMenu": false,
              "shape": "k125",
              "zone": "Right Hand"
            },
            "1": {
              "id": "k39",
              "value": "RSFT",
              "type": "normal",
              "secondary": {},
              "showMenu": false,
              "shape": "k150",
              "zone": "Right Hand"
            },
            "2": {
              "id": "k3A",
              "value": "NO",
              "type": "nodisplay"
            },
            "3": {
              "id": "k3B",
              "value": "L3",
              "type": "toggle",
              "secondary": {},
              "showMenu": false,
              "shape": "k175",
              "zone": "Right Hand"
            }
          },
          "1": {
            "0": {
              "id": "k38",
              "value": "RALT",
              "type": "normal",
              "secondary": {},
              "showMenu": false,
              "shape": "k150",
              "zone": "Right Hand"
            },
            "1": {
              "id": "k39",
              "value": "RSFT",
              "type": "normal",
              "secondary": {},
              "showMenu": false,
              "shape": "k100",
              "zone": "Right Hand"
            },
            "2": {
              "id": "k3A",
              "value": "RCTL",
              "type": "normal",
              "secondary": {},
              "showMenu": false,
              "shape": "k100",
              "zone": "Right Hand"
            },
            "3": {
              "id": "k3B",
              "value": "L3",
              "type": "toggle",
              "secondary": {},
              "showMenu": false,
              "shape": "k100",
              "zone": "Right Hand"
            }
          }
        }
      },
      "1": {
        "row1": {
          "0": {
            "id": "k00",
            "value": "GRV",
            "type": "normal",
            "secondary": {},
            "showMenu": false,
            "shape": "k100"
          },
          "1": {
            "id": "k01",
            "value": "EXLM",
            "type": "normal",
            "secondary": {},
            "showMenu": false,
            "shape": "k100"
          },
          "2": {
            "id": "k02",
            "value": "AT",
            "type": "normal",
            "secondary": {},
            "showMenu": false,
            "shape": "k100"
          },
          "3": {
            "id": "k03",
            "value": "HASH",
            "type": "normal",
            "secondary": {},
            "showMenu": false,
            "shape": "k100"
          },
          "4": {
            "id": "k04",
            "value": "DLR",
            "type": "normal",
            "secondary": {},
            "showMenu": false,
            "shape": "k100"
          },
          "5": {
            "id": "k05",
            "value": "PERC",
            "type": "normal",
            "secondary": {},
            "showMenu": false,
            "shape": "k100"
          },
          "6": {
            "id": "k06",
            "value": "CIRC",
            "type": "normal",
            "secondary": {},
            "showMenu": false,
            "shape": "k100"
          },
          "7": {
            "id": "k07",
            "value": "AMPR",
            "type": "normal",
            "secondary": {},
            "showMenu": false,
            "shape": "k100"
          },
          "8": {
            "id": "k08",
            "value": "ASTR",
            "type": "normal",
            "secondary": {},
            "showMenu": false,
            "shape": "k100"
          },
          "9": {
            "id": "k09",
            "value": "LPRN",
            "type": "normal",
            "secondary": {},
            "showMenu": false,
            "shape": "k100"
          },
          "10": {
            "id": "k0A",
            "value": "RPRN",
            "type": "normal",
            "secondary": {},
            "showMenu": false,
            "shape": "k100"
          },
          "11": {
            "id": "k0B",
            "value": "DEL",
            "type": "normal",
            "secondary": {},
            "showMenu": false,
            "shape": "k175"
          }
        },
        "row2": {
          "0": {
            "id": "k10",
            "value": "TRNS",
            "type": "normal",
            "secondary": {},
            "showMenu": false,
            "shape": "k125"
          },
          "1": {
            "id": "k11",
            "value": "BSLS",
            "type": "normal",
            "secondary": {},
            "showMenu": false,
            "shape": "k100"
          },
          "2": {
            "id": "k12",
            "value": "QUOT",
            "type": "normal",
            "secondary": {},
            "showMenu": false,
            "shape": "k100"
          },
          "3": {
            "id": "k13",
            "value": "MINS",
            "type": "normal",
            "secondary": {},
            "showMenu": false,
            "shape": "k100"
          },
          "4": {
            "id": "k14",
            "value": "EQL",
            "type": "normal",
            "secondary": {},
            "showMenu": false,
            "shape": "k100"
          },
          "5": {
            "id": "k15",
            "value": "LBRC",
            "type": "normal",
            "secondary": {},
            "showMenu": false,
            "shape": "k100"
          },
          "6": {
            "id": "k16",
            "value": "RBRC",
            "type": "normal",
            "secondary": {},
            "showMenu": false,
            "shape": "k100"
          },
          "7": {
            "id": "k17",
            "value": "DOWN",
            "type": "normal",
            "secondary": {},
            "showMenu": false,
            "shape": "k100"
          },
          "8": {
            "id": "k18",
            "value": "UP",
            "type": "normal",
            "secondary": {},
            "showMenu": false,
            "shape": "k100"
          },
          "9": {
            "id": "k19",
            "value": "LEFT",
            "type": "normal",
            "secondary": {},
            "showMenu": false,
            "shape": "k100"
          },
          "10": {
            "id": "k1A",
            "value": "RIGHT",
            "type": "normal",
            "secondary": {},
            "showMenu": false,
            "shape": "k100"
          },
          "11": {
            "id": "k1B",
            "value": "TRNS",
            "type": "normal",
            "secondary": {},
            "showMenu": false,
            "shape": "k150"
          }
        },
        "row3": {
          "0": {
            "id": "k20",
            "value": "TRNS",
            "type": "normal",
            "secondary": {},
            "showMenu": false,
            "shape": "k175"
          },
          "1": {
            "id": "k21",
            "value": "ESC",
            "type": "normal",
            "secondary": {},
            "showMenu": false,
            "shape": "k100"
          },
          "2": {
            "id": "k22",
            "value": "BL_STEP",
            "type": "normal",
            "secondary": {},
            "showMenu": false,
            "shape": "k100"
          },
          "3": {
            "id": "k23",
            "value": "PSCR",
            "type": "normal",
            "secondary": {},
            "showMenu": false,
            "shape": "k100"
          },
          "4": {
            "id": "k24",
            "value": "TRNS",
            "type": "normal",
            "secondary": {},
            "showMenu": false,
            "shape": "k100"
          },
          "5": {
            "id": "k25",
            "value": "TRNS",
            "type": "normal",
            "secondary": {},
            "showMenu": false,
            "shape": "k100"
          },
          "6": {
            "id": "k26",
            "value": "TRNS",
            "type": "normal",
            "secondary": {},
            "showMenu": false,
            "shape": "k100"
          },
          "7": {
            "id": "k27",
            "value": "MSTP",
            "type": "normal",
            "secondary": {},
            "showMenu": false,
            "shape": "k100"
          },
          "8": {
            "id": "k28",
            "value": "MPLY",
            "type": "normal",
            "secondary": {},
            "showMenu": false,
            "shape": "k100"
          },
          "9": {
            "id": "k29",
            "value": "MPRV",
            "type": "normal",
            "secondary": {},
            "showMenu": false,
            "shape": "k100"
          },
          "10": {
            "id": "k2A",
            "value": "MNXT",
            "type": "normal",
            "secondary": {},
            "showMenu": false,
            "shape": "k100"
          },
          "11": {
            "id": "k2B",
            "value": "TRNS",
            "type": "normal",
            "secondary": {},
            "showMenu": false,
            "shape": "k100"
          }
        },
        "leftHand": {
          "0": {
            "0": {
              "id": "k30",
              "value": "TRNS",
              "type": "normal",
              "secondary": {},
              "showMenu": false,
              "shape": "k125"
            },
            "1": {
              "id": "k31",
              "value": "TRNS",
              "type": "normal",
              "secondary": {},
              "showMenu": false,
              "shape": "k150"
            },
            "2": {
              "id": "k32",
              "value": "TRNS",
              "type": "normal",
              "secondary": {},
              "showMenu": false,
              "shape": "k125"
            },
            "3": {
              "id": "k34",
              "value": "NO",
              "type": "nodisplay"
            }
          },
          "1": {
            "0": {
              "id": "k30",
              "value": "TRNS",
              "type": "normal",
              "secondary": {},
              "showMenu": false,
              "shape": "k100"
            },
            "1": {
              "id": "k31",
              "value": "TRNS",
              "type": "normal",
              "secondary": {},
              "showMenu": false,
              "shape": "k100"
            },
            "2": {
              "id": "k32",
              "value": "TRNS",
              "type": "normal",
              "secondary": {},
              "showMenu": false,
              "shape": "k100"
            },
            "3": {
              "id": "k34",
              "value": "TRNS",
              "type": "normal",
              "secondary": {},
              "showMenu": false,
              "shape": "k100"
            }
          }
        },
        "row4": {
          "0": {
            "id": "k33",
            "value": "TRNS",
            "type": "normal",
            "secondary": {},
            "showMenu": false,
            "shape": "k225"
          },
          "1": {
            "id": "k37",
            "value": "TRNS",
            "type": "normal",
            "secondary": {},
            "showMenu": false,
            "shape": "k200"
          }
        },
        "rightHand": {
          "0": {
            "0": {
              "id": "k38",
              "value": "TRNS",
              "type": "normal",
              "secondary": {},
              "showMenu": false,
              "shape": "k125"
            },
            "1": {
              "id": "k39",
              "value": "TRNS",
              "type": "normal",
              "secondary": {},
              "showMenu": false,
              "shape": "k150"
            },
            "2": {
              "id": "k3A",
              "value": "NO",
              "type": "nodisplay"
            },
            "3": {
              "id": "k3B",
              "value": "RESET",
              "type": "normal",
              "secondary": {},
              "showMenu": false,
              "shape": "k175"
            }
          },
          "1": {
            "0": {
              "id": "k38",
              "value": "TRNS",
              "type": "normal",
              "secondary": {},
              "showMenu": false,
              "shape": "k150"
            },
            "1": {
              "id": "k39",
              "value": "TRNS",
              "type": "normal",
              "secondary": {},
              "showMenu": false,
              "shape": "k100"
            },
            "2": {
              "id": "k3A",
              "value": "TRNS",
              "type": "normal",
              "secondary": {},
              "showMenu": false,
              "shape": "k100"
            },
            "3": {
              "id": "k3B",
              "value": "RESET",
              "type": "normal",
              "secondary": {},
              "showMenu": false,
              "shape": "k100"
            }
          }
        }
      },
      "2": {
        "row1": {
          "0": {
            "id": "k00",
            "value": "TILD",
            "type": "normal",
            "secondary": {},
            "showMenu": false,
            "shape": "k100"
          },
          "1": {
            "id": "k01",
            "value": "1",
            "type": "normal",
            "secondary": {},
            "showMenu": false,
            "shape": "k100"
          },
          "2": {
            "id": "k02",
            "value": "2",
            "type": "normal",
            "secondary": {},
            "showMenu": false,
            "shape": "k100"
          },
          "3": {
            "id": "k03",
            "value": "3",
            "type": "normal",
            "secondary": {},
            "showMenu": false,
            "shape": "k100"
          },
          "4": {
            "id": "k04",
            "value": "4",
            "type": "normal",
            "secondary": {},
            "showMenu": false,
            "shape": "k100"
          },
          "5": {
            "id": "k05",
            "value": "5",
            "type": "normal",
            "secondary": {},
            "showMenu": false,
            "shape": "k100"
          },
          "6": {
            "id": "k06",
            "value": "6",
            "type": "normal",
            "secondary": {},
            "showMenu": false,
            "shape": "k100"
          },
          "7": {
            "id": "k07",
            "value": "7",
            "type": "normal",
            "secondary": {},
            "showMenu": false,
            "shape": "k100"
          },
          "8": {
            "id": "k08",
            "value": "8",
            "type": "normal",
            "secondary": {},
            "showMenu": false,
            "shape": "k100"
          },
          "9": {
            "id": "k09",
            "value": "9",
            "type": "normal",
            "secondary": {},
            "showMenu": false,
            "shape": "k100"
          },
          "10": {
            "id": "k0A",
            "value": "0",
            "type": "normal",
            "secondary": {},
            "showMenu": false,
            "shape": "k100"
          },
          "11": {
            "id": "k0B",
            "value": "TRNS",
            "type": "normal",
            "secondary": {},
            "showMenu": false,
            "shape": "k175"
          }
        },
        "row2": {
          "0": {
            "id": "k10",
            "value": "ESC",
            "type": "normal",
            "secondary": {},
            "showMenu": false,
            "shape": "k125"
          },
          "1": {
            "id": "k11",
            "value": "PIPE",
            "type": "normal",
            "secondary": {},
            "showMenu": false,
            "shape": "k100"
          },
          "2": {
            "id": "k12",
            "value": "DQT",
            "type": "normal",
            "secondary": {},
            "showMenu": false,
            "shape": "k100"
          },
          "3": {
            "id": "k13",
            "value": "UNDS",
            "type": "normal",
            "secondary": {},
            "showMenu": false,
            "shape": "k100"
          },
          "4": {
            "id": "k14",
            "value": "PLUS",
            "type": "normal",
            "secondary": {},
            "showMenu": false,
            "shape": "k100"
          },
          "5": {
            "id": "k15",
            "value": "LCBR",
            "type": "normal",
            "secondary": {},
            "showMenu": false,
            "shape": "k100"
          },
          "6": {
            "id": "k16",
            "value": "RCBR",
            "type": "normal",
            "secondary": {},
            "showMenu": false,
            "shape": "k100"
          },
          "7": {
            "id": "k17",
            "value": "4",
            "type": "normal",
            "secondary": {},
            "showMenu": false,
            "shape": "k100"
          },
          "8": {
            "id": "k18",
            "value": "5",
            "type": "normal",
            "secondary": {},
            "showMenu": false,
            "shape": "k100"
          },
          "9": {
            "id": "k19",
            "value": "6",
            "type": "normal",
            "secondary": {},
            "showMenu": false,
            "shape": "k100"
          },
          "10": {
            "id": "k1A",
            "value": "VOLU",
            "type": "normal",
            "secondary": {},
            "showMenu": false,
            "shape": "k100"
          },
          "11": {
            "id": "k1B",
            "value": "TRNS",
            "type": "normal",
            "secondary": {},
            "showMenu": false,
            "shape": "k150"
          }
        },
        "row3": {
          "0": {
            "id": "k20",
            "value": "TRNS",
            "type": "normal",
            "secondary": {},
            "showMenu": false,
            "shape": "k175"
          },
          "1": {
            "id": "k21",
            "value": "TRNS",
            "type": "normal",
            "secondary": {},
            "showMenu": false,
            "shape": "k100"
          },
          "2": {
            "id": "k22",
            "value": "TRNS",
            "type": "normal",
            "secondary": {},
            "showMenu": false,
            "shape": "k100"
          },
          "3": {
            "id": "k23",
            "value": "TRNS",
            "type": "normal",
            "secondary": {},
            "showMenu": false,
            "shape": "k100"
          },
          "4": {
            "id": "k24",
            "value": "TRNS",
            "type": "normal",
            "secondary": {},
            "showMenu": false,
            "shape": "k100"
          },
          "5": {
            "id": "k25",
            "value": "TRNS",
            "type": "normal",
            "secondary": {},
            "showMenu": false,
            "shape": "k100"
          },
          "6": {
            "id": "k26",
            "value": "0",
            "type": "normal",
            "secondary": {},
            "showMenu": false,
            "shape": "k100"
          },
          "7": {
            "id": "k27",
            "value": "1",
            "type": "normal",
            "secondary": {},
            "showMenu": false,
            "shape": "k100"
          },
          "8": {
            "id": "k28",
            "value": "2",
            "type": "normal",
            "secondary": {},
            "showMenu": false,
            "shape": "k100"
          },
          "9": {
            "id": "k29",
            "value": "3",
            "type": "normal",
            "secondary": {},
            "showMenu": false,
            "shape": "k100"
          },
          "10": {
            "id": "k2A",
            "value": "VOLD",
            "type": "normal",
            "secondary": {},
            "showMenu": false,
            "shape": "k100"
          },
          "11": {
            "id": "k2B",
            "value": "TRNS",
            "type": "normal",
            "secondary": {},
            "showMenu": false,
            "shape": "k100"
          }
        },
        "leftHand": {
          "0": {
            "0": {
              "id": "k30",
              "value": "TRNS",
              "type": "normal",
              "secondary": {},
              "showMenu": false,
              "shape": "k125"
            },
            "1": {
              "id": "k31",
              "value": "TRNS",
              "type": "normal",
              "secondary": {},
              "showMenu": false,
              "shape": "k150"
            },
            "2": {
              "id": "k32",
              "value": "TRNS",
              "type": "normal",
              "secondary": {},
              "showMenu": false,
              "shape": "k125"
            },
            "3": {
              "id": "k34",
              "value": "NO",
              "type": "nodisplay"
            }
          },
          "1": {
            "0": {
              "id": "k30",
              "value": "TRNS",
              "type": "normal",
              "secondary": {},
              "showMenu": false,
              "shape": "k100"
            },
            "1": {
              "id": "k31",
              "value": "TRNS",
              "type": "normal",
              "secondary": {},
              "showMenu": false,
              "shape": "k100"
            },
            "2": {
              "id": "k32",
              "value": "TRNS",
              "type": "normal",
              "secondary": {},
              "showMenu": false,
              "shape": "k100"
            },
            "3": {
              "id": "k34",
              "value": "TRNS",
              "type": "normal",
              "secondary": {},
              "showMenu": false,
              "shape": "k100"
            }
          }
        },
        "row4": {
          "0": {
            "id": "k33",
            "value": "TRNS",
            "type": "normal",
            "secondary": {},
            "showMenu": false,
            "shape": "k225"
          },
          "1": {
            "id": "k37",
            "value": "TRNS",
            "type": "normal",
            "secondary": {},
            "showMenu": false,
            "shape": "k200"
          }
        },
        "rightHand": {
          "0": {
            "0": {
              "id": "k38",
              "value": "TRNS",
              "type": "normal",
              "secondary": {},
              "showMenu": false,
              "shape": "k125"
            },
            "1": {
              "id": "k39",
              "value": "TRNS",
              "type": "normal",
              "secondary": {},
              "showMenu": false,
              "shape": "k150"
            },
            "2": {
              "id": "k3A",
              "value": "NO",
              "type": "nodisplay"
            },
            "3": {
              "id": "k3B",
              "value": "TRNS",
              "type": "normal",
              "secondary": {},
              "showMenu": false,
              "shape": "k175"
            }
          },
          "1": {
            "0": {
              "id": "k38",
              "value": "TRNS",
              "type": "normal",
              "secondary": {},
              "showMenu": false,
              "shape": "k150"
            },
            "1": {
              "id": "k39",
              "value": "TRNS",
              "type": "normal",
              "secondary": {},
              "showMenu": false,
              "shape": "k100"
            },
            "2": {
              "id": "k3A",
              "value": "TRNS",
              "type": "normal",
              "secondary": {},
              "showMenu": false,
              "shape": "k100"
            },
            "3": {
              "id": "k3B",
              "value": "TRNS",
              "type": "normal",
              "secondary": {},
              "showMenu": false,
              "shape": "k100"
            }
          }
        }
      },
      "3": {
        "row1": {
          "0": {
            "id": "k00",
            "value": "TRNS",
            "type": "normal",
            "secondary": {},
            "showMenu": false,
            "shape": "k100"
          },
          "1": {
            "id": "k01",
            "value": "TRNS",
            "type": "normal",
            "secondary": {},
            "showMenu": false,
            "shape": "k100"
          },
          "2": {
            "id": "k02",
            "value": "TRNS",
            "type": "normal",
            "secondary": {},
            "showMenu": false,
            "shape": "k100"
          },
          "3": {
            "id": "k03",
            "value": "TRNS",
            "type": "normal",
            "secondary": {},
            "showMenu": false,
            "shape": "k100"
          },
          "4": {
            "id": "k04",
            "value": "TRNS",
            "type": "normal",
            "secondary": {},
            "showMenu": false,
            "shape": "k100"
          },
          "5": {
            "id": "k05",
            "value": "TRNS",
            "type": "normal",
            "secondary": {},
            "showMenu": false,
            "shape": "k100"
          },
          "6": {
            "id": "k06",
            "value": "TRNS",
            "type": "normal",
            "secondary": {},
            "showMenu": false,
            "shape": "k100"
          },
          "7": {
            "id": "k07",
            "value": "F1",
            "type": "normal",
            "secondary": {},
            "showMenu": false,
            "shape": "k100"
          },
          "8": {
            "id": "k08",
            "value": "F2",
            "type": "normal",
            "secondary": {},
            "showMenu": false,
            "shape": "k100"
          },
          "9": {
            "id": "k09",
            "value": "F3",
            "type": "normal",
            "secondary": {},
            "showMenu": false,
            "shape": "k100"
          },
          "10": {
            "id": "k0A",
            "value": "F4",
            "type": "normal",
            "secondary": {},
            "showMenu": false,
            "shape": "k100"
          },
          "11": {
            "id": "k0B",
            "value": "TRNS",
            "type": "normal",
            "secondary": {},
            "showMenu": false,
            "shape": "k175"
          }
        },
        "row2": {
          "0": {
            "id": "k10",
            "value": "ESC",
            "type": "normal",
            "secondary": {},
            "showMenu": false,
            "shape": "k125"
          },
          "1": {
            "id": "k11",
            "value": "TRNS",
            "type": "normal",
            "secondary": {},
            "showMenu": false,
            "shape": "k100"
          },
          "2": {
            "id": "k12",
            "value": "TRNS",
            "type": "normal",
            "secondary": {},
            "showMenu": false,
            "shape": "k100"
          },
          "3": {
            "id": "k13",
            "value": "TRNS",
            "type": "normal",
            "secondary": {},
            "showMenu": false,
            "shape": "k100"
          },
          "4": {
            "id": "k14",
            "value": "TRNS",
            "type": "normal",
            "secondary": {},
            "showMenu": false,
            "shape": "k100"
          },
          "5": {
            "id": "k15",
            "value": "TRNS",
            "type": "normal",
            "secondary": {},
            "showMenu": false,
            "shape": "k100"
          },
          "6": {
            "id": "k16",
            "value": "TRNS",
            "type": "normal",
            "secondary": {},
            "showMenu": false,
            "shape": "k100"
          },
          "7": {
            "id": "k17",
            "value": "F5",
            "type": "normal",
            "secondary": {},
            "showMenu": false,
            "shape": "k100"
          },
          "8": {
            "id": "k18",
            "value": "F6",
            "type": "normal",
            "secondary": {},
            "showMenu": false,
            "shape": "k100"
          },
          "9": {
            "id": "k19",
            "value": "F7",
            "type": "normal",
            "secondary": {},
            "showMenu": false,
            "shape": "k100"
          },
          "10": {
            "id": "k1A",
            "value": "F8",
            "type": "normal",
            "secondary": {},
            "showMenu": false,
            "shape": "k100"
          },
          "11": {
            "id": "k1B",
            "value": "TRNS",
            "type": "normal",
            "secondary": {},
            "showMenu": false,
            "shape": "k150"
          }
        },
        "row3": {
          "0": {
            "id": "k20",
            "value": "LSFT",
            "type": "normal",
            "secondary": {},
            "showMenu": false,
            "shape": "k175"
          },
          "1": {
            "id": "k21",
            "value": "1",
            "type": "normal",
            "secondary": {},
            "showMenu": false,
            "shape": "k100"
          },
          "2": {
            "id": "k22",
            "value": "2",
            "type": "normal",
            "secondary": {},
            "showMenu": false,
            "shape": "k100"
          },
          "3": {
            "id": "k23",
            "value": "3",
            "type": "normal",
            "secondary": {},
            "showMenu": false,
            "shape": "k100"
          },
          "4": {
            "id": "k24",
            "value": "4",
            "type": "normal",
            "secondary": {},
            "showMenu": false,
            "shape": "k100"
          },
          "5": {
            "id": "k25",
            "value": "5",
            "type": "normal",
            "secondary": {},
            "showMenu": false,
            "shape": "k100"
          },
          "6": {
            "id": "k26",
            "value": "6",
            "type": "normal",
            "secondary": {},
            "showMenu": false,
            "shape": "k100"
          },
          "7": {
            "id": "k27",
            "value": "F9",
            "type": "normal",
            "secondary": {},
            "showMenu": false,
            "shape": "k100"
          },
          "8": {
            "id": "k28",
            "value": "F10",
            "type": "normal",
            "secondary": {},
            "showMenu": false,
            "shape": "k100"
          },
          "9": {
            "id": "k29",
            "value": "F11",
            "type": "normal",
            "secondary": {},
            "showMenu": false,
            "shape": "k100"
          },
          "10": {
            "id": "k2A",
            "value": "F12",
            "type": "normal",
            "secondary": {},
            "showMenu": false,
            "shape": "k100"
          },
          "11": {
            "id": "k2B",
            "value": "TRNS",
            "type": "normal",
            "secondary": {},
            "showMenu": false,
            "shape": "k100"
          }
        },
        "leftHand": {
          "0": {
            "0": {
              "id": "k30",
              "value": "TRNS",
              "type": "normal",
              "secondary": {},
              "showMenu": false,
              "shape": "k125"
            },
            "1": {
              "id": "k31",
              "value": "LALT",
              "type": "normal",
              "secondary": {},
              "showMenu": false,
              "shape": "k150"
            },
            "2": {
              "id": "k32",
              "value": "B",
              "type": "normal",
              "secondary": {},
              "showMenu": false,
              "shape": "k125"
            },
            "3": {
              "id": "k34",
              "value": "NO",
              "type": "nodisplay"
            }
          },
          "1": {
            "0": {
              "id": "k30",
              "value": "TRNS",
              "type": "normal",
              "secondary": {},
              "showMenu": false,
              "shape": "k100"
            },
            "1": {
              "id": "k31",
              "value": "LSFT",
              "type": "normal",
              "secondary": {},
              "showMenu": false,
              "shape": "k100"
            },
            "2": {
              "id": "k32",
              "value": "TRNS",
              "type": "normal",
              "secondary": {},
              "showMenu": false,
              "shape": "k100"
            },
            "3": {
              "id": "k34",
              "value": "TRNS",
              "type": "normal",
              "secondary": {},
              "showMenu": false,
              "shape": "k100"
            }
          }
        },
        "row4": {
          "0": {
            "id": "k33",
            "value": "SPC",
            "type": "normal",
            "secondary": {},
            "showMenu": false,
            "shape": "k225"
          },
          "1": {
            "id": "k37",
            "value": "C",
            "type": "normal",
            "secondary": {},
            "showMenu": false,
            "shape": "k200"
          }
        },
        "rightHand": {
          "0": {
            "0": {
              "id": "k38",
              "value": "TRNS",
              "type": "normal",
              "secondary": {},
              "showMenu": false,
              "shape": "k125"
            },
            "1": {
              "id": "k39",
              "value": "TRNS",
              "type": "normal",
              "secondary": {},
              "showMenu": false,
              "shape": "k150"
            },
            "2": {
              "id": "k3A",
              "value": "NO",
              "type": "nodisplay"
            },
            "3": {
              "id": "k3B",
              "value": "TRNS",
              "type": "normal",
              "secondary": {},
              "showMenu": false,
              "shape": "k175"
            }
          },
          "1": {
            "0": {
              "id": "k38",
              "value": "TRNS",
              "type": "normal",
              "secondary": {},
              "showMenu": false,
              "shape": "k150"
            },
            "1": {
              "id": "k39",
              "value": "TRNS",
              "type": "normal",
              "secondary": {},
              "showMenu": false,
              "shape": "k100"
            },
            "2": {
              "id": "k3A",
              "value": "TRNS",
              "type": "normal",
              "secondary": {},
              "showMenu": false,
              "shape": "k100"
            },
            "3": {
              "id": "k3B",
              "value": "TRNS",
              "type": "normal",
              "secondary": {},
              "showMenu": false,
              "shape": "k100"
            }
          }
        }
      }
    }
  },
  [
    {
      "c": "#15c2ba",
      "t": "#ffffff",
      "a": 7
    },
    "",
    {
      "c": "#cccccc",
      "t": "#cf785f"
    },
    ">",
    "]",
    "}",
    ")",
    ";",
    "@",
    "#",
    "~",
    "",
    "",
    {
      "c": "#cf785f",
      "t": "#ffffff",
      "w": 1.75
    },
    ""
  ],
  [
    {
      "w": 1.25
    },
    "\\",
    {
      "c": "#cccccc",
      "t": "#cf785f"
    },
    "<",
    "[",
    "{",
    "(",
    "|",
    ":",
    "/",
    "^",
    "$",
    "%",
    {
      "c": "#15c2ba",
      "t": "#ffffff",
      "w": 1.5
    },
    ""
  ],
  [
    {
      "c": "#cf785f",
      "w": 1.75
    },
    "_",
    {
      "c": "#cccccc",
      "t": "#cf785f"
    },
    "",
    "`",
    "`",
    "+",
    "",
    "!",
    ",",
    "=",
    "*",
    "?",
    {
      "c": "#cf785f",
      "t": "#ffffff",
      "f": 2
    },
    ""
  ],
  [
    {
      "f": 3
    },
    "",
    "",
    "",
    {
      "f": 2
    },
    "PLAY REC",
    {
      "c": "#cccccc",
      "t": "#cf785f",
      "f": 3,
      "w": 2.25
    },
    ".",
    {
      "w": 2
    },
    "",
    {
      "c": "#cf785f",
      "t": "#ffffff",
      "w": 1.5
    },
    "",
    "",
    "",
    ""
  ]
]