../Core/Src/syscalls.c:42:6:ITM_SendChar	16	static
../Core/Src/syscalls.c:65:6:initialise_monitor_handles	4	static
../Core/Src/syscalls.c:69:5:_getpid	4	static
../Core/Src/syscalls.c:74:5:_kill	16	static
../Core/Src/syscalls.c:82:6:_exit	16	static
../Core/Src/syscalls.c:88:27:_read	32	static
../Core/Src/syscalls.c:101:27:_write	32	static
../Core/Src/syscalls.c:114:5:_close	16	static
../Core/Src/syscalls.c:121:5:_fstat	16	static
../Core/Src/syscalls.c:128:5:_isatty	16	static
../Core/Src/syscalls.c:134:5:_lseek	24	static
../Core/Src/syscalls.c:142:5:_open	12	static
../Core/Src/syscalls.c:150:5:_wait	16	static
../Core/Src/syscalls.c:157:5:_unlink	16	static
../Core/Src/syscalls.c:164:5:_times	16	static
../Core/Src/syscalls.c:170:5:_stat	16	static
../Core/Src/syscalls.c:177:5:_link	16	static
../Core/Src/syscalls.c:185:5:_fork	8	static
../Core/Src/syscalls.c:191:5:_execve	24	static
