2790
279 203
279 204
278 205
278 206
278 207
278 208
277 209
279 209
280 210
281 210
282 211
283 212
284 213
285 213
286 214
287 215
288 215
289 216
288 217
287 218
286 219
285 220
284 221
283 222
282 223
281 224
280 225
279 226
278 227
277 228
277 229
276 230
276 231
275 232
275 233
274 234
274 235
273 236
273 237
272 238
272 239
271 240
271 241
270 242
270 243
269 244
268 245
267 246
266 247
265 248
264 249
263 250
262 251
261 252
260 253
259 254
258 255
257 255
256 256
255 256
254 256
253 257
252 257
251 257
250 257
249 258
248 258
247 258
246 258
245 259
289 218
290 219
291 220
292 221
293 222
294 223
295 224
296 225
297 226
298 227
299 228
300 229
301 229
302 230
295 222
296 221
297 220
298 219
299 218
300 217
301 216
302 215
302 214
303 213
274 231
273 230
272 229
271 228
270 227
269 226
268 225
267 224
266 223
265 222
264 221
263 220
262 219
261 218
260 217
259 216
258 215
258 214
258 213
258 212
258 211
258 210
258 209
258 208
258 207
258 206
258 205
258 204
258 203
258 202
258 201
258 200
258 199
258 198
260 219
259 220
258 221
257 222
256 223
255 224
254 225
253 226
252 227
251 228
250 229
249 230
248 231
247 232
249 228
248 227
247 226
246 225
245 224
244 223
243 222
242 221
241 220
240 219
239 218
238 217
238 216
237 215
237 214
237 213
237 212
237 211
236 210
236 209
236 208
236 207
236 206
236 205
235 204
237 218
236 219
235 220
234 221
233 222
232 223
231 224
230 225
229 226
228 227
228 228
227 229
275 236
276 237
277 238
278 239
279 240
280 241
281 241
282 242
283 243
284 244
285 245
286 246
287 247
288 247
289 248
290 248
291 248
292 248
293 249
294 249
295 249
296 249
297 250
298 250
299 250
300 250
301 250
302 251
301 252
300 253
299 254
298 255
297 256
296 257
295 258
294 259
293 260
292 261
291 262
290 263
289 263
288 264
303 251
304 251
305 251
306 251
307 251
308 251
309 251
310 251
311 252
312 252
313 252
314 252
315 252
316 252
317 252
318 252
319 252
320 253
321 253
322 253
323 253
324 253
325 253
326 253
327 253
328 253
329 253
330 253
331 254
331 255
331 256
331 257
331 258
331 259
331 260
331 261
331 262
331 263
331 264
331 265
331 266
330 267
332 264
333 263
334 262
335 261
336 260
337 259
338 258
339 257
340 256
341 255
342 254
343 253
344 252
345 253
346 254
347 254
348 255
349 256
350 256
351 257
352 258
353 258
354 259
355 260
356 260
357 261
358 261
359 261
360 261
361 261
362 261
363 261
364 262
365 262
366 262
367 262
368 262
369 262
370 262
371 262
372 263
373 263
374 263
375 263
376 263
377 263
378 263
379 264
380 264
381 264
382 264
383 264
384 264
385 264
386 264
387 265
357 259
358 258
359 257
360 256
361 255
362 254
363 253
364 252
365 251
366 250
367 249
368 248
369 247
370 246
371 245
372 244
373 243
330 268
329 269
329 270
328 271
328 272
328 273
327 274
327 275
326 276
326 277
325 278
325 279
325 280
324 281
324 282
323 283
323 284
323 285
322 286
322 287
322 288
322 289
323 290
323 291
323 292
323 293
324 294
324 295
324 296
324 297
325 298
321 286
320 285
319 284
318 283
317 282
316 281
315 280
314 279
313 278
312 277
311 276
310 275
309 274
308 273
251 258
252 259
253 260
254 261
255 262
256 263
257 264
258 265
259 266
260 267
261 268
262 269
263 270
264 271
265 272
266 273
267 274
268 275
268 276
269 277
269 278
270 279
270 280
271 281
271 282
272 283
272 284
273 285
273 286
274 287
274 288
275 289
275 290
276 291
277 291
278 291
279 291
280 290
281 290
282 290
283 290
284 289
285 289
286 289
287 289
288 288
289 288
290 289
291 289
292 290
293 290
294 291
295 291
296 292
297 292
298 293
299 293
300 294
272 287
271 288
270 289
269 290
268 291
267 292
266 293
265 294
264 295
263 295
262 296
299 295
298 296
297 297
296 298
295 299
294 300
294 301
293 302
292 303
291 304
290 305
289 306
288 307
288 308
287 309
286 309
285 310
284 310
283 310
282 311
281 311
280 312
279 312
278 312
277 313
276 313
275 313
274 314
273 314
272 315
271 315
270 316
269 316
268 317
267 317
266 318
265 318
264 319
263 319
262 320
261 319
260 318
259 317
258 316
257 316
256 315
255 314
254 313
253 312
252 312
251 311
263 321
264 322
265 323
266 324
266 325
267 326
268 327
269 328
270 329
271 330
271 331
272 332
273 332
274 332
275 332
276 332
277 332
278 332
279 332
280 332
281 332
282 332
283 331
291 306
292 307
293 308
294 309
295 310
296 311
297 312
298 313
299 313
300 314
301 315
302 316
303 317
303 318
304 319
305 320
306 321
307 322
307 323
308 324
309 325
310 326
310 327
311 328
312 329
313 330
314 331
315 332
315 333
316 334
317 335
318 336
319 337
319 338
320 339
313 328
314 327
315 326
316 325
317 324
318 323
319 322
320 321
321 320
322 319
306 324
305 325
304 326
303 327
302 328
301 329
300 330
299 331
318 339
317 340
316 341
315 342
314 343
313 344
312 345
311 346
310 347
309 347
308 348
309 349
310 350
310 351
311 352
312 353
313 354
313 355
314 356
315 357
316 358
316 359
317 360
317 361
317 362
317 363
317 364
318 365
318 366
318 367
318 368
318 369
318 370
319 371
314 358
313 359
312 360
311 361
310 362
309 363
308 364
307 365
306 366
305 367
304 368
307 363
306 362
305 361
304 360
303 359
302 358
301 357
300 356
299 355
298 354
297 353
296 352
295 351
294 350
293 349
260 269
259 270
258 271
257 272
256 273
255 274
254 275
253 276
252 277
251 278
250 279
249 280
248 281
247 282
246 283
295 353
294 354
293 355
292 356
291 357
290 358
289 359
288 360
287 361
286 362
285 363
284 364
283 365
286 360
285 359
284 358
283 357
282 356
281 355
280 354
279 353
278 352
277 351
276 350
275 349
277 353
276 354
275 355
274 356
273 357
272 358
271 359
270 360
269 361
268 362
267 363
266 364
265 364
264 364
263 364
262 363
261 363
260 363
259 363
258 363
257 362
256 362
255 362
254 362
253 362
252 361
267 328
266 329
265 330
264 331
263 332
262 333
261 334
260 335
259 336
258 337
257 338
256 339
255 340
254 341
253 340
252 339
251 338
250 337
249 337
248 336
247 335
246 334
245 333
244 333
243 332
242 331
241 331
240 330
239 329
238 329
237 328
236 328
235 327
234 326
233 326
232 325
231 325
230 324
229 323
228 323
227 322
226 322
225 321
229 325
228 326
227 327
226 328
225 329
224 330
223 331
222 332
222 333
222 334
222 335
221 336
221 337
221 338
221 339
221 340
220 341
220 342
220 343
220 344
220 345
219 346
219 347
219 348
219 349
219 350
218 351
221 346
222 347
223 348
224 348
225 349
226 350
227 351
228 352
229 352
230 353
311 250
312 249
312 248
313 247
314 246
315 245
315 244
316 243
317 242
317 241
318 240
319 239
320 238
320 237
321 236
322 235
322 234
323 233
379 262
380 261
381 260
382 259
383 258
383 257
384 256
385 255
386 254
387 253
388 252
388 251
389 250
390 249
391 248
392 247
393 246
393 245
394 244
323 232
323 231
323 230
323 229
323 228
323 227
324 226
324 225
324 224
324 223
324 222
324 221
324 220
325 219
325 218
325 217
325 216
325 215
325 214
325 213
326 212
327 211
327 210
328 209
328 208
329 207
330 206
330 205
331 204
331 203
332 202
332 201
333 200
334 199
334 198
335 197
335 196
336 195
336 194
337 193
336 192
335 191
334 190
333 189
332 188
331 187
330 186
329 185
328 184
328 183
327 182
338 192
339 191
340 190
341 189
342 189
343 188
344 187
345 186
346 185
347 184
348 184
349 183
335 199
336 200
337 201
338 202
339 203
340 204
341 205
342 206
343 207
344 208
345 209
346 210
327 213
328 214
329 215
330 216
331 217
332 218
333 219
334 220
335 221
336 222
337 223
338 224
339 225
340 226
341 227
342 228
343 229
344 230
345 231
325 211
324 210
323 209
322 208
321 207
320 206
319 205
318 204
317 203
316 202
315 201
314 200
313 199
312 198
311 197
310 196
309 195
308 194
307 193
306 193
305 192
327 181
327 180
327 179
327 178
327 177
327 176
327 175
327 174
327 173
328 172
328 171
328 170
328 169
328 168
328 167
328 166
328 165
328 164
328 163
328 162
329 161
329 160
329 159
329 158
329 157
329 156
329 155
329 154
329 153
329 152
330 151
330 150
330 149
330 148
330 147
330 146
330 145
330 144
330 143
330 142
330 141
331 140
332 139
333 138
334 137
335 136
336 135
337 134
338 133
339 132
340 131
341 130
342 129
343 128
344 127
345 126
346 125
347 124
348 123
349 122
350 121
350 120
351 119
351 118
351 117
351 116
351 115
351 114
351 113
351 112
351 111
351 110
352 109
352 108
352 107
352 106
352 105
352 104
352 103
352 102
352 101
352 100
352 99
353 98
331 143
332 144
333 145
334 146
335 147
336 148
337 149
338 150
339 151
340 152
341 153
342 154
343 155
344 156
345 157
346 158
347 159
348 160
349 161
350 162
342 131
343 132
344 133
345 134
346 135
347 136
348 137
349 138
350 139
351 140
352 141
226 229
225 228
224 228
223 228
222 227
221 227
220 226
219 226
218 226
217 225
216 225
215 225
214 224
213 224
212 223
211 223
210 223
209 222
208 222
207 222
206 221
206 220
207 219
207 218
207 217
208 216
208 215
209 214
209 213
209 212
210 211
210 210
211 209
211 208
211 207
212 206
212 205
213 204
213 203
213 202
214 201
207 214
206 213
205 212
204 211
203 210
202 209
201 208
200 207
199 206
198 205
197 204
196 203
195 202
194 201
193 200
219 343
218 342
217 341
216 340
215 339
214 338
213 337
212 336
211 335
210 334
209 333
208 332
207 331
206 330
205 329
204 328
203 327
202 326
201 325
201 324
201 323
200 322
200 321
200 320
200 319
199 318
199 317
199 316
199 315
198 314
197 314
196 315
195 315
194 316
193 316
192 317
191 317
190 317
189 318
188 318
187 319
186 319
185 320
184 320
183 321
182 321
181 321
180 322
183 319
182 318
181 317
181 316
180 315
179 314
178 313
178 312
177 311
180 323
180 324
180 325
180 326
179 327
179 328
179 329
179 330
179 331
178 332
178 333
178 334
178 335
178 336
177 337
177 338
177 339
177 340
177 341
176 342
244 259
243 259
242 258
241 258
240 258
239 258
238 257
237 257
236 257
235 256
234 256
233 256
232 256
231 255
230 255
229 255
228 254
227 254
226 254
225 254
224 253
217 227
216 228
215 229
214 230
214 231
213 232
212 233
211 234
210 235
210 236
209 237
208 238
207 239
206 240
206 241
205 242
204 243
203 243
202 244
201 244
200 245
199 245
198 246
197 246
196 247
195 247
194 248
193 248
192 249
191 249
190 250
196 245
195 244
194 243
193 242
192 241
191 240
190 239
189 238
188 237
187 236
186 235
185 234
185 233
184 232
184 231
184 230
184 229
184 228
184 227
184 226
184 225
184 224
184 223
184 222
185 221
183 223
182 224
181 225
180 226
179 227
178 228
177 229
176 230
175 231
174 232
173 233
172 234
171 235
170 235
169 236
169 237
169 238
169 239
169 240
169 241
169 242
169 243
169 244
169 245
169 246
169 247
169 248
168 249
173 231
172 230
171 229
170 228
169 227
168 226
167 225
166 224
165 223
164 222
167 249
166 249
165 249
164 249
163 249
162 249
161 249
160 249
159 249
158 248
157 248
156 248
155 248
154 248
153 248
152 248
151 248
150 248
149 248
148 247
147 247
146 246
145 246
144 246
143 245
142 245
141 245
140 244
139 244
138 243
137 243
136 243
135 242
134 242
133 242
132 241
133 240
133 239
134 238
134 237
135 236
135 235
136 234
136 233
137 232
137 231
138 230
138 229
139 228
139 227
140 226
140 225
141 224
141 223
142 222
142 221
143 220
184 220
184 219
183 218
182 217
182 216
181 215
180 214
180 213
179 212
178 211
178 210
177 209
176 208
176 207
175 206
174 205
174 204
173 203
173 202
172 201
171 201
170 201
169 201
168 201
167 201
166 200
165 200
164 200
163 200
162 200
161 200
160 199
159 199
158 199
157 199
156 199
155 199
154 199
153 198
152 198
151 197
150 197
149 197
148 196
147 196
146 196
145 195
144 195
143 195
142 194
208 334
207 335
206 336
205 337
204 338
203 339
202 340
201 341
200 342
199 343
198 344
198 345
197 346
341 128
340 127
339 126
338 125
337 124
336 123
335 122
334 121
333 120
332 119
331 118
330 117
350 109
349 108
348 108
347 107
346 106
345 105
344 105
343 104
342 103
341 102
340 102
339 101
338 100
337 99
336 99
335 98
334 97
333 97
332 96
329 117
328 117
327 117
326 117
325 117
324 117
323 117
322 117
321 117
320 116
319 116
318 116
317 116
316 116
315 116
314 116
313 116
312 116
311 116
310 115
309 114
308 113
307 112
307 111
306 110
305 109
304 108
303 107
303 106
302 105
303 104
304 103
305 102
306 101
306 100
307 99
308 98
309 97
310 96
310 95
311 94
301 105
300 105
299 105
298 105
297 105
296 106
295 106
294 106
293 106
292 106
291 106
290 106
289 107
311 117
310 118
310 119
309 120
309 121
308 122
308 123
307 124
307 125
306 126
306 127
305 128
304 101
303 100
302 99
301 98
300 97
299 96
298 95
297 94
296 93
295 92
294 91
293 90
292 89
291 88
290 87
289 86
288 86
287 85
135 232
134 231
133 230
132 229
131 228
130 227
129 226
128 225
127 224
126 223
125 222
124 221
123 220
122 219
121 219
120 219
119 219
118 219
117 220
116 220
115 220
114 220
113 220
112 221
111 221
110 221
109 221
108 221
107 221
106 222
112 219
111 218
110 217
109 216
108 215
107 214
106 213
105 212
104 211
103 210
102 209
101 210
100 210
99 211
98 211
97 212
96 213
95 213
94 214
93 214
92 215
91 216
90 216
89 217
88 217
87 218
86 218
85 219
105 223
105 224
104 225
103 226
103 227
102 228
101 229
101 230
100 231
99 232
99 233
98 234
97 235
97 236
96 237
95 238
95 239
94 240
100 234
101 235
102 236
103 237
104 237
105 238
106 239
107 240
108 241
109 242
110 242
111 243
106 211
107 210
108 209
109 208
110 207
111 206
112 205
113 204
114 203
115 202
116 201
117 200
118 199
119 199
120 198
115 200
114 199
113 198
112 197
111 196
110 195
109 194
108 193
107 192
106 191
105 191
104 190
92 213
91 212
90 211
89 210
88 209
87 208
86 207
85 206
84 205
83 204
82 203
81 202
80 201
80 200
79 199
79 198
79 197
80 196
80 195
80 194
80 193
81 192
81 191
81 190
81 189
82 188
78 196
77 195
76 194
75 194
74 193
73 192
72 191
71 190
70 190
69 189
68 188
67 187
66 186
65 186
64 185
76 196
75 197
74 198
73 199
72 200
71 201
70 202
69 203
68 204
67 205
66 206
65 207
65 208
64 209
63 184
62 183
61 182
60 181
59 180
58 179
57 178
56 177
55 176
54 175
53 174
52 173
51 172
50 171
50 170
49 169
48 168
47 167
47 166
46 165
45 164
45 163
44 162
43 161
42 160
42 159
41 158
40 157
40 156
39 155
38 154
38 153
37 152
36 151
36 150
35 149
34 148
34 147
33 146
32 145
32 144
31 143
31 142
30 141
37 149
38 148
39 147
40 146
41 146
42 145
43 144
44 143
45 142
46 141
47 141
48 140
37 155
36 156
35 157
34 158
33 159
32 160
31 161
30 162
29 163
28 164
48 139
49 138
49 137
50 136
50 135
51 134
51 133
52 132
52 131
53 130
53 129
53 128
54 127
28 165
28 166
28 167
28 168
28 169
28 170
29 171
29 172
29 173
29 174
29 175
29 176
29 177
29 178
30 179
31 180
32 181
33 182
34 183
35 184
36 185
37 186
38 187
39 188
40 189
41 190
42 190
43 191
42 192
41 193
40 194
39 195
38 196
37 197
36 198
35 199
34 200
33 201
32 202
31 203
30 204
29 204
28 205
31 205
32 206
33 207
34 208
35 209
36 210
37 211
38 212
39 213
40 214
41 215
42 215
43 216
41 216
40 217
39 218
38 219
37 220
36 221
35 222
34 223
33 224
32 225
31 226
30 227
29 228
32 227
33 228
34 229
35 230
36 231
37 232
38 233
39 234
40 235
41 236
42 236
43 237
53 126
52 125
52 124
51 123
50 122
49 121
49 120
48 119
47 118
46 117
46 116
45 115
44 114
43 113
43 112
42 111
41 110
41 109
40 108
40 110
39 111
38 112
37 113
36 114
35 115
34 116
33 117
32 118
31 119
30 120
44 111
45 110
46 109
47 109
48 108
49 107
50 106
51 106
52 105
38 110
37 109
36 108
35 107
34 106
33 105
32 104
31 103
30 102
29 101
28 100
27 99
26 98
26 97
26 96
27 95
27 94
27 93
28 92
28 91
28 90
29 89
29 88
29 87
30 86
30 85
30 84
30 83
31 82
32 82
33 82
34 81
35 81
36 81
37 80
38 80
39 80
40 80
41 79
42 79
43 79
44 78
45 78
46 78
47 78
48 77
49 76
50 75
51 75
52 74
53 73
54 73
55 72
56 71
57 70
58 70
59 69
60 68
61 68
62 67
54 71
53 70
52 69
51 68
50 67
49 66
48 65
47 64
46 63
45 62
44 62
43 62
42 62
41 62
40 62
39 62
38 62
37 62
36 62
35 62
34 62
33 62
32 62
31 61
55 74
56 75
57 76
58 77
59 78
60 79
61 80
62 81
63 82
64 83
65 84
66 85
67 85
68 85
69 85
70 84
71 84
72 84
73 84
74 84
75 83
76 83
77 83
78 83
79 82
80 82
81 82
82 82
83 82
84 81
44 237
45 237
46 236
47 236
48 236
49 235
50 235
51 235
52 234
53 234
54 234
55 233
56 233
57 233
58 232
59 232
60 232
61 232
62 231
63 232
64 233
65 234
66 235
67 235
68 236
69 237
70 238
71 239
72 239
73 240
63 67
64 66
65 66
66 66
67 65
68 65
69 65
70 64
71 64
72 63
73 63
74 63
75 62
76 62
77 62
78 61
79 61
80 61
81 60
85 80
86 79
87 78
88 77
89 76
90 75
91 74
92 73
92 72
93 71
94 70
95 69
96 68
97 67
98 66
99 65
100 64
101 63
101 62
102 61
89 78
90 79
91 80
92 81
93 82
94 83
95 84
96 85
97 86
98 87
99 88
100 89
101 90
102 91
103 92
103 93
104 94
101 88
102 87
103 86
104 85
104 84
105 83
106 83
107 84
108 84
109 85
110 85
111 86
112 86
113 86
114 87
115 87
116 88
117 88
118 89
119 89
120 89
121 90
107 82
108 81
109 80
110 79
111 78
111 77
112 76
113 75
114 74
115 73
116 72
117 71
117 70
118 69
119 68
120 67
121 66
122 65
122 64
123 63
286 85
285 85
284 85
283 85
282 85
281 85
280 86
279 86
278 86
277 86
276 86
275 86
274 86
273 87
272 87
271 87
270 87
269 87
268 87
267 87
266 88
266 89
266 90
266 91
266 92
265 93
265 94
265 95
265 96
265 97
264 98
264 99
264 100
264 101
264 102
264 103
263 104
262 104
261 104
260 104
259 104
258 104
257 104
256 104
255 104
254 104
253 104
252 104
251 104
250 104
249 104
248 104
247 104
246 104
263 102
262 101
261 100
260 99
259 98
258 97
257 96
256 95
255 94
254 93
253 92
252 91
251 90
250 89
249 88
248 87
247 86
246 86
245 86
244 86
243 86
242 86
241 86
240 86
239 86
238 85
237 85
236 85
235 85
234 85
233 85
232 85
231 85
230 85
229 84
230 86
229 87
229 88
229 89
228 90
228 91
227 92
227 93
227 94
226 95
226 96
225 97
225 98
225 99
224 100
224 98
223 97
222 96
221 95
220 94
219 93
218 92
217 91
216 90
215 89
214 88
213 87
212 86
211 85
210 84
209 83
208 82
208 84
207 85
206 86
205 87
204 88
203 89
202 90
201 91
200 92
199 93
198 94
197 95
196 96
195 97
194 98
194 99
193 100
199 95
200 96
201 97
202 98
203 99
204 100
192 100
191 100
190 100
189 100
188 99
187 99
186 99
185 99
184 99
183 98
182 98
181 98
180 98
179 98
178 97
177 97
176 97
175 97
174 97
173 96
199 91
198 90
197 89
196 88
195 87
194 86
193 85
192 84
191 83
190 82
189 81
188 80
187 79
172 96
171 96
170 96
169 95
168 95
167 95
166 95
165 94
164 94
163 94
162 94
161 93
160 93
159 93
158 93
157 93
156 92
155 92
154 92
153 92
152 92
151 92
150 92
149 92
148 92
147 92
146 92
145 92
144 92
143 92
152 91
153 90
154 89
155 88
156 87
157 86
158 85
159 84
160 83
161 82
162 81
163 80
164 79
165 78
166 77
156 85
155 84
154 83
153 82
152 81
151 80
150 79
149 78
148 77
147 76
146 75
145 74
305 129
305 130
305 131
305 132
305 133
305 134
305 135
305 136
305 137
304 138
304 139
304 140
304 141
304 142
304 143
304 144
304 145
304 146
304 147
304 148
303 149
303 150
303 151
303 152
303 153
303 154
303 155
303 156
303 157
303 158
304 159
304 160
304 161
304 162
304 163
304 164
304 165
304 166
304 167
304 168
305 169
391 250
392 251
393 252
394 253
395 254
396 255
397 256
398 257
399 258
400 259
401 260
402 261
403 262
404 263
405 264
406 265
407 266
407 267
408 268
403 260
404 259
405 258
406 257
407 256
408 255
409 254
410 253
411 252
412 251
413 250
414 249
415 248
416 247
417 247
418 247
419 247
420 247
421 247
422 247
423 247
424 247
425 247
426 247
427 247
428 247
429 247
430 247
431 247
432 247
433 247
434 247
435 248
436 249
437 250
438 251
439 252
440 252
441 253
442 254
443 255
444 256
445 257
446 257
447 258
448 259
449 260
450 261
451 261
452 262
443 257
442 258
441 259
440 260
439 261
438 262
437 263
436 264
435 265
434 266
433 267
432 268
431 269
430 270
429 271
453 262
454 261
455 261
456 260
457 260
458 260
459 259
460 259
461 258
462 258
463 257
464 257
465 257
466 256
467 256
468 255
469 255
470 254
471 254
472 254
473 253
474 253
475 252
476 252
477 251
478 251
479 251
480 250
480 249
481 248
481 247
482 246
482 245
483 244
483 243
484 242
484 241
485 240
485 239
486 238
486 237
487 236
488 236
489 236
490 236
491 236
492 236
493 237
494 237
495 237
496 237
497 237
498 237
499 238
500 239
501 240
502 240
503 241
504 242
505 242
506 243
507 244
508 244
509 245
510 246
511 246
512 247
511 248
510 249
509 250
508 251
507 252
506 253
505 254
504 255
503 256
502 257
501 258
500 258
499 259
511 250
512 251
513 252
514 253
515 254
516 255
517 256
518 257
519 258
520 259
521 260
522 261
523 262
493 235
494 234
495 233
495 232
496 231
497 230
498 229
498 228
499 227
500 226
501 225
501 224
502 223
503 222
504 221
504 220
505 219
506 218
506 217
507 216
508 215
508 214
509 213
510 212
510 211
511 210
512 209
512 208
513 207
514 206
514 205
515 204
515 203
515 202
515 201
516 200
516 199
516 198
516 197
517 196
517 195
517 194
517 193
518 192
518 191
518 190
518 189
518 188
519 187
520 186
521 185
522 184
523 183
524 182
525 181
526 180
527 179
528 178
529 177
530 176
531 175
532 174
533 173
534 172
535 171
536 170
537 169
538 169
539 168
498 260
498 261
497 262
497 263
496 264
496 265
495 266
495 267
494 268
494 269
493 270
493 271
492 272
492 273
491 274
491 275
490 276
490 277
489 278
489 279
488 280
523 263
523 264
523 265
523 266
523 267
523 268
523 269
523 270
523 271
523 272
524 273
524 274
524 275
524 276
524 277
524 278
524 279
524 280
524 281
524 282
524 283
525 284
523 283
522 284
521 284
520 284
519 285
518 285
517 286
516 286
515 286
514 287
538 167
538 166
537 165
537 164
536 163
536 162
535 161
534 160
534 159
533 158
533 157
532 156
532 155
531 154
531 153
530 152
529 151
529 150
528 149
528 148
527 147
527 146
526 145
525 144
525 143
524 142
524 141
523 140
523 139
522 138
522 137
521 136
520 135
520 134
519 133
519 132
518 131
518 130
517 129
516 128
516 127
515 126
515 125
514 124
514 123
513 122
512 121
512 120
511 119
511 118
510 117
510 116
509 115
508 115
507 114
506 114
505 113
504 113
503 112
502 112
501 111
500 111
499 110
498 110
497 109
496 109
495 108
494 108
493 107
492 107
491 107
490 106
188
289 248
289 107
105 83
266 88
143 92
62 231
111 243
148 247
429 271
408 268
224 253
325 298
303 149
305 169
173 96
256 256
28 205
332 96
330 117
353 98
351 119
514 287
143 220
164 222
29 228
31 61
31 82
142 194
352 141
331 140
350 162
349 183
329 161
327 182
190 250
172 201
193 200
214 201
185 221
206 221
235 204
227 229
122 219
120 198
197 346
201 325
176 342
180 322
82 188
387 265
247 86
277 209
305 192
509 115
322 319
64 209
85 219
320 339
317 360
224 100
208 82
452 262
30 141
30 120
331 254
323 233
326 212
346 210
230 353
222 332
243 332
251 311
499 259
499 238
488 280
66 85
521 136
258 215
145 74
276 230
345 231
287 309
187 79
247 232
166 77
106 222
104 190
132 241
205 242
288 264
287 85
64 185
539 168
30 179
94 240
84 81
263 104
304 368
262 296
283 331
311 94
305 128
302 230
121 90
43 191
246 283
480 250
308 273
204 100
229 84
254 341
416 247
252 361
322 286
81 60
73 240
288 288
102 61
373 243
246 104
268 275
169 236
372 263
505 219
523 262
40 108
275 349
394 244
289 216
43 216
52 105
28 164
45 62
283 365
123 63
54 127
48 140
303 213
525 284
512 247
49 169
218 351
193 100
528 178
344 252
435 248
269 244
153 198
310 115
102 209
308 348
26 98
168 249
300 294
276 291
62 67
320 253
302 251
519 187
37 152
245 259
262 320
330 267
177 311
515 204
274 314
225 321
272 332
487 236
258 198
357 261
302 105
43 237
490 106
79 199
48 77
237 215
299 331
337 193
319 371
184 232
104 94
156 92
293 349
300 314
311 328
198 314
266 364
