data/obj/frame100_jpg.rf.6ad2b9285cc6dda745793a60d5d8a65d.jpg
data/obj/frame101_jpg.rf.e2ded1d6d072c44b0d8973a3099b01f0.jpg
data/obj/frame102_jpg.rf.a383f83da15ff74b9bfdd9755c8b1fa7.jpg
data/obj/frame103_jpg.rf.8c30cb2cb1e6aee446912ca22b05d376.jpg
data/obj/frame104_jpg.rf.b971782eb493c7f92f91785a80ebab84.jpg
data/obj/frame106_jpg.rf.aba95598f557558d5b80e4d1cf2b383e.jpg
data/obj/frame107_jpg.rf.c6642f592aa15f8bd2568aad543faee4.jpg
data/obj/frame109_jpg.rf.a41536365bce4df5ed8758deb4236d9a.jpg
data/obj/frame110_jpg.rf.58d2a4b77b73eecd7d3d2d9a8e30b279.jpg
data/obj/frame111_jpg.rf.949b957691ad40c3b47001e02d9b3477.jpg
data/obj/frame112_jpg.rf.0f75b9bd43e602d6d3b6dc4afa3e70cd.jpg
data/obj/frame113_jpg.rf.ccedc604e63084993b17d2837007e554.jpg
data/obj/frame114_jpg.rf.119808498ee89001f4142f951a08ee86.jpg
data/obj/frame115_jpg.rf.18bec6302f36f2a4a34021b7f2921416.jpg
data/obj/frame116_jpg.rf.f69f8b027ef35995b53d1c065933bd7c.jpg
data/obj/frame117_jpg.rf.bc93a2afc3d814c4798a98a851b65e60.jpg
data/obj/frame118_jpg.rf.1bc50902e1e029e6a57b30f8d14458c4.jpg
data/obj/frame119_jpg.rf.16582c00eeeeb8797170c2bd553b19c4.jpg
data/obj/frame11_jpg.rf.14b6cfb6aaa1ab2cded62907fedf8d93.jpg
data/obj/frame120_jpg.rf.477c783e3a9921053db26e94dc507dc1.jpg
data/obj/frame121_jpg.rf.dd66424038756a7016d002fc72f3ccb2.jpg
data/obj/frame124_jpg.rf.3e8019d9a63f3f69e2000d0975c53e98.jpg
data/obj/frame125_jpg.rf.e4893e20d7b65352286c8f7b71e76e04.jpg
data/obj/frame128_jpg.rf.774b396a1c5295f41f3afe01c2dd1463.jpg
data/obj/frame12_jpg.rf.b6d8907cbbb9be2c9dae8793dc14ef1f.jpg
data/obj/frame130_jpg.rf.6f79fdb59470352c7b5a59dda88b2332.jpg
data/obj/frame131_jpg.rf.83ac9ff2bb35d2e693df85edc4b6274e.jpg
data/obj/frame132_jpg.rf.4d5da0c8a138fba8bce7e7aad9dd3a6d.jpg
data/obj/frame133_jpg.rf.d7b8713f66c2d4ddfa66800275d87dce.jpg
data/obj/frame134_jpg.rf.83b23672a5a34095f7ccd3ffb89ba5ae.jpg
data/obj/frame135_jpg.rf.b04e59cec4127e34ba07a775710ad047.jpg
data/obj/frame136_jpg.rf.9320926c9e80adae88adebed8299d6d7.jpg
data/obj/frame137_jpg.rf.4ed99547f4c32c2cdd4e20d604c78098.jpg
data/obj/frame138_jpg.rf.236c43771c71cda557cf60fb921ab9d8.jpg
data/obj/frame139_jpg.rf.cc88bc40dbc2a7013984f0a0e7234ed5.jpg
data/obj/frame13_jpg.rf.7e93025f1f3024f8d6661c3f2ff84ead.jpg
data/obj/frame140_jpg.rf.ddb29e843f13460f32db982684a317a7.jpg
data/obj/frame141_jpg.rf.ca7386d94a89d2d7250f66b8a3702efc.jpg
data/obj/frame142_jpg.rf.86e90a44fcb24ddf81aec9c5213414e1.jpg
data/obj/frame143_jpg.rf.02ca3e221a3d54f916f5eebdc2a19b0e.jpg
data/obj/frame146_jpg.rf.0fbb1b6d0f35110dcf507e40fe3d7930.jpg
data/obj/frame147_jpg.rf.075ddef1874ab89c92d230e4c172cb9f.jpg
data/obj/frame149_jpg.rf.79c67209d632cd71985bfa1533b3a7b9.jpg
data/obj/frame14_jpg.rf.c05984927d8325315af273fd9722e661.jpg
data/obj/frame150_jpg.rf.6ad392dd9ffbccb50a1e25d4f6894308.jpg
data/obj/frame151_jpg.rf.e7bd31ac76aff0e166b0df498bbe0982.jpg
data/obj/frame152_jpg.rf.660ea41dc313c019a534d5ed21806469.jpg
data/obj/frame153_jpg.rf.72379d1b739afe6110d0aaa5768c851a.jpg
data/obj/frame154_jpg.rf.add79e1148fb77bc83807a90ecac5d76.jpg
data/obj/frame155_jpg.rf.6d4c06e4b2455117358e77b49c92a1c2.jpg
data/obj/frame156_jpg.rf.90ef72e217e3382fcea11527719c18da.jpg
data/obj/frame157_jpg.rf.64e015d0a65cf724f969c3bd9ed53c51.jpg
data/obj/frame158_jpg.rf.e7023542a11fa8df4e87c852046ba38e.jpg
data/obj/frame159_jpg.rf.715c48f54fd22db4828307bafc9abf85.jpg
data/obj/frame15_jpg.rf.f186f664a45b46a8c5a74f4527c9a1f6.jpg
data/obj/frame161_jpg.rf.af67ee544b49b09fafdf667ca2d42224.jpg
data/obj/frame163_jpg.rf.54e484d0d5fffb353a864de969bfe4f4.jpg
data/obj/frame165_jpg.rf.eb499b2c7fab55d0d0581e3e25917908.jpg
data/obj/frame167_jpg.rf.860bdbe253740fc2c797127970dba999.jpg
data/obj/frame168_jpg.rf.a6a428bef26a8d2d88c907d2e850ff9a.jpg
data/obj/frame169_jpg.rf.08ef3430cd9bfec53a6de7649179d1b2.jpg
data/obj/frame16_jpg.rf.425ac662ba2e9acab9ec52fc63389cb2.jpg
data/obj/frame170_jpg.rf.46eaa40b2bdf63effbc50ac85af9c298.jpg
data/obj/frame172_jpg.rf.ef9979979d18c0dd1986e0016073eab8.jpg
data/obj/frame173_jpg.rf.d9a6413be4a03d35fb0f00b8209a55a3.jpg
data/obj/frame174_jpg.rf.e750e9985e100332677a57bfc6136935.jpg
data/obj/frame176_jpg.rf.9c8d03289892013bdb1cfb6d4ce1a92b.jpg
data/obj/frame178_jpg.rf.73747413df0b02e6a37c0b8bd1f97d4c.jpg
data/obj/frame179_jpg.rf.84f36e9b0ade1b910ae77630798c4b6d.jpg
data/obj/frame181_jpg.rf.753f3522b3883927ea4d3e60fa494747.jpg
data/obj/frame182_jpg.rf.8a1a955968492b32c3fae54bfe25dd8e.jpg
data/obj/frame183_jpg.rf.3cd81072798ba86379f20fccd8699655.jpg
data/obj/frame184_jpg.rf.99eba192a34456f208f10c2e242f211a.jpg
data/obj/frame185_jpg.rf.f253c91a4bbbcf21c9103d800dce68c8.jpg
data/obj/frame186_jpg.rf.0c2c4cbdf732a19e5a150ebabc9ceb66.jpg
data/obj/frame187_jpg.rf.d257649a38a2b6181075f1d233ff8e85.jpg
data/obj/frame188_jpg.rf.f5aaaba8fdce00d2f8999018315057b9.jpg
data/obj/frame18_jpg.rf.e8c444e76851e6b11e0d51187ea1b160.jpg
data/obj/frame190_jpg.rf.81d557b0eea912b761d91ee2eb58f7bf.jpg
data/obj/frame191_jpg.rf.fcb6a657618ebb6faa8623b468f8d82d.jpg
data/obj/frame194_jpg.rf.5a3a088aa2c24dfcb9abd6c5426406d4.jpg
data/obj/frame196_jpg.rf.6faef4c89d23f257cf004977e7f39bfd.jpg
data/obj/frame197_jpg.rf.650318b54324afd484e5989199d067fb.jpg
data/obj/frame198_jpg.rf.e7a89c53ee6782db5a177afa20e17477.jpg
data/obj/frame199_jpg.rf.914f1f357f916a36a60737ec2c6ec6a3.jpg
data/obj/frame19_jpg.rf.9660f9ee22780db927130047dd018f43.jpg
data/obj/frame200_jpg.rf.f8ad5264d786a8eb2fca4503ba5b6733.jpg
data/obj/frame201_jpg.rf.1ea0e902f0ff623ffa0fabc0f86cc3d2.jpg
data/obj/frame202_jpg.rf.1ef76c0a5b5f064fdfbd1fb6992cddb2.jpg
data/obj/frame203_jpg.rf.64dae3594c0a03665495bbe9d7527244.jpg
data/obj/frame204_jpg.rf.e43db2bd80dc2e3f42a0b7e30eb0e45e.jpg
data/obj/frame205_jpg.rf.8ba56d09f7690feb5c4480957c12a1a7.jpg
data/obj/frame209_jpg.rf.e823f8cfde7da4862bca0027f0558b27.jpg
data/obj/frame20_jpg.rf.b3d2ed6150b396a58f59e54fc7323558.jpg
data/obj/frame211_jpg.rf.0ea0f810b868edeebb2435e7ee84c7cf.jpg
data/obj/frame212_jpg.rf.ccfeca482baff460a72c7d793e6ccba6.jpg
data/obj/frame213_jpg.rf.9c8762c187571df39c243a321f6e45ed.jpg
data/obj/frame214_jpg.rf.4292991cf63607560941f7ad21766af8.jpg
data/obj/frame217_jpg.rf.83b5741e947709479aade1dabb2961cf.jpg
data/obj/frame218_jpg.rf.1a0cbc6958fa2fa8a5f6e6fb0741d1fb.jpg
data/obj/frame21_jpg.rf.ab83cf0c4476dbeb9448eac20e39576e.jpg
data/obj/frame221_jpg.rf.e9bf44de909d045fa83f339cdaa8a8df.jpg
data/obj/frame222_jpg.rf.cdd09eb6fe9fe3e399bd2e54820679b9.jpg
data/obj/frame223_jpg.rf.5c71220b1bdcc84bbbe228ec620e8e0d.jpg
data/obj/frame224_jpg.rf.afb815c861a79b5704f0f64835f31857.jpg
data/obj/frame225_jpg.rf.b0ca8c19471146f8645bad9e454bb2cd.jpg
data/obj/frame227_jpg.rf.87a8f28f43c395fd9d3a356e46c2f00e.jpg
data/obj/frame228_jpg.rf.d40ff8fe9410c6c95bd067ab727371f7.jpg
data/obj/frame229_jpg.rf.1b7e660559df691f3d4d9a0e51393f33.jpg
data/obj/frame22_jpg.rf.959899195a8e28d22af6b05d3f0ee8ad.jpg
data/obj/frame230_jpg.rf.a3198a0d49da07ab66e6fd05afda1127.jpg
data/obj/frame232_jpg.rf.80d57ba21cce3a2fb2705429235215a8.jpg
data/obj/frame233_jpg.rf.ac628459f412471c028707ee61ba88b0.jpg
data/obj/frame234_jpg.rf.1ba83767ee6126899f3e428a57f3f283.jpg
data/obj/frame237_jpg.rf.400b73df04cc9a86f00aa14b2e3b9e36.jpg
data/obj/frame238_jpg.rf.b3b44cedb56f66c633d3f2b8390f7781.jpg
data/obj/frame239_jpg.rf.63e0775bcfa48415fca1588b7a98f6e6.jpg
data/obj/frame241_jpg.rf.0cd2dc29b9cc4c48cb66e6dd29c48652.jpg
data/obj/frame242_jpg.rf.4fa07e8e3c7786714a2a2adcfbe1d7b9.jpg
data/obj/frame243_jpg.rf.9b4a8186e415a30e0d6589d826735c1f.jpg
data/obj/frame245_jpg.rf.43898a2b1967475dffb644a7c3e0ca5c.jpg
data/obj/frame246_jpg.rf.5e5b032cd35968c78cf17a980b630ca4.jpg
data/obj/frame248_jpg.rf.13712351e25c9330ddde6e21735ee7ed.jpg
data/obj/frame24_jpg.rf.bb9429a5e34bf751b199e6f2fdfa846e.jpg
data/obj/frame250_jpg.rf.0dbee69951a3738e43bc0abaace5bd9f.jpg
data/obj/frame251_jpg.rf.686c195f3f29e9d57f6dfd510b5cfb37.jpg
data/obj/frame252_jpg.rf.5277de12f976804b98f1401e4dd4a7d2.jpg
data/obj/frame253_jpg.rf.2d04e6bf8d98eec7735b5d7099035f43.jpg
data/obj/frame254_jpg.rf.74859247e180524acc964040bb9d4910.jpg
data/obj/frame256_jpg.rf.69408fc4c067236bed30c9ae2b6e406a.jpg
data/obj/frame257_jpg.rf.7eeec0b27fa9e4497238898d3711ee65.jpg
data/obj/frame258_jpg.rf.76c451370ba64954022e393f8f1949ed.jpg
data/obj/frame259_jpg.rf.1cb03276a91ef105cdc5b32594ac0379.jpg
data/obj/frame25_jpg.rf.082a4c503d0072da60b188e412595044.jpg
data/obj/frame262_jpg.rf.d1f5ff20f14c2e6e990f8041f9b3e0db.jpg
data/obj/frame263_jpg.rf.84caa5624d40e0b9a45aa65a0f3574c8.jpg
data/obj/frame264_jpg.rf.e78cacb8f0959276e77e5688b3e58ebb.jpg
data/obj/frame265_jpg.rf.41fb6cce8773e7fee78853f3a845cde1.jpg
data/obj/frame266_jpg.rf.f9b1ea460774f939aa8215d94534da49.jpg
data/obj/frame267_jpg.rf.4bb3334e94047fc961c28720d830ff9d.jpg
data/obj/frame268_jpg.rf.e3c2251ab0a63572019361d3947d6add.jpg
data/obj/frame269_jpg.rf.ab21fe33b1cbd04871cd4f7750547d4b.jpg
data/obj/frame26_jpg.rf.00139e20ee2610f20e6cef323fbb1db5.jpg
data/obj/frame271_jpg.rf.c6b2b08bad8c9fa12d5ab9f0192879a7.jpg
data/obj/frame272_jpg.rf.fe43345a5deb0a3ff701a01669aa8d6b.jpg
data/obj/frame273_jpg.rf.8103d68b1d6c206939b6c9fe7bfc32a3.jpg
data/obj/frame274_jpg.rf.8b30c23a85871ce7ab19a3bfea2ae44f.jpg
data/obj/frame275_jpg.rf.1a01bbb3760e87e2665d86f1300c1327.jpg
data/obj/frame276_jpg.rf.b8a958c1a0d124f3d7e204816e2627aa.jpg
data/obj/frame277_jpg.rf.e1d8d5eada9a547341f4e40508b2e2b2.jpg
data/obj/frame279_jpg.rf.01d1e0bcbc68bac18ead64deda6c69c2.jpg
data/obj/frame27_jpg.rf.119b502ceb5d14b875421298933203ea.jpg
data/obj/frame281_jpg.rf.a0cffb100b978e31b72071eb9b393a0f.jpg
data/obj/frame283_jpg.rf.205efa84f6120e602307209fd971c25a.jpg
data/obj/frame284_jpg.rf.66bc58ccff996f286ac35a5e922c44c9.jpg
data/obj/frame286_jpg.rf.f6199267efd83ef04111e6c5bda53a3c.jpg
data/obj/frame288_jpg.rf.0869d452088dc2e43fd7486d2e6f070c.jpg
data/obj/frame290_jpg.rf.02bfd8fa8d71033c66d20c680a699c50.jpg
data/obj/frame292_jpg.rf.d290274ff62695008afd0b8d975b9a29.jpg
data/obj/frame294_jpg.rf.4cf096857a971857640a2bd081922c92.jpg
data/obj/frame295_jpg.rf.172ce4cbc6247f86f1393dbfeca76a54.jpg
data/obj/frame296_jpg.rf.6949b7141712d55566dd7a5a018d8db8.jpg
data/obj/frame298_jpg.rf.b9969fc91ceb733f23fb5bb6ed022e88.jpg
data/obj/frame29_jpg.rf.bac71608681b3d17df00fcc7e2590b75.jpg
data/obj/frame2_jpg.rf.b692d12ecb3dc5fe082eaa0e54293bd7.jpg
data/obj/frame300_jpg.rf.deda1b24911dca7ee526f659e45e62a0.jpg
data/obj/frame301_jpg.rf.4ae9fd82c560064a2a321d22da9e2fb6.jpg
data/obj/frame302_jpg.rf.8883eb8fdb3c340b5624e4cd91545473.jpg
data/obj/frame303_jpg.rf.0535096aeb753b5d1ca452cdad9ee070.jpg
data/obj/frame304_jpg.rf.50e72cb5a2a76b349adefc50170d83be.jpg
data/obj/frame305_jpg.rf.473ecac7e93fa3d7e9fb03aff59467e0.jpg
data/obj/frame307_jpg.rf.d8cbe8750d95b0bb8280d04715cda9f2.jpg
data/obj/frame308_jpg.rf.45aa8b71be3c2bd693e53604df92415a.jpg
data/obj/frame309_jpg.rf.f1980be21a9e265c2e03e1b8f44ad996.jpg
data/obj/frame30_jpg.rf.7b381ffca675bc1d88fcf9dd6cc6c199.jpg
data/obj/frame310_jpg.rf.e3364d55e30a799fb65f17c0106ee8cc.jpg
data/obj/frame311_jpg.rf.4e18e50eaef032aba91ba95715f7fad0.jpg
data/obj/frame312_jpg.rf.3c1d3150a33b4c3bf73fae025a2308d1.jpg
data/obj/frame313_jpg.rf.c6993e0d9d0ed1042e40261aef72e43f.jpg
data/obj/frame314_jpg.rf.9e4b49402b3b404f736e74b339133833.jpg
data/obj/frame315_jpg.rf.ffade9c887304100b6e1fc48b17a57a4.jpg
data/obj/frame316_jpg.rf.6be9cae24d4c373da8bc687c4fb1f5f1.jpg
data/obj/frame317_jpg.rf.2781185f784ee841880ac6d03a811a60.jpg
data/obj/frame318_jpg.rf.cfb560b3129fac04c6e6145f7f778e03.jpg
data/obj/frame319_jpg.rf.8fb1e579a997d50426a745680cf54286.jpg
data/obj/frame320_jpg.rf.74861a689620ef94069ef4d55185ad7f.jpg
data/obj/frame321_jpg.rf.221c5127f6b53e956950b859394f2df0.jpg
data/obj/frame322_jpg.rf.6c5b20f3a42edf3ab420d9261bd0e65f.jpg
data/obj/frame323_jpg.rf.9cb02f18e427c656db23e5a6d136f3a7.jpg
data/obj/frame326_jpg.rf.b061655d31998e7e13a9657102844df6.jpg
data/obj/frame327_jpg.rf.5da99defb51a1c997a937952d5afa1b2.jpg
data/obj/frame328_jpg.rf.1e454b18b8350b5d83c7d992a052fbe0.jpg
data/obj/frame32_jpg.rf.44108eb4ac58a318bbc1c3bc83c6b11d.jpg
data/obj/frame330_jpg.rf.3da5d69c0b8c475101aeb00ab738fc1b.jpg
data/obj/frame331_jpg.rf.ab9b515ea7057e46db42c028a4f3a51b.jpg
data/obj/frame332_jpg.rf.5b023dc9d923ef026c674e768e6b3dba.jpg
data/obj/frame333_jpg.rf.44b96d6e3825319f0d0ab3a1f3a95b4d.jpg
data/obj/frame334_jpg.rf.c6abeb2ece65ea18e3e3e96788de102d.jpg
data/obj/frame335_jpg.rf.78ed56d6f8316f6dc00df68423b3f6ec.jpg
data/obj/frame33_jpg.rf.e310e00af85c419fe5a5fe63954127b6.jpg
data/obj/frame340_jpg.rf.cc3cbe12b8fd1bad003b65b162243974.jpg
data/obj/frame342_jpg.rf.a5a7119a8cd6347c4f08c4aa89950358.jpg
data/obj/frame343_jpg.rf.11d26e58fafdd6d580ed804ed5f51b53.jpg
data/obj/frame344_jpg.rf.540f704b303f5733478b80c8b49f8af7.jpg
data/obj/frame345_jpg.rf.1a9c3acc4a925dba62bdae5b7fac890e.jpg
data/obj/frame346_jpg.rf.0d821256c7644e47f808c993916b321c.jpg
data/obj/frame347_jpg.rf.b525ecd49ebd318a965901a4ea7ddad1.jpg
data/obj/frame349_jpg.rf.2906bf8471f981d39b5133676cd5970f.jpg
data/obj/frame34_jpg.rf.85a92f506ed039534d9c5f1639c88672.jpg
data/obj/frame350_jpg.rf.02ed6473cf21f137d37d857f50b2175e.jpg
data/obj/frame352_jpg.rf.5bc4f27254882d5b353eaed1d3848296.jpg
data/obj/frame353_jpg.rf.3e9168c7d587b12f7bafda7ce6e0f4d3.jpg
data/obj/frame354_jpg.rf.65203ad8a3943f7b6ff103fd1d060199.jpg
data/obj/frame355_jpg.rf.d521a0e6b1e09fd2b6308e595b30d438.jpg
data/obj/frame356_jpg.rf.30b80c6b85bf52622aa65e3e491e5001.jpg
data/obj/frame357_jpg.rf.7798c76a36b8528163df51d17e2cbce4.jpg
data/obj/frame359_jpg.rf.177a63d77786aa603863ca15e3b8e782.jpg
data/obj/frame35_jpg.rf.0799646f4689f50c6745f791b06ee9c2.jpg
data/obj/frame360_jpg.rf.77c74859b051cd25fd2d63f348c8b5ba.jpg
data/obj/frame361_jpg.rf.4c11b25ff702f7f0024361c49bcaba9f.jpg
data/obj/frame363_jpg.rf.019e66bf0db44ce6420313acd032c410.jpg
data/obj/frame364_jpg.rf.0acc27a39fb579e5a3604eba6076c6f5.jpg
data/obj/frame365_jpg.rf.5726612225672b0068636226d00915d3.jpg
data/obj/frame366_jpg.rf.459b63a21e26e8a848c187a6f0052fdd.jpg
data/obj/frame367_jpg.rf.b845bf9f407adf2dffe4c354fa5678c4.jpg
data/obj/frame368_jpg.rf.89fb6568b529418db134de4e0814ed94.jpg
data/obj/frame369_jpg.rf.2565abb6f27b6198cb5df4f5e418563f.jpg
data/obj/frame36_jpg.rf.ea735bdb02e7f5e46149459af9661b29.jpg
data/obj/frame371_jpg.rf.db1b941ac528cebfa7d151c1f8de97d5.jpg
data/obj/frame373_jpg.rf.f25e9627dbe478a2d65583017b022c72.jpg
data/obj/frame374_jpg.rf.80cb5a7dbcb85de90dfb2732994cf339.jpg
data/obj/frame375_jpg.rf.99ad17a58ad4b143241689ae72541e81.jpg
data/obj/frame376_jpg.rf.ef592e8f843613a9fdea0c1b47f6ab2c.jpg
data/obj/frame377_jpg.rf.c2580749fafd958a1a9ca4a5c3c5b8e5.jpg
data/obj/frame380_jpg.rf.487c960ddb3309fb8409b4571b7979fb.jpg
data/obj/frame381_jpg.rf.b0346f34463473a6282f4c7fd406765a.jpg
data/obj/frame382_jpg.rf.ff5c6fe8c85c94f98df10e34da637b4d.jpg
data/obj/frame383_jpg.rf.a94d2309e5da3ee44645aae3899e8155.jpg
data/obj/frame384_jpg.rf.9aeb6003c5b84fd1b53cc5be3f75c717.jpg
data/obj/frame387_jpg.rf.03b3a9a062c0db671cbc25eaed5ca9cb.jpg
data/obj/frame388_jpg.rf.a619ef9c9ff2a24a56b16aa360fd9548.jpg
data/obj/frame389_jpg.rf.0bfa9b0d8737c8bd79470a53fb72ba71.jpg
data/obj/frame38_jpg.rf.dbffd9f07a1b4dce05fff4208b16211e.jpg
data/obj/frame390_jpg.rf.948a51b604555c3738282a0b8f3f8786.jpg
data/obj/frame392_jpg.rf.3c4a34fb6e4669d527667c9754104c92.jpg
data/obj/frame396_jpg.rf.61596a89102cbc02db19845a9394fdaa.jpg
data/obj/frame397_jpg.rf.77b1a0688fcaab0a812d8c62e49058f9.jpg
data/obj/frame399_jpg.rf.b96798497cc5e56e2c60ea4a86cb4179.jpg
data/obj/frame39_jpg.rf.fe421a237cb79ba26ac77e9c8c819711.jpg
data/obj/frame3_jpg.rf.a4a335fc4390211cfd592e860c3005ac.jpg
data/obj/frame402_jpg.rf.c44b4e8fbb355454a7575057287912a0.jpg
data/obj/frame403_jpg.rf.f310f0611287c28198ca60a4b7e2c004.jpg
data/obj/frame404_jpg.rf.38d5b5aaf0f732e5b80ee5a72b59e422.jpg
data/obj/frame405_jpg.rf.2fc8503014cded5ab4427d1ad961f9d5.jpg
data/obj/frame406_jpg.rf.0b4e2547543a54803e12e098cb7b4192.jpg
data/obj/frame408_jpg.rf.42b7c4596cdb5c87f24b0d8972dae2f1.jpg
data/obj/frame409_jpg.rf.971115d56f8c27e22c12872961fe56a8.jpg
data/obj/frame40_jpg.rf.3f0e2f15302b82bcc0fcb92b57205e53.jpg
data/obj/frame410_jpg.rf.7d728125a42ccba35078607342513a59.jpg
data/obj/frame413_jpg.rf.336225df5acf83dd074eb556b8952305.jpg
data/obj/frame414_jpg.rf.b151fd154de6d3bdcfa58636cb2cc494.jpg
data/obj/frame415_jpg.rf.6c7ef678a370f1fe307cb6949562577b.jpg
data/obj/frame416_jpg.rf.2a5719eed8a4682d2d170a7890f3ecd5.jpg
data/obj/frame418_jpg.rf.fdc8bf3ccd98935f14bba37e789f9fd7.jpg
data/obj/frame419_jpg.rf.f3b0c6d9ee620b6ff44fc67d089a5f50.jpg
data/obj/frame41_jpg.rf.02a5f8911808332ac7ce238a312d6276.jpg
data/obj/frame420_jpg.rf.595386fcdc247eae21ccf2ffac6385f4.jpg
data/obj/frame421_jpg.rf.9336d0cd3b9d3f59c8a7f53e686cc348.jpg
data/obj/frame423_jpg.rf.340eafb2b2e4a2788c09f821f1cd0150.jpg
data/obj/frame424_jpg.rf.63999b65f32b516e65871c15e9086d4a.jpg
data/obj/frame426_jpg.rf.74dd254d12702d110115c6abc138801c.jpg
data/obj/frame429_jpg.rf.ce70f67ef661cb9872e6cb5ef8fb672a.jpg
data/obj/frame42_jpg.rf.cebaacffef53df118630dc3bb499e838.jpg
data/obj/frame431_jpg.rf.be10c6ecd9376d6b9feddca1bddf80c6.jpg
data/obj/frame432_jpg.rf.5fb1bd3aa5b1cf45eb27d98cf1779eb0.jpg
data/obj/frame433_jpg.rf.e4605636a8c07dd7f006a0806c8a65bf.jpg
data/obj/frame434_jpg.rf.fa3ec667f0df0f2fdabef0fb3a2d235d.jpg
data/obj/frame435_jpg.rf.48f0624045643fedec883fabcfe27602.jpg
data/obj/frame436_jpg.rf.e3868d92af09a031ccd1f4284a9724c2.jpg
data/obj/frame437_jpg.rf.c485650a2e042863e039fd319bbb528f.jpg
data/obj/frame438_jpg.rf.a7c5a807db71a1b8318efaa4c5376a53.jpg
data/obj/frame440_jpg.rf.115478d38c55f4fa52b395d6f9a96ed6.jpg
data/obj/frame441_jpg.rf.2cdf8a83268f652681e1549811ab1b42.jpg
data/obj/frame443_jpg.rf.d2668e37a66ab7a327de98370751de42.jpg
data/obj/frame444_jpg.rf.af1550e8886a81a80a8da1a242b346f0.jpg
data/obj/frame447_jpg.rf.fea0d6d0c3c06778788705c94676c163.jpg
data/obj/frame44_jpg.rf.5e5a355404a01e71823bd20ca89e999e.jpg
data/obj/frame450_jpg.rf.1aeaf64dccd9d666f87e4973a1b213a0.jpg
data/obj/frame451_jpg.rf.4e62139ab764c92c5b1d797aee4fad93.jpg
data/obj/frame453_jpg.rf.e15df56d9639378c6590f6fea755cc03.jpg
data/obj/frame454_jpg.rf.c435f9e6a4b733307866460cf25f9939.jpg
data/obj/frame455_jpg.rf.ed16ed3c8abe6b2af631ca99207696b1.jpg
data/obj/frame457_jpg.rf.3935ee3541a3bd47a08117eb0d39cb7d.jpg
data/obj/frame458_jpg.rf.2f1ce0e6dedccb86d6cfd0cfb7078429.jpg
data/obj/frame459_jpg.rf.407564e379ca55e4bd754a09a412997e.jpg
data/obj/frame45_jpg.rf.e32370316615f7c44f0ca4a8803a2507.jpg
data/obj/frame460_jpg.rf.9c9a9cc8ff54116ca7432a45e282ce0d.jpg
data/obj/frame461_jpg.rf.288b5a5b104467e5b9d18ff3efa57d57.jpg
data/obj/frame463_jpg.rf.f86b75a351244910540c04360fd3d2aa.jpg
data/obj/frame465_jpg.rf.e63a7bcc018ae89eb0840e878286a7c2.jpg
data/obj/frame466_jpg.rf.bf6931aa988f4e4cc4c79fb99213a0e7.jpg
data/obj/frame468_jpg.rf.6a9f53991a8252ffc2c7b92762a6395a.jpg
data/obj/frame469_jpg.rf.db6bf2f21b4dbd160cc8b8ba33a11e04.jpg
data/obj/frame471_jpg.rf.17b48515d052f05d94f23c8eca160ef1.jpg
data/obj/frame472_jpg.rf.b9546e113ccd961432b12464066b4971.jpg
data/obj/frame473_jpg.rf.0899a81d3ec0e11744f805731a60897f.jpg
data/obj/frame474_jpg.rf.49e415aeba2a4ecd462dec9ee0fb1976.jpg
data/obj/frame475_jpg.rf.6cff9be26252ca3d9177a28b1b96e668.jpg
data/obj/frame476_jpg.rf.08ef4ed3598609ade7aea496ea30b427.jpg
data/obj/frame478_jpg.rf.8d7e7acba93acb0b886fd553d2e1fc73.jpg
data/obj/frame47_jpg.rf.ffcc69c0055c156796f798ed83dfbfdf.jpg
data/obj/frame480_jpg.rf.cead8531f9f233b0d4023e01d4e5693d.jpg
data/obj/frame485_jpg.rf.39ed5d9e179d6d62f085be57d9ce01a7.jpg
data/obj/frame486_jpg.rf.9e3715db1b9d8ab4702aaed031c5b98c.jpg
data/obj/frame489_jpg.rf.2b86038e2a1d970985c9e4a2936f9b27.jpg
data/obj/frame48_jpg.rf.3ad344eda8818204afb9f7b335db67e5.jpg
data/obj/frame492_jpg.rf.07997a7b255f00f52709abae719947a0.jpg
data/obj/frame493_jpg.rf.dcbf2b96d6bb1035ac0e14036d36367a.jpg
data/obj/frame494_jpg.rf.52fcebaf18a08652dba80d0cef968aa5.jpg
data/obj/frame496_jpg.rf.3b1647a2440d94e3cfe880cbd0c0ecda.jpg
data/obj/frame497_jpg.rf.fd7f25a06104a76aade49d4264225634.jpg
data/obj/frame498_jpg.rf.dc9b551f9e6b55d476250af05a5aef1b.jpg
data/obj/frame499_jpg.rf.ca0d0276825d24cca888bccec5d971de.jpg
data/obj/frame49_jpg.rf.750f315f3b03a379783f1edef7adfc88.jpg
data/obj/frame4_jpg.rf.d35a305615405ff8aae87187ff6fe779.jpg
data/obj/frame501_jpg.rf.414b2387f2f634e3a9245d0a66437dda.jpg
data/obj/frame502_jpg.rf.90d239f21fc3051463335d51f0741320.jpg
data/obj/frame504_jpg.rf.cc9f1431e4c2365062f775631e1369c8.jpg
data/obj/frame506_jpg.rf.419fa51486ecfa29ff3addcaf711271e.jpg
data/obj/frame507_jpg.rf.de10927a7534ba3d1859101742330206.jpg
data/obj/frame50_jpg.rf.384539bf8bf0ac4e5f5bbae2586edb86.jpg
data/obj/frame511_jpg.rf.8c8b9d3a1704922b136ef84e718e0f9b.jpg
data/obj/frame515_jpg.rf.a582a0c2a68e4ce4f6a290f6fbe7591e.jpg
data/obj/frame517_jpg.rf.b6c80e0f25b226b1f32adb23f01fb33f.jpg
data/obj/frame518_jpg.rf.e12835e2804b9df80a244b5ae2544a57.jpg
data/obj/frame519_jpg.rf.9c2930c12cca03a5044cf217433bb1a5.jpg
data/obj/frame51_jpg.rf.33cbf9c68d1a5355cfe7fe76e6af72d3.jpg
data/obj/frame521_jpg.rf.fe013e432b64e27f2dcd76bf09a28da3.jpg
data/obj/frame523_jpg.rf.ab5e23a448e0e651b86abcd01faf7863.jpg
data/obj/frame524_jpg.rf.c87c4d2e71e79a6db61113efe01134d5.jpg
data/obj/frame525_jpg.rf.48b182ff373abc3c2d0cdd95e64c1e48.jpg
data/obj/frame527_jpg.rf.795288b47cdf9a6b6f135213a1231982.jpg
data/obj/frame528_jpg.rf.6de7468e1162653b805f686751ddea8d.jpg
data/obj/frame529_jpg.rf.0d6270fe60387db6357d6f2a7673b5a2.jpg
data/obj/frame530_jpg.rf.b45092fbc1f857cde184a473fe149ec7.jpg
data/obj/frame531_jpg.rf.aeaca36a63deeaf07e23321e0d8dc99c.jpg
data/obj/frame532_jpg.rf.5ddbf0d366085d821a62a7538598ae5f.jpg
data/obj/frame533_jpg.rf.40f6c320d8809fbe8fa1f6d8b91127e6.jpg
data/obj/frame534_jpg.rf.9146cb3229d95c22f1e485259d20efd1.jpg
data/obj/frame535_jpg.rf.338b3065893de037da2da40232fcc4ef.jpg
data/obj/frame537_jpg.rf.e9a87c65ba91dba95185d2776a203211.jpg
data/obj/frame539_jpg.rf.d6773ceb565338aed69a82bb3d2d5e62.jpg
data/obj/frame53_jpg.rf.fe5c9d96dafb6c0d4bf64583ace5e7c3.jpg
data/obj/frame540_jpg.rf.e6a0c38e276845138a1e3a502019ba8f.jpg
data/obj/frame541_jpg.rf.e996402c4ee7fe2bc811c87c8c94650a.jpg
data/obj/frame543_jpg.rf.611073a052566bbfbc9701448d2ca6dd.jpg
data/obj/frame544_jpg.rf.72f2858d33a2833206ad38057520fa4f.jpg
data/obj/frame548_jpg.rf.777b3ed709ece4a89684266d0131c326.jpg
data/obj/frame549_jpg.rf.8c3288de95bcfaf28564f429a1b98329.jpg
data/obj/frame550_jpg.rf.9600d95c9ea3720fc24155924189ba15.jpg
data/obj/frame551_jpg.rf.48206412ee70361699c711166d2f93a4.jpg
data/obj/frame552_jpg.rf.9bf1bf5628b1a87c8c30fa1b7d847a0f.jpg
data/obj/frame554_jpg.rf.1101bd62ed2edf786b081545f433d929.jpg
data/obj/frame555_jpg.rf.1f3dbe745efeb20441736fb6bb213c09.jpg
data/obj/frame556_jpg.rf.8a512632d547fbaa7578cfa7fe1e2fc3.jpg
data/obj/frame558_jpg.rf.84d684b117b0e6b163868aa19ba136c9.jpg
data/obj/frame559_jpg.rf.13f6769c65eb3a9336792b193eb33bc1.jpg
data/obj/frame55_jpg.rf.f357d33202ec286beaf9988126687cac.jpg
data/obj/frame560_jpg.rf.053ba95197ffda4ba78ad138f58ef7c0.jpg
data/obj/frame565_jpg.rf.a5e3809dccae0883f539ce97ecf1c1b2.jpg
data/obj/frame567_jpg.rf.702a5f8191611c4cd1147cabae1169bf.jpg
data/obj/frame568_jpg.rf.8d23b3f5f210b9c5108cd91111333532.jpg
data/obj/frame570_jpg.rf.01376417abf042ab7c75c527dcb405c6.jpg
data/obj/frame571_jpg.rf.93d8e92ac6d359023095c1a3639253b4.jpg
data/obj/frame574_jpg.rf.44c9e93730a94cd97e2f6d702a5014c1.jpg
data/obj/frame575_jpg.rf.d1d35d149e30e6d3f1e2a4e236359bbc.jpg
data/obj/frame576_jpg.rf.9320430db1ca2f6430357f7ce3e0c182.jpg
data/obj/frame578_jpg.rf.69fb6042e511832e591272c7ddb69bc3.jpg
data/obj/frame579_jpg.rf.9b7708b81bbed795ff489155a5b7ecc6.jpg
data/obj/frame581_jpg.rf.74b752dafddeece01fefebfd7141bf39.jpg
data/obj/frame583_jpg.rf.2a342c0a48b46335d8380f2ac9cda925.jpg
data/obj/frame584_jpg.rf.73cb0d56974b37b8557526e9e0c50ccf.jpg
data/obj/frame589_jpg.rf.bc73d69e3ac11d90f6e942a8d360b984.jpg
data/obj/frame58_jpg.rf.d1a7dbe702652211d39bf1caf14928fe.jpg
data/obj/frame592_jpg.rf.ba294382d45333cb7ff211f3d5df9e71.jpg
data/obj/frame594_jpg.rf.8b2131bc6adfd2619480334257f92c12.jpg
data/obj/frame595_jpg.rf.e4c717cbf3012ccfcae7f9a5999bbedc.jpg
data/obj/frame596_jpg.rf.e3b647234a119672a5ae0a757ed0f80b.jpg
data/obj/frame597_jpg.rf.1e92136431d57787165e237e056c236f.jpg
data/obj/frame599_jpg.rf.7a6436d4564a85ad3ac7dd16a689e1dd.jpg
data/obj/frame5_jpg.rf.73937996f465ddb22bda9d2febcfaa6d.jpg
data/obj/frame601_jpg.rf.58e1150ea43c297799a7646bbdaefae6.jpg
data/obj/frame602_jpg.rf.1a55199039d6806f6c949e09188dc830.jpg
data/obj/frame603_jpg.rf.18d9a615f918e227183b636462d2e210.jpg
data/obj/frame604_jpg.rf.8819f4c278e67864270c2902530b8461.jpg
data/obj/frame605_jpg.rf.36bdc4f6959c9b6762f384af42f6d213.jpg
data/obj/frame606_jpg.rf.80d33460744366ef32a804788fad6041.jpg
data/obj/frame607_jpg.rf.43998dad18738c66ed64e8f22a008cef.jpg
data/obj/frame608_jpg.rf.532c29ea7f28f29405622cb677689090.jpg
data/obj/frame609_jpg.rf.253d2fcfa5d9403628621652053a9d16.jpg
data/obj/frame610_jpg.rf.27328af235372cca38cee5a9b4f4a3f9.jpg
data/obj/frame611_jpg.rf.50312ca2420275aee35b712b9406d0fb.jpg
data/obj/frame613_jpg.rf.57148f539f6f606c49273523cb60208a.jpg
data/obj/frame616_jpg.rf.c14e1968e30bf919cf2e62b5cdb83faa.jpg
data/obj/frame618_jpg.rf.d070d7dcfb61696c28a0ae9baaab3f9e.jpg
data/obj/frame619_jpg.rf.482502ea23a45d678fa7e27a08b49e79.jpg
data/obj/frame61_jpg.rf.f9f9e16b6e37c763be35cd248ee9a3b6.jpg
data/obj/frame620_jpg.rf.20dbfdbacfb747c94efba6c326ee4733.jpg
data/obj/frame621_jpg.rf.1a26db10788c466a22cf6da39df8073a.jpg
data/obj/frame623_jpg.rf.e2d2ac45963559ef68ed7c31609708ee.jpg
data/obj/frame624_jpg.rf.6ca352738ecb67a71c9056ebf7cae75b.jpg
data/obj/frame625_jpg.rf.c97c63898148fd9e2fce40c2e675fe40.jpg
data/obj/frame626_jpg.rf.006fba7eaad8b1470801019f6488829c.jpg
data/obj/frame627_jpg.rf.4a16905bb79dc3e8d15417030a2a5589.jpg
data/obj/frame628_jpg.rf.2768143d546cc09da549e6bc056b213d.jpg
data/obj/frame62_jpg.rf.3871f9d7788ff6db9d4dd88076a67814.jpg
data/obj/frame630_jpg.rf.3fb34f57c0875af12874c57162471e1a.jpg
data/obj/frame632_jpg.rf.70b29b660be45148e6b0e7e77a22da26.jpg
data/obj/frame633_jpg.rf.7f538847ca4518c5564213c0cf3b7f95.jpg
data/obj/frame636_jpg.rf.62e6b5c7b8b057b106ae5435097be506.jpg
data/obj/frame637_jpg.rf.460b463880bf4ee8c24d6aff5185c868.jpg
data/obj/frame638_jpg.rf.e752faac046f5f898ca7d62f9ca680a7.jpg
data/obj/frame639_jpg.rf.c8ec0dabae849ec662cdde28e86c102f.jpg
data/obj/frame63_jpg.rf.462cfe14e2e5662519f3773a23ced328.jpg
data/obj/frame641_jpg.rf.f74d3939e6659774128f321921800b87.jpg
data/obj/frame644_jpg.rf.da4b248896091dd0a9e02dc34027ca43.jpg
data/obj/frame646_jpg.rf.5150c0851ba0cf37eb868ebcbf13b43c.jpg
data/obj/frame648_jpg.rf.c60e278a5f5393400ae666cc2bb8d638.jpg
data/obj/frame64_jpg.rf.164b0bc56d20395623fece50c0559a75.jpg
data/obj/frame650_jpg.rf.963d90dfb8d3ec1356c7e1a34e03d7ba.jpg
data/obj/frame651_jpg.rf.326c11ac2dab4abdbc79ce76c85fbd04.jpg
data/obj/frame652_jpg.rf.76eba4874950b4d4d135f3718dc583d1.jpg
data/obj/frame655_jpg.rf.64c72ef8311242d39d38b29de68c9a32.jpg
data/obj/frame656_jpg.rf.4047ca387643964c02f44752119b9fb6.jpg
data/obj/frame657_jpg.rf.0318f427aa0a5074ad4ab74f5475a9d9.jpg
data/obj/frame658_jpg.rf.0badd1fcdb820aec046d9997c020e7e9.jpg
data/obj/frame659_jpg.rf.77681bb621ca28b97ac61ba053dd34cd.jpg
data/obj/frame660_jpg.rf.47119880a23caa344e627c6eabc2bfdc.jpg
data/obj/frame661_jpg.rf.bc4d4ad1ca8b7bd3aa39ad95a249c5eb.jpg
data/obj/frame663_jpg.rf.27bde872e60f2ea15c9cab96428cd283.jpg
data/obj/frame666_jpg.rf.c5c4ebf0f19a8004ea553889a0e9d8ec.jpg
data/obj/frame668_jpg.rf.4f4378e3a56d2368a02cdc9904f47fea.jpg
data/obj/frame66_jpg.rf.adbab98a1d489b86857df209b8ab2993.jpg
data/obj/frame670_jpg.rf.72813f1cebab2c005c74e71f7f1eb8d5.jpg
data/obj/frame671_jpg.rf.db548a6f3eaaa7954ef577f823192c94.jpg
data/obj/frame672_jpg.rf.561ce03df030365628f319337aaf8e67.jpg
data/obj/frame673_jpg.rf.b78d88d085daaa1ea5390977fadc659b.jpg
data/obj/frame674_jpg.rf.bf640e3fb8825c5824da0ed79d78d861.jpg
data/obj/frame678_jpg.rf.58500e2a36179ac18abca7288f521580.jpg
data/obj/frame679_jpg.rf.7f895f5bf0871cf947cbf050e1179ea4.jpg
data/obj/frame67_jpg.rf.529c7197d124b7adb2e89a5d69c28d3f.jpg
data/obj/frame681_jpg.rf.24620e785cc0670bb037bfb8b3ccbe0a.jpg
data/obj/frame682_jpg.rf.9194375949d90b5a76d36ebffc9a8a85.jpg
data/obj/frame683_jpg.rf.a857f0ed8bd4e50334f81249fdd84e0c.jpg
data/obj/frame685_jpg.rf.f9df47e34304280f38707128b8f1315a.jpg
data/obj/frame686_jpg.rf.dfcb0e3d22f3faa5a9a3fe8a0ca21575.jpg
data/obj/frame687_jpg.rf.45b9e5a909c83d59c56bfeab9da2524f.jpg
data/obj/frame688_jpg.rf.cbbf5877ec4b7c7abcc4fa2118c253f7.jpg
data/obj/frame68_jpg.rf.413bb75e5b4c6eca40681af2dc557667.jpg
data/obj/frame690_jpg.rf.63525952dd06b4b16ee14ccfef4af627.jpg
data/obj/frame691_jpg.rf.8e9974489cf663d1becc8e581f66375a.jpg
data/obj/frame695_jpg.rf.b3198073ad46acc6400a7b6fe598df4d.jpg
data/obj/frame698_jpg.rf.29dee879a9b495ee8f5c80d2067d883a.jpg
data/obj/frame69_jpg.rf.412e00a6f05e18d107875532330a7705.jpg
data/obj/frame700_jpg.rf.08e325820d1288a6c5106b2866b0e40d.jpg
data/obj/frame702_jpg.rf.20904735739d91f9a9b7adc79005689c.jpg
data/obj/frame703_jpg.rf.1cdba75dacfb063955f47d6b3a5b1ddf.jpg
data/obj/frame704_jpg.rf.68150c4bffc6b649eec9b6320592343e.jpg
data/obj/frame706_jpg.rf.4ae03a3ffc1f36e2f1196df533b63fc0.jpg
data/obj/frame708_jpg.rf.390b265c64b77864fac5a64ba93b1df1.jpg
data/obj/frame709_jpg.rf.3495652771f1d6df53662fa533715af7.jpg
data/obj/frame710_jpg.rf.56bc80fe800cf17bcf1fcfbf851959c6.jpg
data/obj/frame713_jpg.rf.0fc7a31e93e71853438e721e4d0e4b7c.jpg
data/obj/frame715_jpg.rf.db3e04c2e9875d324e77a624c2c3da81.jpg
data/obj/frame716_jpg.rf.56b8cc2a38d57b82b3987f7924500f2d.jpg
data/obj/frame717_jpg.rf.fc8840efa231a1ea5dba73378580c764.jpg
data/obj/frame718_jpg.rf.bada4c61cf6aa847ce1a164272db1ec0.jpg
data/obj/frame719_jpg.rf.0a7a962e7e436f3c0b6898911ce82d47.jpg
data/obj/frame71_jpg.rf.355b6590e5ec51092bb16dd961767cc8.jpg
data/obj/frame723_jpg.rf.80242552be630cbaed9a4d77197e0361.jpg
data/obj/frame724_jpg.rf.3f763dd372f9c6fd4b8ce152af3171ac.jpg
data/obj/frame726_jpg.rf.eaa45ec012fde79157fcc21e092d2fad.jpg
data/obj/frame727_jpg.rf.9ff077834bf26e1aa361a56633ed88fb.jpg
data/obj/frame728_jpg.rf.5a3c1e0c5324811c4b0217f6e951c374.jpg
data/obj/frame729_jpg.rf.b3a1ac2c9c216da1f4da7b6b3db639d4.jpg
data/obj/frame72_jpg.rf.f88659d47cfbfc80a21a7e07b924e363.jpg
data/obj/frame730_jpg.rf.ecb8c59f782b8f2ccf46f0cb9c526bde.jpg
data/obj/frame732_jpg.rf.89829b8dc63fa0fde540874a36bc2fb7.jpg
data/obj/frame735_jpg.rf.21b9dec48ca5569659be6e8dd06454c8.jpg
data/obj/frame737_jpg.rf.5b1e14d917cbaa4b8d4416618196f654.jpg
data/obj/frame739_jpg.rf.2a03f593cadb86536a90a44a7d1c7837.jpg
data/obj/frame740_jpg.rf.569142fc7ad5bfb71e7506fe8fc2772f.jpg
data/obj/frame742_jpg.rf.9862a30435a5813e9bc72b7b4fa907fc.jpg
data/obj/frame747_jpg.rf.0d0c3f65f00a257cdf808861b8e8a486.jpg
data/obj/frame748_jpg.rf.6dc056e792cd9a35b41dcccdd7a4df09.jpg
data/obj/frame749_jpg.rf.e31c8699cd285d1a72cc5457de5123c8.jpg
data/obj/frame750_jpg.rf.8541252d2cb6cb5b1f76b0864263bf12.jpg
data/obj/frame751_jpg.rf.9f43c37a715b84b679a645b8a1043112.jpg
data/obj/frame753_jpg.rf.99d8476c2fe21fe762d9dc9e7158d94f.jpg
data/obj/frame755_jpg.rf.8114032944f8b0910ffa0770dee1bcfd.jpg
data/obj/frame756_jpg.rf.e0d60b7085dd91ecae72a942c4e9ed05.jpg
data/obj/frame757_jpg.rf.47c8cdfcd3b5042d34e1a32d0b08b32f.jpg
data/obj/frame758_jpg.rf.0cb8a4d6921719645e807e7b720862bd.jpg
data/obj/frame759_jpg.rf.225ec558475419145a561b88169d23b3.jpg
data/obj/frame75_jpg.rf.5cea1b2999fb718df7b8190e78a98015.jpg
data/obj/frame760_jpg.rf.e192afda31c51a1353069cbb8b0a9fd4.jpg
data/obj/frame761_jpg.rf.2a2b7428cec2adb3f67b4dc2be235ea2.jpg
data/obj/frame762_jpg.rf.c8163287e15eac333153de1373744341.jpg
data/obj/frame763_jpg.rf.7c7edfef56ae1ad57a9627366fd45c1b.jpg
data/obj/frame764_jpg.rf.db025a62bb11a7a18d082c244bf79d2e.jpg
data/obj/frame765_jpg.rf.3c452e2f8d5309ef756e336aed326e63.jpg
data/obj/frame766_jpg.rf.970ef25ad1864fb18f43d6060b2cfbf0.jpg
data/obj/frame767_jpg.rf.a77859fbfa1da1b5173095b5de6494d8.jpg
data/obj/frame769_jpg.rf.b9ed2bb1711935e8ebe2fcc45741e722.jpg
data/obj/frame76_jpg.rf.61122db765e60d6815c5ff488df4b54d.jpg
data/obj/frame770_jpg.rf.a08db9c3d07c9393c7c80d25cf5a5965.jpg
data/obj/frame771_jpg.rf.3ffd7fa9081d019b4686b21dae9daeb2.jpg
data/obj/frame772_jpg.rf.4123206944dcbc8909d99d6399167f3f.jpg
data/obj/frame773_jpg.rf.38de3d9809c135a157f9c70f9a6d237c.jpg
data/obj/frame774_jpg.rf.9c12eff1d1ffd99e1e0522d59b796d6c.jpg
data/obj/frame775_jpg.rf.0d16f1d494cb6e7482df5742ad76bb31.jpg
data/obj/frame776_jpg.rf.a930f445c8265d710d6f4ebfe939d1c1.jpg
data/obj/frame777_jpg.rf.94e21187c76d63856069f808a9849bc9.jpg
data/obj/frame779_jpg.rf.fd6d4cc60eccc7aadd025821715c424a.jpg
data/obj/frame780_jpg.rf.ac2a4d0747a5670f75b4a661341a0ad8.jpg
data/obj/frame782_jpg.rf.8d1ea497ffab6adb3aa7e81276aad950.jpg
data/obj/frame783_jpg.rf.0606bb745a0237d1dd38998fda8651c8.jpg
data/obj/frame784_jpg.rf.facffc3b787babfccdf0ac1a2622b8a5.jpg
data/obj/frame786_jpg.rf.36d8d587385bf882478ad6b026b7be44.jpg
data/obj/frame787_jpg.rf.80e2471550cf4c4369e9fa45a3f8be8d.jpg
data/obj/frame78_jpg.rf.82d08c8173d61b5126a15d87b9e0bb6c.jpg
data/obj/frame790_jpg.rf.309c1c99353d029ae35bc554bf688798.jpg
data/obj/frame791_jpg.rf.4661a3c39376ddd414203ca390f2ec8d.jpg
data/obj/frame792_jpg.rf.16a81d8b390832d5378d32fb0666d34c.jpg
data/obj/frame796_jpg.rf.619f719f277b785821d715e224854091.jpg
data/obj/frame797_jpg.rf.102264904b128c54e302b2e835a87c56.jpg
data/obj/frame798_jpg.rf.1f08e0d268e09c184c2cf607e5837fd1.jpg
data/obj/frame799_jpg.rf.464cdeae7525887ccd3a3fafd3676314.jpg
data/obj/frame7_jpg.rf.465d175f691d5aa45c5330008b55e99c.jpg
data/obj/frame800_jpg.rf.47fafa5387e9cfada12cbf7fcdd7ccbe.jpg
data/obj/frame802_jpg.rf.40c4732ef3537258032d07c3d4527b46.jpg
data/obj/frame803_jpg.rf.750c4f9ea70f687309a1c65c7b9f82be.jpg
data/obj/frame804_jpg.rf.6269ceffe17e8e7f327fd8ed1e8b7532.jpg
data/obj/frame805_jpg.rf.7376aefc60b704154bf1279290a4cf73.jpg
data/obj/frame806_jpg.rf.98f2db09527a4bb7fb279e850923323d.jpg
data/obj/frame807_jpg.rf.0680c52d658677ba7d18871a1195f7f5.jpg
data/obj/frame808_jpg.rf.5b89e640c527b51fe6f392e2b51b0d3c.jpg
data/obj/frame809_jpg.rf.c73f32a8b2782494066193eafd0ac9a6.jpg
data/obj/frame80_jpg.rf.b63d2a1d594031b0ede9b0c17d6ba4a9.jpg
data/obj/frame810_jpg.rf.6161fb422dddd2e9c59b3ae68ab649be.jpg
data/obj/frame811_jpg.rf.d099c042c1102287e90bb9e946f00da7.jpg
data/obj/frame812_jpg.rf.416b3fc4a2f334c199be7d920c2fdfaa.jpg
data/obj/frame814_jpg.rf.97e2aab7e14f1213d5beb3d7a3b9c7c4.jpg
data/obj/frame815_jpg.rf.0c2cc2111279b80b90ff2e5ac2405dec.jpg
data/obj/frame816_jpg.rf.5e586e6e39662049a2af7e56e02b1d14.jpg
data/obj/frame817_jpg.rf.433d44e512c91a2c3aefa31f23493acd.jpg
data/obj/frame819_jpg.rf.0777e9d70c9390adca60e157b63bd695.jpg
data/obj/frame81_jpg.rf.98044024d13f14aee33f954327b9bd96.jpg
data/obj/frame820_jpg.rf.d03a26b4b5a2e11cc438f78b1baa5b65.jpg
data/obj/frame821_jpg.rf.236ef736e4432fc508de53d67167540b.jpg
data/obj/frame825_jpg.rf.3e716bf54040bb8f815e0c88ededd253.jpg
data/obj/frame826_jpg.rf.26395ac3f3fe4e63f47508e0e1ee2c09.jpg
data/obj/frame827_jpg.rf.2ad68c45ab8bade139ee0daa74fcc7f6.jpg
data/obj/frame828_jpg.rf.1c5a480cfb165cef560e6d973622331e.jpg
data/obj/frame829_jpg.rf.52843afeb8e03671318d84c79260731c.jpg
data/obj/frame82_jpg.rf.f9520de604853955441ef439c1a55af1.jpg
data/obj/frame830_jpg.rf.1bcd42b690da8563e4c4f816dc88e260.jpg
data/obj/frame832_jpg.rf.a5db8255bf7ff8dbff3648fb57437130.jpg
data/obj/frame833_jpg.rf.3997444a15f02abe925f517849dfa4a7.jpg
data/obj/frame834_jpg.rf.b0ac5e7bdf2bc003411de01b132abdfb.jpg
data/obj/frame836_jpg.rf.fa7c2613ff728dfff7d6f3f562f72ee6.jpg
data/obj/frame837_jpg.rf.2184ce1e2a4665cdd29c7c413e82039b.jpg
data/obj/frame83_jpg.rf.1b925838ba29e55172908b4bc756c923.jpg
data/obj/frame840_jpg.rf.eca4f51b0608e31eec63578358793e11.jpg
data/obj/frame842_jpg.rf.1df60773fcf74a0ebd83aa7515a7855d.jpg
data/obj/frame843_jpg.rf.c90a5f1e9836dc5290b8a15f8cece76c.jpg
data/obj/frame844_jpg.rf.7e9e5d2448f260bef24bd36325e2bc84.jpg
data/obj/frame846_jpg.rf.a43d86ee3d8de7664ad89bbde5dd31f9.jpg
data/obj/frame847_jpg.rf.f25e03022fe09de7cf247654c0fbd1dc.jpg
data/obj/frame848_jpg.rf.7945f369782d29d942902f118fc647a7.jpg
data/obj/frame849_jpg.rf.2b9131f557746fe64317c93408abf2b0.jpg
data/obj/frame851_jpg.rf.bb2c5a3a589a4e8cea7207da0ea32742.jpg
data/obj/frame852_jpg.rf.8b472506025014f9b00095cc2d477bde.jpg
data/obj/frame855_jpg.rf.c2275a2efa731de6715dbfe575f1f140.jpg
data/obj/frame856_jpg.rf.bab8ed8318152c4efa3ea00054b4d4c5.jpg
data/obj/frame858_jpg.rf.547e87c92b7776659633dcbb428de5dc.jpg
data/obj/frame859_jpg.rf.7de742245f41a7a5e9aaaf3d921722ec.jpg
data/obj/frame860_jpg.rf.6448b62d30b4d75fe147e84ed08314ca.jpg
data/obj/frame861_jpg.rf.2289da1796e3d9958e47639e0e889219.jpg
data/obj/frame862_jpg.rf.766d71883c5bb9b231160651b4309d80.jpg
data/obj/frame863_jpg.rf.c42b0f0b6f0fb0f2787b104f864994bb.jpg
data/obj/frame864_jpg.rf.8bdf802c141fe74838b1a1ffd5a00c8e.jpg
data/obj/frame865_jpg.rf.451b77f4fdd91de9fad6a5f26c6185e8.jpg
data/obj/frame866_jpg.rf.2761069c6040791988b6bc44d5d16358.jpg
data/obj/frame867_jpg.rf.0706808f5f04b0eced5acb49f0a63264.jpg
data/obj/frame868_jpg.rf.ce1b3d40dd6a8d5d84fc077edbb3200b.jpg
data/obj/frame869_jpg.rf.e10b0cc1f6880cb2e2d69aacb2973c12.jpg
data/obj/frame86_jpg.rf.ff712f69193a9525b057a18f483fd289.jpg
data/obj/frame870_jpg.rf.c950698451efe3dc6a9844211759e25a.jpg
data/obj/frame871_jpg.rf.d8c4d42dbf5c6c69b977fda63e61e464.jpg
data/obj/frame88_jpg.rf.b83f848c2d2e4c5f988784d5444ba18a.jpg
data/obj/frame8_jpg.rf.ab4b86af94a6905049f12a35a4be38cd.jpg
data/obj/frame90_jpg.rf.0e65c4328b328121a830df86b0d8e3cf.jpg
data/obj/frame91_jpg.rf.1410123d5cfddb16c8922e16945e2ee0.jpg
data/obj/frame92_jpg.rf.0b32f3f2c78a14216df6dac4ff28b1c2.jpg
data/obj/frame94_jpg.rf.da567bab0c01d5e4cce934bd73853c97.jpg
data/obj/frame95_jpg.rf.fd4a24ce559b03dd9abe5cc73f14a73c.jpg
data/obj/frame96_jpg.rf.895df5d358f9c46adc9b621dfd62807f.jpg
data/obj/frame97_jpg.rf.0af649401308948504682f028926657b.jpg
data/obj/frame99_jpg.rf.4c346c29ac78fe2f6bad63adac745b8c.jpg
data/obj/frame9_jpg.rf.15585860b4f1779739db249e1cb61f8b.jpg
