{
    "/assets/js/app.js": "/assets/js/app.js?id=ac427cabd9ff3ab33679",
    "/assets/css/app.css": "/assets/css/app.css?id=55972315e7b86f585b78",
    "/assets/css/login.css": "/assets/css/login.css?id=bf8ad6c9922f9db71418",
    "/assets/js/login.js": "/assets/js/login.js?id=10ebe404c18023a84c48",
    "/assets/css/error403.css": "/assets/css/error403.css?id=23ba9253298db241c629"
}
