Revert "Disabled cli and mac builds"

This reverts commit e70ee8b3.
33 jobs for gitlab-ci in 95 minutes and 36 seconds (queued for 10 seconds)
Status Job ID Name Coverage
  Build Env
passed #264112380
publisher trusted shell
build_env:docker:indy_fedora_29

00:00:01

passed #264112387
publisher trusted shell
build_env:docker:indy_pool

00:00:01

passed #264112367
publisher trusted shell
build_env:docker:indy_ubuntu_16_04

00:00:03

 
  Static Analysis
passed #264112396
community docker
static_analysis:cli

00:03:01

passed #264112407
community docker
static_analysis:dummy_agent

00:03:18

passed #264112391
community docker
static_analysis:libindy

00:03:04

passed #264112399
community docker
static_analysis:libnullpay

00:01:20

passed #264112403
community docker
static_analysis:libvcx

00:03:34

passed #264112405
community docker
static_analysis:rust_wrapper

00:01:31

 
  Build And Test Libindy
passed #264112411
community docker
build_and_test_libindy:fedora_29

00:40:16

failed #264112414
community macos allowed to fail
build_and_test_libindy:macos

00:18:50

passed #264112409
community docker
build_and_test_libindy:ubuntu_16_04

00:41:21

 
  Build And Test
failed #264112421
community docker
build_and_test:cli:fedora_29

00:17:43

canceled #264112424
community macos allowed to fail
build_and_test:cli:macos

failed #264112418
community docker
build_and_test:cli:ubuntu_16_04

00:17:28

passed #264112461
community docker
build_and_test:dummy_agent:fedora_29

00:04:00

canceled #264112464
community macos allowed to fail
build_and_test:dummy_agent:macos

passed #264112459
community docker
build_and_test:dummy_agent:ubuntu_16_04

00:04:36

passed #264112436
community docker
build_and_test:libnullpay:fedora_29

00:04:44

canceled #264112443
community macos allowed to fail
build_and_test:libnullpay:macos

passed #264112426
community docker
build_and_test:libnullpay:ubuntu_16_04

00:04:33

passed #264112448
community docker
build_and_test:libvcx:fedora_29

00:16:55

canceled #264112451
community macos allowed to fail
build_and_test:libvcx:macos

passed #264112446
community docker
build_and_test:libvcx:ubuntu_16_04

00:16:18

canceled #264112469
community macos allowed to fail
build_and_test:python_wrapper:macos

passed #264112467
community docker
build_and_test:python_wrapper:ubuntu_16_04

00:05:03

passed #264112455
community docker
build_and_test:rust_wrapper:fedora_29

00:05:09

canceled #264112457
community macos allowed to fail
build_and_test:rust_wrapper:macos

passed #264112453
community docker
build_and_test:rust_wrapper:ubuntu_16_04

00:02:19

 
  Package
canceled #264112476
trusted docker
package:libindy:fedora_29

canceled #264112472
trusted docker
package:libindy:ubuntu_16_04

 
  Release
canceled #264112497
publisher trusted docker
release:libindy:fedora_29

canceled #264112490
publisher trusted docker
release:libindy:ubuntu_16_04

 
Name Stage Failure
failed
build_and_test:cli:fedora_29 Build And Test
    commands::wallet::tests::list::list_works
commands::wallet::tests::open::open_works
commands::wallet::tests::open::open_works_for_missed_key
commands::wallet::tests::open::open_works_for_twice
commands::wallet::tests::open::open_works_for_wrong_key

test result: FAILED. 52 passed; 107 failed; 2 ignored; 0 measured; 0 filtered out

ERROR: Job failed: exit code 1
failed
build_and_test:cli:ubuntu_16_04 Build And Test
    commands::wallet::tests::open::open_works
commands::wallet::tests::open::open_works_for_missed_key
commands::wallet::tests::open::open_works_for_twice
commands::wallet::tests::open::open_works_for_wrong_key

test result: FAILED. 52 passed; 107 failed; 2 ignored; 0 measured; 0 filtered out

error: test failed, to rerun pass '--bin indy-cli'
ERROR: Job failed: exit code 1
failed
build_and_test_libindy:macos Build And Test Libindy
    ledger_demo_works

test result: FAILED. 9 passed; 2 failed; 0 ignored; 0 measured; 0 filtered out

error: test failed, to rerun pass '--test demo'
Running after script...
$ docker stop indy_pool
indy_pool
ERROR: Job failed: exit status 1