08/20/20 12:13:00.688 PM [Information] [] - User Is Authenticated. Id = 11111111
08/20/20 12:13:04.045 PM [Error] [] - Http  Response Error = {"code":403,"status":"Forbidden","id":"11111111","message":"Invalid Token Provider"}
08/20/20 12:13:04.425 PM [Error] [] - Response status code does not indicate success: 403 (Forbidden).
System.Net.Http.HttpRequestException: Response status code does not indicate success: 403 (Forbidden).
   at System.Net.Http.HttpResponseMessage.EnsureSuccessStatusCode()
08/20/20 12:13:13.403 PM [Information] [] - User Is Authenticated. Id = 11111111
08/20/20 12:13:13.449 PM [Error] [] - Http  Response Error = {"code":403,"status":"Forbidden","id":"1111111","message":"Invalid Token Provider"}
08/20/20 12:13:13.690 PM [Error] [] - Response status code does not indicate success: 403 (Forbidden).
System.Net.Http.HttpRequestException: Response status code does not indicate success: 403 (Forbidden).
   at System.Net.Http.HttpResponseMessage.EnsureSuccessStatusCode()
