{
   "data":[
      {
         "type":"Payment",
         "id":"4ee3a8d8-ca7b-4290-a52c-dd5b6165ec43",
         "version":0,
         "organisation_id":"743d5b63-8e6f-432e-a8fa-c5d8d2ee5fcb",
         "attributes":{
            "amount":"100.21",
            "beneficiary_party":{
               "account_name":"W Owens",
               "account_number":"31926819",
               "account_number_code":"BBAN",
               "account_type":0,
               "address":"1 The Beneficiary Localtown SE2",
               "bank_id":"403000",
               "bank_id_code":"GBDSC",
               "name":"Wilfred Jeremiah Owens"
            },
            "charges_information":{
               "bearer_code":"SHAR",
               "sender_charges":[
                  {
                     "amount":"5.00",
                     "currency":"GBP"
                  },
                  {
                     "amount":"10.00",
                     "currency":"USD"
                  }
               ],
               "receiver_charges_amount":"1.00",
               "receiver_charges_currency":"USD"
            },
            "currency":"GBP",
            "debtor_party":{
               "account_name":"EJ Brown Black",
               "account_number":"GB29XABC10161234567801",
               "account_number_code":"IBAN",
               "address":"10 Debtor Crescent Sourcetown NE1",
               "bank_id":"203301",
               "bank_id_code":"GBDSC",
               "name":"Emelia Jane Brown"
            },
            "end_to_end_reference":"Wil piano Jan",
            "fx":{
               "contract_reference":"FX123",
               "exchange_rate":"2.00000",
               "original_amount":"200.42",
               "original_currency":"USD"
            },
            "numeric_reference":"1002001",
            "payment_id":"123456789012345678",
            "payment_purpose":"Paying for goods/services",
            "payment_scheme":"FPS",
            "payment_type":"Credit",
            "processing_date":"2017-01-18",
            "reference":"Payment for Em's piano lessons",
            "scheme_payment_sub_type":"InternetBanking",
            "scheme_payment_type":"ImmediatePayment",
            "sponsor_party":{
               "account_number":"56781234",
               "bank_id":"123123",
               "bank_id_code":"GBDSC"
            }
         }
      },
      {
         "type":"Payment",
         "id":"216d4da9-e59a-4cc6-8df3-3da6e7580b77",
         "version":0,
         "organisation_id":"743d5b63-8e6f-432e-a8fa-c5d8d2ee5fcb",
         "attributes":{
            "amount":"100.21",
            "beneficiary_party":{
               "account_name":"W Owens",
               "account_number":"31926819",
               "account_number_code":"BBAN",
               "account_type":0,
               "address":"1 The Beneficiary Localtown SE2",
               "bank_id":"403000",
               "bank_id_code":"GBDSC",
               "name":"Wilfred Jeremiah Owens"
            },
            "charges_information":{
               "bearer_code":"SHAR",
               "sender_charges":[
                  {
                     "amount":"5.00",
                     "currency":"GBP"
                  },
                  {
                     "amount":"10.00",
                     "currency":"USD"
                  }
               ],
               "receiver_charges_amount":"1.00",
               "receiver_charges_currency":"USD"
            },
            "currency":"GBP",
            "debtor_party":{
               "account_name":"EJ Brown Black",
               "account_number":"GB29XABC10161234567801",
               "account_number_code":"IBAN",
               "address":"10 Debtor Crescent Sourcetown NE1",
               "bank_id":"203301",
               "bank_id_code":"GBDSC",
               "name":"Emelia Jane Brown"
            },
            "end_to_end_reference":"Wil piano Jan",
            "fx":{
               "contract_reference":"FX123",
               "exchange_rate":"2.00000",
               "original_amount":"200.42",
               "original_currency":"USD"
            },
            "numeric_reference":"1002001",
            "payment_id":"123456789012345678",
            "payment_purpose":"Paying for goods/services",
            "payment_scheme":"FPS",
            "payment_type":"Credit",
            "processing_date":"2017-01-18",
            "reference":"Payment for Em's piano lessons",
            "scheme_payment_sub_type":"InternetBanking",
            "scheme_payment_type":"ImmediatePayment",
            "sponsor_party":{
               "account_number":"56781234",
               "bank_id":"123123",
               "bank_id_code":"GBDSC"
            }
         }
      },
      {
         "type":"Payment",
         "id":"7eb8277a-6c91-45e9-8a03-a27f82aca350",
         "version":0,
         "organisation_id":"743d5b63-8e6f-432e-a8fa-c5d8d2ee5fcb",
         "attributes":{
            "amount":"100.21",
            "beneficiary_party":{
               "account_name":"W Owens",
               "account_number":"31926819",
               "account_number_code":"BBAN",
               "account_type":0,
               "address":"1 The Beneficiary Localtown SE2",
               "bank_id":"403000",
               "bank_id_code":"GBDSC",
               "name":"Wilfred Jeremiah Owens"
            },
            "charges_information":{
               "bearer_code":"SHAR",
               "sender_charges":[
                  {
                     "amount":"5.00",
                     "currency":"GBP"
                  },
                  {
                     "amount":"10.00",
                     "currency":"USD"
                  }
               ],
               "receiver_charges_amount":"1.00",
               "receiver_charges_currency":"USD"
            },
            "currency":"GBP",
            "debtor_party":{
               "account_name":"EJ Brown Black",
               "account_number":"GB29XABC10161234567801",
               "account_number_code":"IBAN",
               "address":"10 Debtor Crescent Sourcetown NE1",
               "bank_id":"203301",
               "bank_id_code":"GBDSC",
               "name":"Emelia Jane Brown"
            },
            "end_to_end_reference":"Wil piano Jan",
            "fx":{
               "contract_reference":"FX123",
               "exchange_rate":"2.00000",
               "original_amount":"200.42",
               "original_currency":"USD"
            },
            "numeric_reference":"1002001",
            "payment_id":"123456789012345678",
            "payment_purpose":"Paying for goods/services",
            "payment_scheme":"FPS",
            "payment_type":"Credit",
            "processing_date":"2017-01-18",
            "reference":"Payment for Em's piano lessons",
            "scheme_payment_sub_type":"InternetBanking",
            "scheme_payment_type":"ImmediatePayment",
            "sponsor_party":{
               "account_number":"56781234",
               "bank_id":"123123",
               "bank_id_code":"GBDSC"
            }
         }
      },
      {
         "type":"Payment",
         "id":"97fe60ba-1334-439f-91db-32cc3cde036a",
         "version":0,
         "organisation_id":"743d5b63-8e6f-432e-a8fa-c5d8d2ee5fcb",
         "attributes":{
            "amount":"100.21",
            "beneficiary_party":{
               "account_name":"W Owens",
               "account_number":"31926819",
               "account_number_code":"BBAN",
               "account_type":0,
               "address":"1 The Beneficiary Localtown SE2",
               "bank_id":"403000",
               "bank_id_code":"GBDSC",
               "name":"Wilfred Jeremiah Owens"
            },
            "charges_information":{
               "bearer_code":"SHAR",
               "sender_charges":[
                  {
                     "amount":"5.00",
                     "currency":"GBP"
                  },
                  {
                     "amount":"10.00",
                     "currency":"USD"
                  }
               ],
               "receiver_charges_amount":"1.00",
               "receiver_charges_currency":"USD"
            },
            "currency":"GBP",
            "debtor_party":{
               "account_name":"EJ Brown Black",
               "account_number":"GB29XABC10161234567801",
               "account_number_code":"IBAN",
               "address":"10 Debtor Crescent Sourcetown NE1",
               "bank_id":"203301",
               "bank_id_code":"GBDSC",
               "name":"Emelia Jane Brown"
            },
            "end_to_end_reference":"Wil piano Jan",
            "fx":{
               "contract_reference":"FX123",
               "exchange_rate":"2.00000",
               "original_amount":"200.42",
               "original_currency":"USD"
            },
            "numeric_reference":"1002001",
            "payment_id":"123456789012345678",
            "payment_purpose":"Paying for goods/services",
            "payment_scheme":"FPS",
            "payment_type":"Credit",
            "processing_date":"2017-01-18",
            "reference":"Payment for Em's piano lessons",
            "scheme_payment_sub_type":"InternetBanking",
            "scheme_payment_type":"ImmediatePayment",
            "sponsor_party":{
               "account_number":"56781234",
               "bank_id":"123123",
               "bank_id_code":"GBDSC"
            }
         }
      },
      {
         "type":"Payment",
         "id":"ab4bbd28-33c6-4231-9b64-0e96190f59ef",
         "version":0,
         "organisation_id":"743d5b63-8e6f-432e-a8fa-c5d8d2ee5fcb",
         "attributes":{
            "amount":"100.21",
            "beneficiary_party":{
               "account_name":"W Owens",
               "account_number":"31926819",
               "account_number_code":"BBAN",
               "account_type":0,
               "address":"1 The Beneficiary Localtown SE2",
               "bank_id":"403000",
               "bank_id_code":"GBDSC",
               "name":"Wilfred Jeremiah Owens"
            },
            "charges_information":{
               "bearer_code":"SHAR",
               "sender_charges":[
                  {
                     "amount":"5.00",
                     "currency":"GBP"
                  },
                  {
                     "amount":"10.00",
                     "currency":"USD"
                  }
               ],
               "receiver_charges_amount":"1.00",
               "receiver_charges_currency":"USD"
            },
            "currency":"GBP",
            "debtor_party":{
               "account_name":"EJ Brown Black",
               "account_number":"GB29XABC10161234567801",
               "account_number_code":"IBAN",
               "address":"10 Debtor Crescent Sourcetown NE1",
               "bank_id":"203301",
               "bank_id_code":"GBDSC",
               "name":"Emelia Jane Brown"
            },
            "end_to_end_reference":"Wil piano Jan",
            "fx":{
               "contract_reference":"FX123",
               "exchange_rate":"2.00000",
               "original_amount":"200.42",
               "original_currency":"USD"
            },
            "numeric_reference":"1002001",
            "payment_id":"123456789012345678",
            "payment_purpose":"Paying for goods/services",
            "payment_scheme":"FPS",
            "payment_type":"Credit",
            "processing_date":"2017-01-18",
            "reference":"Payment for Em's piano lessons",
            "scheme_payment_sub_type":"InternetBanking",
            "scheme_payment_type":"ImmediatePayment",
            "sponsor_party":{
               "account_number":"56781234",
               "bank_id":"123123",
               "bank_id_code":"GBDSC"
            }
         }
      },
      {
         "type":"Payment",
         "id":"7f172f5c-f810-4ebe-b015-cb1fc24c6b66",
         "version":0,
         "organisation_id":"743d5b63-8e6f-432e-a8fa-c5d8d2ee5fcb",
         "attributes":{
            "amount":"100.21",
            "beneficiary_party":{
               "account_name":"W Owens",
               "account_number":"31926819",
               "account_number_code":"BBAN",
               "account_type":0,
               "address":"1 The Beneficiary Localtown SE2",
               "bank_id":"403000",
               "bank_id_code":"GBDSC",
               "name":"Wilfred Jeremiah Owens"
            },
            "charges_information":{
               "bearer_code":"SHAR",
               "sender_charges":[
                  {
                     "amount":"5.00",
                     "currency":"GBP"
                  },
                  {
                     "amount":"10.00",
                     "currency":"USD"
                  }
               ],
               "receiver_charges_amount":"1.00",
               "receiver_charges_currency":"USD"
            },
            "currency":"GBP",
            "debtor_party":{
               "account_name":"EJ Brown Black",
               "account_number":"GB29XABC10161234567801",
               "account_number_code":"IBAN",
               "address":"10 Debtor Crescent Sourcetown NE1",
               "bank_id":"203301",
               "bank_id_code":"GBDSC",
               "name":"Emelia Jane Brown"
            },
            "end_to_end_reference":"Wil piano Jan",
            "fx":{
               "contract_reference":"FX123",
               "exchange_rate":"2.00000",
               "original_amount":"200.42",
               "original_currency":"USD"
            },
            "numeric_reference":"1002001",
            "payment_id":"123456789012345678",
            "payment_purpose":"Paying for goods/services",
            "payment_scheme":"FPS",
            "payment_type":"Credit",
            "processing_date":"2017-01-18",
            "reference":"Payment for Em's piano lessons",
            "scheme_payment_sub_type":"InternetBanking",
            "scheme_payment_type":"ImmediatePayment",
            "sponsor_party":{
               "account_number":"56781234",
               "bank_id":"123123",
               "bank_id_code":"GBDSC"
            }
         }
      },
      {
         "type":"Payment",
         "id":"502758ff-505f-4d81-b9d2-83aa9c01ebe2",
         "version":0,
         "organisation_id":"743d5b63-8e6f-432e-a8fa-c5d8d2ee5fcb",
         "attributes":{
            "amount":"100.21",
            "beneficiary_party":{
               "account_name":"W Owens",
               "account_number":"31926819",
               "account_number_code":"BBAN",
               "account_type":0,
               "address":"1 The Beneficiary Localtown SE2",
               "bank_id":"403000",
               "bank_id_code":"GBDSC",
               "name":"Wilfred Jeremiah Owens"
            },
            "charges_information":{
               "bearer_code":"SHAR",
               "sender_charges":[
                  {
                     "amount":"5.00",
                     "currency":"GBP"
                  },
                  {
                     "amount":"10.00",
                     "currency":"USD"
                  }
               ],
               "receiver_charges_amount":"1.00",
               "receiver_charges_currency":"USD"
            },
            "currency":"GBP",
            "debtor_party":{
               "account_name":"EJ Brown Black",
               "account_number":"GB29XABC10161234567801",
               "account_number_code":"IBAN",
               "address":"10 Debtor Crescent Sourcetown NE1",
               "bank_id":"203301",
               "bank_id_code":"GBDSC",
               "name":"Emelia Jane Brown"
            },
            "end_to_end_reference":"Wil piano Jan",
            "fx":{
               "contract_reference":"FX123",
               "exchange_rate":"2.00000",
               "original_amount":"200.42",
               "original_currency":"USD"
            },
            "numeric_reference":"1002001",
            "payment_id":"123456789012345678",
            "payment_purpose":"Paying for goods/services",
            "payment_scheme":"FPS",
            "payment_type":"Credit",
            "processing_date":"2017-01-18",
            "reference":"Payment for Em's piano lessons",
            "scheme_payment_sub_type":"InternetBanking",
            "scheme_payment_type":"ImmediatePayment",
            "sponsor_party":{
               "account_number":"56781234",
               "bank_id":"123123",
               "bank_id_code":"GBDSC"
            }
         }
      },
      {
         "type":"Payment",
         "id":"09fe827a-b3c2-4437-b999-6c0e780c0983",
         "version":0,
         "organisation_id":"743d5b63-8e6f-432e-a8fa-c5d8d2ee5fcb",
         "attributes":{
            "amount":"100.21",
            "beneficiary_party":{
               "account_name":"W Owens",
               "account_number":"31926819",
               "account_number_code":"BBAN",
               "account_type":0,
               "address":"1 The Beneficiary Localtown SE2",
               "bank_id":"403000",
               "bank_id_code":"GBDSC",
               "name":"Wilfred Jeremiah Owens"
            },
            "charges_information":{
               "bearer_code":"SHAR",
               "sender_charges":[
                  {
                     "amount":"5.00",
                     "currency":"GBP"
                  },
                  {
                     "amount":"10.00",
                     "currency":"USD"
                  }
               ],
               "receiver_charges_amount":"1.00",
               "receiver_charges_currency":"USD"
            },
            "currency":"GBP",
            "debtor_party":{
               "account_name":"EJ Brown Black",
               "account_number":"GB29XABC10161234567801",
               "account_number_code":"IBAN",
               "address":"10 Debtor Crescent Sourcetown NE1",
               "bank_id":"203301",
               "bank_id_code":"GBDSC",
               "name":"Emelia Jane Brown"
            },
            "end_to_end_reference":"Wil piano Jan",
            "fx":{
               "contract_reference":"FX123",
               "exchange_rate":"2.00000",
               "original_amount":"200.42",
               "original_currency":"USD"
            },
            "numeric_reference":"1002001",
            "payment_id":"123456789012345678",
            "payment_purpose":"Paying for goods/services",
            "payment_scheme":"FPS",
            "payment_type":"Credit",
            "processing_date":"2017-01-18",
            "reference":"Payment for Em's piano lessons",
            "scheme_payment_sub_type":"InternetBanking",
            "scheme_payment_type":"ImmediatePayment",
            "sponsor_party":{
               "account_number":"56781234",
               "bank_id":"123123",
               "bank_id_code":"GBDSC"
            }
         }
      },
      {
         "type":"Payment",
         "id":"de1f6882-4dba-485a-a632-a80f59fbe4a6",
         "version":0,
         "organisation_id":"743d5b63-8e6f-432e-a8fa-c5d8d2ee5fcb",
         "attributes":{
            "amount":"100.21",
            "beneficiary_party":{
               "account_name":"W Owens",
               "account_number":"31926819",
               "account_number_code":"BBAN",
               "account_type":0,
               "address":"1 The Beneficiary Localtown SE2",
               "bank_id":"403000",
               "bank_id_code":"GBDSC",
               "name":"Wilfred Jeremiah Owens"
            },
            "charges_information":{
               "bearer_code":"SHAR",
               "sender_charges":[
                  {
                     "amount":"5.00",
                     "currency":"GBP"
                  },
                  {
                     "amount":"10.00",
                     "currency":"USD"
                  }
               ],
               "receiver_charges_amount":"1.00",
               "receiver_charges_currency":"USD"
            },
            "currency":"GBP",
            "debtor_party":{
               "account_name":"EJ Brown Black",
               "account_number":"GB29XABC10161234567801",
               "account_number_code":"IBAN",
               "address":"10 Debtor Crescent Sourcetown NE1",
               "bank_id":"203301",
               "bank_id_code":"GBDSC",
               "name":"Emelia Jane Brown"
            },
            "end_to_end_reference":"Wil piano Jan",
            "fx":{
               "contract_reference":"FX123",
               "exchange_rate":"2.00000",
               "original_amount":"200.42",
               "original_currency":"USD"
            },
            "numeric_reference":"1002001",
            "payment_id":"123456789012345678",
            "payment_purpose":"Paying for goods/services",
            "payment_scheme":"FPS",
            "payment_type":"Credit",
            "processing_date":"2017-01-18",
            "reference":"Payment for Em's piano lessons",
            "scheme_payment_sub_type":"InternetBanking",
            "scheme_payment_type":"ImmediatePayment",
            "sponsor_party":{
               "account_number":"56781234",
               "bank_id":"123123",
               "bank_id_code":"GBDSC"
            }
         }
      },
      {
         "type":"Payment",
         "id":"b71afd98-4fba-40a4-b8f3-087d005187e3",
         "version":0,
         "organisation_id":"743d5b63-8e6f-432e-a8fa-c5d8d2ee5fcb",
         "attributes":{
            "amount":"100.21",
            "beneficiary_party":{
               "account_name":"W Owens",
               "account_number":"31926819",
               "account_number_code":"BBAN",
               "account_type":0,
               "address":"1 The Beneficiary Localtown SE2",
               "bank_id":"403000",
               "bank_id_code":"GBDSC",
               "name":"Wilfred Jeremiah Owens"
            },
            "charges_information":{
               "bearer_code":"SHAR",
               "sender_charges":[
                  {
                     "amount":"5.00",
                     "currency":"GBP"
                  },
                  {
                     "amount":"10.00",
                     "currency":"USD"
                  }
               ],
               "receiver_charges_amount":"1.00",
               "receiver_charges_currency":"USD"
            },
            "currency":"GBP",
            "debtor_party":{
               "account_name":"EJ Brown Black",
               "account_number":"GB29XABC10161234567801",
               "account_number_code":"IBAN",
               "address":"10 Debtor Crescent Sourcetown NE1",
               "bank_id":"203301",
               "bank_id_code":"GBDSC",
               "name":"Emelia Jane Brown"
            },
            "end_to_end_reference":"Wil piano Jan",
            "fx":{
               "contract_reference":"FX123",
               "exchange_rate":"2.00000",
               "original_amount":"200.42",
               "original_currency":"USD"
            },
            "numeric_reference":"1002001",
            "payment_id":"123456789012345678",
            "payment_purpose":"Paying for goods/services",
            "payment_scheme":"FPS",
            "payment_type":"Credit",
            "processing_date":"2017-01-18",
            "reference":"Payment for Em's piano lessons",
            "scheme_payment_sub_type":"InternetBanking",
            "scheme_payment_type":"ImmediatePayment",
            "sponsor_party":{
               "account_number":"56781234",
               "bank_id":"123123",
               "bank_id_code":"GBDSC"
            }
         }
      },
      {
         "type":"Payment",
         "id":"dbb89036-4007-47ff-8fab-00bdd5cc4021",
         "version":0,
         "organisation_id":"743d5b63-8e6f-432e-a8fa-c5d8d2ee5fcb",
         "attributes":{
            "amount":"100.21",
            "beneficiary_party":{
               "account_name":"W Owens",
               "account_number":"31926819",
               "account_number_code":"BBAN",
               "account_type":0,
               "address":"1 The Beneficiary Localtown SE2",
               "bank_id":"403000",
               "bank_id_code":"GBDSC",
               "name":"Wilfred Jeremiah Owens"
            },
            "charges_information":{
               "bearer_code":"SHAR",
               "sender_charges":[
                  {
                     "amount":"5.00",
                     "currency":"GBP"
                  },
                  {
                     "amount":"10.00",
                     "currency":"USD"
                  }
               ],
               "receiver_charges_amount":"1.00",
               "receiver_charges_currency":"USD"
            },
            "currency":"GBP",
            "debtor_party":{
               "account_name":"EJ Brown Black",
               "account_number":"GB29XABC10161234567801",
               "account_number_code":"IBAN",
               "address":"10 Debtor Crescent Sourcetown NE1",
               "bank_id":"203301",
               "bank_id_code":"GBDSC",
               "name":"Emelia Jane Brown"
            },
            "end_to_end_reference":"Wil piano Jan",
            "fx":{
               "contract_reference":"FX123",
               "exchange_rate":"2.00000",
               "original_amount":"200.42",
               "original_currency":"USD"
            },
            "numeric_reference":"1002001",
            "payment_id":"123456789012345678",
            "payment_purpose":"Paying for goods/services",
            "payment_scheme":"FPS",
            "payment_type":"Credit",
            "processing_date":"2017-01-18",
            "reference":"Payment for Em's piano lessons",
            "scheme_payment_sub_type":"InternetBanking",
            "scheme_payment_type":"ImmediatePayment",
            "sponsor_party":{
               "account_number":"56781234",
               "bank_id":"123123",
               "bank_id_code":"GBDSC"
            }
         }
      },
      {
         "type":"Payment",
         "id":"52611302-0758-4f69-aa15-c5f55ab7c3eb",
         "version":0,
         "organisation_id":"743d5b63-8e6f-432e-a8fa-c5d8d2ee5fcb",
         "attributes":{
            "amount":"100.21",
            "beneficiary_party":{
               "account_name":"W Owens",
               "account_number":"31926819",
               "account_number_code":"BBAN",
               "account_type":0,
               "address":"1 The Beneficiary Localtown SE2",
               "bank_id":"403000",
               "bank_id_code":"GBDSC",
               "name":"Wilfred Jeremiah Owens"
            },
            "charges_information":{
               "bearer_code":"SHAR",
               "sender_charges":[
                  {
                     "amount":"5.00",
                     "currency":"GBP"
                  },
                  {
                     "amount":"10.00",
                     "currency":"USD"
                  }
               ],
               "receiver_charges_amount":"1.00",
               "receiver_charges_currency":"USD"
            },
            "currency":"GBP",
            "debtor_party":{
               "account_name":"EJ Brown Black",
               "account_number":"GB29XABC10161234567801",
               "account_number_code":"IBAN",
               "address":"10 Debtor Crescent Sourcetown NE1",
               "bank_id":"203301",
               "bank_id_code":"GBDSC",
               "name":"Emelia Jane Brown"
            },
            "end_to_end_reference":"Wil piano Jan",
            "fx":{
               "contract_reference":"FX123",
               "exchange_rate":"2.00000",
               "original_amount":"200.42",
               "original_currency":"USD"
            },
            "numeric_reference":"1002001",
            "payment_id":"123456789012345678",
            "payment_purpose":"Paying for goods/services",
            "payment_scheme":"FPS",
            "payment_type":"Credit",
            "processing_date":"2017-01-18",
            "reference":"Payment for Em's piano lessons",
            "scheme_payment_sub_type":"InternetBanking",
            "scheme_payment_type":"ImmediatePayment",
            "sponsor_party":{
               "account_number":"56781234",
               "bank_id":"123123",
               "bank_id_code":"GBDSC"
            }
         }
      },
      {
         "type":"Payment",
         "id":"6cd862ab-6d40-4a86-8037-77d446b3f6fc",
         "version":0,
         "organisation_id":"743d5b63-8e6f-432e-a8fa-c5d8d2ee5fcb",
         "attributes":{
            "amount":"100.21",
            "beneficiary_party":{
               "account_name":"W Owens",
               "account_number":"31926819",
               "account_number_code":"BBAN",
               "account_type":0,
               "address":"1 The Beneficiary Localtown SE2",
               "bank_id":"403000",
               "bank_id_code":"GBDSC",
               "name":"Wilfred Jeremiah Owens"
            },
            "charges_information":{
               "bearer_code":"SHAR",
               "sender_charges":[
                  {
                     "amount":"5.00",
                     "currency":"GBP"
                  },
                  {
                     "amount":"10.00",
                     "currency":"USD"
                  }
               ],
               "receiver_charges_amount":"1.00",
               "receiver_charges_currency":"USD"
            },
            "currency":"GBP",
            "debtor_party":{
               "account_name":"EJ Brown Black",
               "account_number":"GB29XABC10161234567801",
               "account_number_code":"IBAN",
               "address":"10 Debtor Crescent Sourcetown NE1",
               "bank_id":"203301",
               "bank_id_code":"GBDSC",
               "name":"Emelia Jane Brown"
            },
            "end_to_end_reference":"Wil piano Jan",
            "fx":{
               "contract_reference":"FX123",
               "exchange_rate":"2.00000",
               "original_amount":"200.42",
               "original_currency":"USD"
            },
            "numeric_reference":"1002001",
            "payment_id":"123456789012345678",
            "payment_purpose":"Paying for goods/services",
            "payment_scheme":"FPS",
            "payment_type":"Credit",
            "processing_date":"2017-01-18",
            "reference":"Payment for Em's piano lessons",
            "scheme_payment_sub_type":"InternetBanking",
            "scheme_payment_type":"ImmediatePayment",
            "sponsor_party":{
               "account_number":"56781234",
               "bank_id":"123123",
               "bank_id_code":"GBDSC"
            }
         }
      },
      {
         "type":"Payment",
         "id":"09a8fe0d-e239-4aff-8098-7923eadd0b98",
         "version":0,
         "organisation_id":"743d5b63-8e6f-432e-a8fa-c5d8d2ee5fcb",
         "attributes":{
            "amount":"100.21",
            "beneficiary_party":{
               "account_name":"W Owens",
               "account_number":"31926819",
               "account_number_code":"BBAN",
               "account_type":0,
               "address":"1 The Beneficiary Localtown SE2",
               "bank_id":"403000",
               "bank_id_code":"GBDSC",
               "name":"Wilfred Jeremiah Owens"
            },
            "charges_information":{
               "bearer_code":"SHAR",
               "sender_charges":[
                  {
                     "amount":"5.00",
                     "currency":"GBP"
                  },
                  {
                     "amount":"10.00",
                     "currency":"USD"
                  }
               ],
               "receiver_charges_amount":"1.00",
               "receiver_charges_currency":"USD"
            },
            "currency":"GBP",
            "debtor_party":{
               "account_name":"EJ Brown Black",
               "account_number":"GB29XABC10161234567801",
               "account_number_code":"IBAN",
               "address":"10 Debtor Crescent Sourcetown NE1",
               "bank_id":"203301",
               "bank_id_code":"GBDSC",
               "name":"Emelia Jane Brown"
            },
            "end_to_end_reference":"Wil piano Jan",
            "fx":{
               "contract_reference":"FX123",
               "exchange_rate":"2.00000",
               "original_amount":"200.42",
               "original_currency":"USD"
            },
            "numeric_reference":"1002001",
            "payment_id":"123456789012345678",
            "payment_purpose":"Paying for goods/services",
            "payment_scheme":"FPS",
            "payment_type":"Credit",
            "processing_date":"2017-01-18",
            "reference":"Payment for Em's piano lessons",
            "scheme_payment_sub_type":"InternetBanking",
            "scheme_payment_type":"ImmediatePayment",
            "sponsor_party":{
               "account_number":"56781234",
               "bank_id":"123123",
               "bank_id_code":"GBDSC"
            }
         }
      }
   ],
   "links":{
      "self":"https://api.test.form3.tech/v1/payments"
   }
}