{
  "tasks": [
    {
      "id": 1,
      "text": "Doctors Appointment",
      "day": "March 1st at 2:30pm",
      "reminder": true
    },
    {
      "id": 2,
      "text": "School Meeting",
      "day": "March 3rd at 1:30pm",
      "reminder": true
    },
    {
      "id": 3,
      "text": "Food Shopping",
      "day": "March 3rd at 11:30am",
      "reminder": false
    },
    {
      "id": 77329,
      "text": "Go to Bed",
      "day": "April 6th at 1:00am",
      "reminder": false
    }
  ]
}