%YAML 1.1
%TAG !u! tag:unity3d.com,2011:
--- !u!114 &11400000
MonoBehaviour:
  m_ObjectHideFlags: 0
  m_CorrespondingSourceObject: {fileID: 0}
  m_PrefabInstance: {fileID: 0}
  m_PrefabAsset: {fileID: 0}
  m_GameObject: {fileID: 0}
  m_Enabled: 1
  m_EditorHideFlags: 0
  m_Script: {fileID: 11500000, guid: 7e5be148a4e374a4a9a7279a32badc13, type: 3}
  m_Name: 02
  m_EditorClassIdentifier: 
  _hazardCount: 2
  _collectableCount: 5
  _hazards:
  - {fileID: 6326113372753149022, guid: 51b953e0bab70e24f84cf6bf57e5eb8b, type: 3}
  _collectables:
  - {fileID: 9185428637724866091, guid: c0590652bc88cff45b0dea7e4ca0b190, type: 3}
  _deepSea: 1
