<svg xmlns="http://www.w3.org/2000/svg" viewBox="0 0 32.96 32.96">
  <path id="ic_search_24px" d="M26.556,23.729H25.067l-.528-.509a12.268,12.268,0,1,0-1.319,1.319l.509.528v1.489l9.422,9.4,2.808-2.808Zm-11.307,0a8.48,8.48,0,1,1,8.48-8.48A8.469,8.469,0,0,1,15.249,23.729Z" transform="translate(-3 -3)"/>
</svg>
