<svg xmlns="http://www.w3.org/2000/svg" xmlns:xlink="http://www.w3.org/1999/xlink" viewBox="0 0 2804.005 2803.676">
  <defs>
    <style>
      .cls-1 {
        opacity: 0.49;
        fill: url(#linear-gradient);
      }
    </style>
    <linearGradient id="linear-gradient" x1="0.5" x2="0.5" y2="1" gradientUnits="objectBoundingBox">
      <stop offset="0" stop-color="red"/>
      <stop offset="1" stop-color="#ff7e00"/>
    </linearGradient>
  </defs>
  <g id="Group_656" transform="translate(-920.016 -3488.308)">
    <path id="Path_290" data-name="Path 290" class="cls-1" d="M0,1732.33,1489.022,243.308V692.843L449.535,1732.33Z" transform="translate(3724.021 5937.309) rotate(180)"/>
    <path id="Path_289" data-name="Path 289" class="cls-1" d="M0,3046.984,2803.676,243.308v846.429L846.429,3046.984Z" transform="translate(920.016 3245)"/>
  </g>
</svg>
