<svg xmlns="http://www.w3.org/2000/svg" viewBox="0 0 30.152 30.152">
  <path id="ic_arrow_forward_24px" d="M15.076,0,12.419,2.657,22.934,13.191H0V16.96H22.934L12.419,27.495l2.657,2.657L30.152,15.076Z" transform="translate(30.152 30.152) rotate(-180)"/>
</svg>
