<svg xmlns="http://www.w3.org/2000/svg" viewBox="0 0 30.152 30.152">
  <path id="ic_arrow_forward_24px" d="M19.076,4,16.419,6.657,26.934,17.191H4V20.96H26.934L16.419,31.495l2.657,2.657L34.152,19.076Z" transform="translate(-4 -4)"/>
</svg>
