<svg xmlns="http://www.w3.org/2000/svg" xmlns:xlink="http://www.w3.org/1999/xlink" viewBox="0 0 1903.494 1975.967">
  <defs>
    <style>
      .cls-1 {
        opacity: 0.49;
        fill: url(#linear-gradient);
      }
    </style>
    <linearGradient id="linear-gradient" x1="0.5" x2="0.5" y2="1" gradientUnits="objectBoundingBox">
      <stop offset="0" stop-color="red"/>
      <stop offset="1" stop-color="#ff7e00"/>
    </linearGradient>
  </defs>
  <g id="Group_655"  transform="translate(0)">
    <path id="Path_284" data-name="Path 284" class="cls-1" d="M0,1862.057,1862.056,0V562.154l-1299.9,1299.9Z" transform="translate(1862.056 1975.967) rotate(180)"/>
    <path id="Path_287" data-name="Path 287" class="cls-1" d="M0,757.886,757.886,0V228.805l-529.08,529.08Z" transform="translate(1903.494 995.68) rotate(180)"/>
    <path id="Path_285" data-name="Path 285" class="cls-1" d="M0,757.886,757.886,0V228.805l-529.08,529.08Z" transform="translate(981.798 919.035) rotate(180)"/>
    <path id="Path_286" data-name="Path 286" class="cls-1" d="M0,757.886,757.886,0V228.805l-529.08,529.08Z" transform="translate(1262.827 757.886) rotate(180)"/>
  </g>
</svg>
