<svg xmlns="http://www.w3.org/2000/svg" viewBox="0 0 41.459 41.459">
  <path id="ic_settings_input_composite_24px" d="M8.538,2.884a1.884,1.884,0,0,0-3.769,0v7.538H1V21.729H12.307V10.422H8.538Zm7.538,26.383a5.673,5.673,0,0,0,3.769,5.314v7.877h3.769V34.582a5.636,5.636,0,0,0,3.769-5.314V25.5H16.076ZM1,29.267a5.673,5.673,0,0,0,3.769,5.314v7.877H8.538V34.582a5.673,5.673,0,0,0,3.769-5.314V25.5H1ZM38.69,10.422V2.884a1.884,1.884,0,1,0-3.769,0v7.538H31.152V21.729H42.459V10.422ZM23.614,2.884a1.884,1.884,0,0,0-3.769,0v7.538H16.076V21.729H27.383V10.422H23.614Zm7.538,26.383a5.673,5.673,0,0,0,3.769,5.314v7.877H38.69V34.582a5.636,5.636,0,0,0,3.769-5.314V25.5H31.152Z" transform="translate(-1 -1)"/>
</svg>
