<svg xmlns="http://www.w3.org/2000/svg" viewBox="0 0 33.921 30.152">
  <path id="ic_directions_car_24px" d="M33,6.9A2.816,2.816,0,0,0,30.325,5H9.6A2.834,2.834,0,0,0,6.92,6.9L3,18.191V33.267a1.89,1.89,0,0,0,1.884,1.884H6.769a1.89,1.89,0,0,0,1.884-1.884V31.383H31.267v1.884a1.89,1.89,0,0,0,1.884,1.884h1.884a1.89,1.89,0,0,0,1.884-1.884V18.191ZM9.6,25.729A2.827,2.827,0,1,1,12.422,22.9,2.823,2.823,0,0,1,9.6,25.729Zm20.729,0A2.827,2.827,0,1,1,33.152,22.9,2.823,2.823,0,0,1,30.325,25.729ZM6.769,16.307,9.6,7.827H30.325l2.827,8.48Z" transform="translate(-3 -5)"/>
</svg>
