Model,#Param,BIC,AICc,lnL,Invariant,Gamma,R,Freq A,Freq T,Freq C,Freq G,A=>T,A=>C,A=>G,T=>A,T=>C,T=>G,C=>A,C=>T,C=>G,G=>A,G=>T,G=>C,
GTR+G,156,21212.72461,19880.92383,-9783.81543,n/a,1.03561902,0.9828811884,0.3320089579,0.3348769844,0.1654519141,0.1676358432,0.05000000075,0.05000000075,0.07999999821,0.05000000075,0.09000000358,0.05000000075,0.1099999994,0.1800000072,0.03999999911,0.150000006,0.1000000015,0.03999999911,
From\To,A,T,C,G,
A,-,0.04852120578,0.05264630914,0.07814978063,
T,0.04810564592,-,0.09117020667,0.04905957356,
C,0.1056442633,0.1845297664,-,0.04498859495,
G,0.1547785103,0.09800364077,0.0444024913,-,
T92+G,150,21213.16602,19932.54297,-9815.672852,n/a,1.009663701,0.960134089,0.3334561288,0.3334561288,0.1665438712,0.1665438712,0.07999999821,0.03999999911,0.09000000358,0.07999999821,0.09000000358,0.03999999911,0.07999999821,0.1700000018,0.03999999911,0.1700000018,0.07999999821,0.03999999911,
From\To,A,T,C,G,
A,-,0.08013656735,0.04002401978,0.08649583906,
T,0.08013656735,-,0.08649583906,0.04002401978,
C,0.08013656735,0.1731829941,-,0.04002401978,
G,0.1731829941,0.08013656735,0.04002401978,-,
T92+G+I,151,21263.71484,19974.56055,-9835.673828,0.08484692872,1.460748434,0.9234977365,0.3334561288,0.3334561288,0.1665438712,0.1665438712,0.07999999821,0.03999999911,0.07999999821,0.07999999821,0.07999999821,0.03999999911,0.07999999821,0.1700000018,0.03999999911,0.1700000018,0.07999999821,0.03999999911,
From\To,A,T,C,G,
A,-,0.08175677061,0.04083322734,0.08487742394,
T,0.08175677061,-,0.08487742394,0.04083322734,
C,0.08175677061,0.1699425876,-,0.04083322734,
G,0.1699425876,0.08175677061,0.04083322734,-,
GTR+G+I,157,21265.14453,19924.81641,-9804.75293,0.08153366297,1.471862912,0.9439800382,0.3320089579,0.3348769844,0.1654519141,0.1676358432,0.05000000075,0.05000000075,0.07999999821,0.05000000075,0.09000000358,0.05000000075,0.1099999994,0.1800000072,0.05000000075,0.150000006,0.1000000015,0.03999999911,
From\To,A,T,C,G,
A,-,0.05017259717,0.05342956632,0.07708853483,
T,0.04974289611,-,0.08904415369,0.05027167127,
C,0.107216008,0.1802266091,-,0.04514724016,
G,0.1526766866,0.1004249826,0.0445590727,-,
GTR+I,156,21370.96875,20039.16992,-9862.9375,0.09391336143,n/a,0.9566471577,0.3320089579,0.3348769844,0.1654519141,0.1676358432,0.05000000075,0.05000000075,0.07999999821,0.05000000075,0.09000000358,0.05000000075,0.1000000015,0.1800000072,0.05000000075,0.1599999964,0.1000000015,0.05000000075,
From\To,A,T,C,G,
A,-,0.05124149472,0.05191966519,0.07907674462,
T,0.05080264062,-,0.08834043145,0.04943069443,
C,0.1041861251,0.1788022667,-,0.04571807012,
G,0.156614393,0.09874501079,0.04512246698,-,
T92+I,150,21372.92773,20092.30273,-9895.553711,0.1024917364,n/a,0.9476716518,0.3334561288,0.3334561288,0.1665438712,0.1665438712,0.07999999821,0.03999999911,0.09000000358,0.07999999821,0.09000000358,0.03999999911,0.07999999821,0.1700000018,0.03999999911,0.1700000018,0.07999999821,0.03999999911,
From\To,A,T,C,G,
A,-,0.08068044484,0.0402956605,0.08595255762,
T,0.08068044484,-,0.08595255762,0.0402956605,
C,0.08068044484,0.1720952243,-,0.0402956605,
G,0.1720952243,0.08068044484,0.0402956605,-,
T92,149,21462.59766,20190.50391,-9945.661133,n/a,n/a,0.9523720741,0.3334561288,0.3334561288,0.1665438712,0.1665438712,0.07999999821,0.03999999911,0.09000000358,0.07999999821,0.09000000358,0.03999999911,0.07999999821,0.1700000018,0.03999999911,0.1700000018,0.07999999821,0.03999999911,
From\To,A,T,C,G,
A,-,0.08047445118,0.0401927717,0.08615832776,
T,0.08047445118,-,0.08615832776,0.0401927717,
C,0.08047445118,0.1725072265,-,0.0401927717,
G,0.1725072265,0.08047445118,0.0401927717,-,
GTR,155,21497.5,20174.22852,-9931.475586,n/a,n/a,0.8208091259,0.3320089579,0.3348769844,0.1654519141,0.1676358432,0.07999999821,0.05000000075,0.07999999821,0.07999999821,0.07999999821,0.05000000075,0.1000000015,0.1700000018,0.03999999911,0.150000006,0.1000000015,0.03999999911,
From\To,A,T,C,G,
A,-,0.07777199149,0.04893272743,0.07702221721,
T,0.07710591704,-,0.08184670657,0.04789341241,
C,0.09819229692,0.1656588763,-,0.03893182799,
G,0.1525453329,0.09567406774,0.03842462972,-,
K2+G,149,21509.45312,20237.35938,-9969.088867,n/a,0.9778695107,0.9593033791,0.25,0.25,0.25,0.25,0.05999999866,0.05999999866,0.1199999973,0.05999999866,0.1199999973,0.05999999866,0.05999999866,0.1199999973,0.05999999866,0.1199999973,0.05999999866,0.05999999866,
From\To,A,T,C,G,
A,-,0.06379818916,0.06379818916,0.1224036291,
T,0.06379818916,-,0.1224036291,0.06379818916,
C,0.06379818916,0.1224036291,-,0.06379818916,
G,0.1224036291,0.06379818916,0.06379818916,-,
K2+G+I,150,21579.51367,20298.88867,-9998.84668,0.103533484,1.451972961,0.9311046004,0.25,0.25,0.25,0.25,0.05999999866,0.05999999866,0.1199999973,0.05999999866,0.1199999973,0.05999999866,0.05999999866,0.1199999973,0.05999999866,0.1199999973,0.05999999866,0.05999999866,
From\To,A,T,C,G,
A,-,0.06472979486,0.06472979486,0.1205404177,
T,0.06472979486,-,0.1205404177,0.06472979486,
C,0.06472979486,0.1205404177,-,0.06472979486,
G,0.1205404177,0.06472979486,0.06472979486,-,
JC+G,148,21620.02148,20356.45703,-10029.64551,n/a,0.9593251944,0.5,0.25,0.25,0.25,0.25,0.07999999821,0.07999999821,0.07999999821,0.07999999821,0.07999999821,0.07999999821,0.07999999821,0.07999999821,0.07999999821,0.07999999821,0.07999999821,0.07999999821,
From\To,A,T,C,G,
A,-,0.08333333582,0.08333333582,0.08333333582,
T,0.08333333582,-,0.08333333582,0.08333333582,
C,0.08333333582,0.08333333582,-,0.08333333582,
G,0.08333333582,0.08333333582,0.08333333582,-,
JC+G+I,149,21676.45312,20404.35938,-10052.58887,0.103397809,1.449442387,0.5,0.25,0.25,0.25,0.25,0.07999999821,0.07999999821,0.07999999821,0.07999999821,0.07999999821,0.07999999821,0.07999999821,0.07999999821,0.07999999821,0.07999999821,0.07999999821,0.07999999821,
From\To,A,T,C,G,
A,-,0.08333333582,0.08333333582,0.08333333582,
T,0.08333333582,-,0.08333333582,0.08333333582,
C,0.08333333582,0.08333333582,-,0.08333333582,
G,0.08333333582,0.08333333582,0.08333333582,-,
K2+I,149,21696.50977,20424.41602,-10062.61719,0.1172287539,n/a,0.9396224618,0.25,0.25,0.25,0.25,0.05999999866,0.05999999866,0.1199999973,0.05999999866,0.1199999973,0.05999999866,0.05999999866,0.1199999973,0.05999999866,0.1199999973,0.05999999866,0.05999999866,
From\To,A,T,C,G,
A,-,0.06444553286,0.06444553286,0.1211089343,
T,0.06444553286,-,0.1211089343,0.06444553286,
C,0.06444553286,0.1211089343,-,0.06444553286,
G,0.1211089343,0.06444553286,0.06444553286,-,
K2,148,21809.84375,20546.2793,-10124.55664,n/a,n/a,0.9295893312,0.25,0.25,0.25,0.25,0.05999999866,0.05999999866,0.1199999973,0.05999999866,0.1199999973,0.05999999866,0.05999999866,0.1199999973,0.05999999866,0.1199999973,0.05999999866,0.05999999866,
From\To,A,T,C,G,
A,-,0.06478062272,0.06478062272,0.1204387546,
T,0.06478062272,-,0.1204387546,0.06478062272,
C,0.06478062272,0.1204387546,-,0.06478062272,
G,0.1204387546,0.06478062272,0.06478062272,-,
JC+I,148,21810.01172,20546.44531,-10124.64062,0.1178144217,n/a,0.5,0.25,0.25,0.25,0.25,0.07999999821,0.07999999821,0.07999999821,0.07999999821,0.07999999821,0.07999999821,0.07999999821,0.07999999821,0.07999999821,0.07999999821,0.07999999821,0.07999999821,
From\To,A,T,C,G,
A,-,0.08333333582,0.08333333582,0.08333333582,
T,0.08333333582,-,0.08333333582,0.08333333582,
C,0.08333333582,0.08333333582,-,0.08333333582,
G,0.08333333582,0.08333333582,0.08333333582,-,
TN93,152,21879.69922,20582.01758,-10138.39355,n/a,n/a,0.9527537823,0.3320089579,0.3348769844,0.1654519141,0.1676358432,0.07999999821,0.03999999911,0.07999999821,0.07999999821,0.09000000358,0.03999999911,0.07999999821,0.1899999976,0.03999999911,0.1599999964,0.07999999821,0.03999999911,
From\To,A,T,C,G,
A,-,0.08079332858,0.03991737589,0.08054732531,
T,0.08010137826,-,0.09173668176,0.04044427723,
C,0.08010137826,0.1856763214,-,0.04044427723,
G,0.1595269442,0.08079332858,0.03991737589,-,
JC,147,21924.87109,20669.83594,-10187.34375,n/a,n/a,0.5,0.25,0.25,0.25,0.25,0.07999999821,0.07999999821,0.07999999821,0.07999999821,0.07999999821,0.07999999821,0.07999999821,0.07999999821,0.07999999821,0.07999999821,0.07999999821,0.07999999821,
From\To,A,T,C,G,
A,-,0.08333333582,0.08333333582,0.08333333582,
T,0.08333333582,-,0.08333333582,0.08333333582,
C,0.08333333582,0.08333333582,-,0.08333333582,
G,0.08333333582,0.08333333582,0.08333333582,-,
HKY,151,21937.15625,20648.00195,-10172.39453,n/a,n/a,0.9355262518,0.3320089579,0.3348769844,0.1654519141,0.1676358432,0.07999999821,0.03999999911,0.09000000358,0.07999999821,0.07999999821,0.03999999911,0.07999999821,0.1700000018,0.03999999911,0.1700000018,0.07999999821,0.03999999911,
From\To,A,T,C,G,
A,-,0.08156525344,0.04029875994,0.08597886562,
T,0.080866687,-,0.08485875279,0.04083069414,
C,0.080866687,0.171755299,-,0.04083069414,
G,0.170284301,0.08156525344,0.04029875994,-,
HKY+G,152,44009.59766,42711.91406,-21203.3418,n/a,1.004047871,0.9614163637,0.3320089579,0.3348769844,0.1654519141,0.1676358432,0.07999999821,0.03999999911,0.09000000358,0.07999999821,0.09000000358,0.03999999911,0.07999999821,0.1700000018,0.03999999911,0.1700000018,0.07999999821,0.03999999911,
From\To,A,T,C,G,
A,-,0.08042375743,0.03973478079,0.08712171018,
T,0.07973496616,-,0.08598670363,0.04025927186,
C,0.07973496616,0.174038291,-,0.04025927186,
G,0.1725477427,0.08042375743,0.03973478079,-,
TN93+G,153,44017.22266,42711.01172,-21201.88281,n/a,1.003270149,0.9626133442,0.3320089579,0.3348769844,0.1654519141,0.1676358432,0.07999999821,0.03999999911,0.07999999821,0.07999999821,0.09000000358,0.03999999911,0.07999999821,0.1899999976,0.03999999911,0.1599999964,0.07999999821,0.03999999911,
From\To,A,T,C,G,
A,-,0.08036205173,0.03970429674,0.0803007111,
T,0.07967379689,-,0.09283148497,0.04022838548,
C,0.07967379689,0.1878922135,-,0.04022838548,
G,0.1590385139,0.08036205173,0.03970429674,-,
HKY+G+I,153,44060.81641,42754.60547,-21223.67969,0.08470545709,1.437579274,0.9247552156,0.3320089579,0.3348769844,0.1654519141,0.1676358432,0.07999999821,0.03999999911,0.09000000358,0.07999999821,0.07999999821,0.03999999911,0.07999999821,0.1700000018,0.03999999911,0.1700000018,0.07999999821,0.03999999911,
From\To,A,T,C,G,
A,-,0.08204974979,0.04053813592,0.08549379557,
T,0.08134704083,-,0.08438000083,0.04107322916,
C,0.08134704083,0.1707862914,-,0.04107322916,
G,0.1693236083,0.08204974979,0.04053813592,-,
TN93+G+I,154,44068.75781,42754.01562,-21222.37695,0.08463329822,1.430894971,0.9258780479,0.3320089579,0.3348769844,0.1654519141,0.1676358432,0.07999999821,0.03999999911,0.07999999821,0.07999999821,0.09000000358,0.03999999911,0.07999999821,0.1800000072,0.03999999911,0.1599999964,0.07999999821,0.03999999911,
From\To,A,T,C,G,
A,-,0.08198980987,0.04050851986,0.07917491347,
T,0.08128760755,-,0.09072641283,0.04104322195,
C,0.08128760755,0.1836315244,-,0.04104322195,
G,0.1568088233,0.08198980987,0.04050851986,-,
HKY+I,152,44177.6875,42880.00391,-21287.38672,0.1034772545,n/a,0.946898222,0.3320089579,0.3348769844,0.1654519141,0.1676358432,0.07999999821,0.03999999911,0.09000000358,0.07999999821,0.09000000358,0.03999999911,0.07999999821,0.1700000018,0.03999999911,0.1700000018,0.07999999821,0.03999999911,
From\To,A,T,C,G,
A,-,0.08105989546,0.04004907981,0.08648481965,
T,0.08036565781,-,0.08535811305,0.04057771713,
C,0.08036565781,0.1727660149,-,0.04057771713,
G,0.1712863594,0.08105989546,0.04004907981,-,
TN93+I,153,44185.86328,42879.64844,-21286.20312,0.1036449149,n/a,0.9467810392,0.3320089579,0.3348769844,0.1654519141,0.1676358432,0.07999999821,0.03999999911,0.07999999821,0.07999999821,0.09000000358,0.03999999911,0.07999999821,0.1800000072,0.03999999911,0.1599999964,0.07999999821,0.03999999911,
From\To,A,T,C,G,
A,-,0.08105748147,0.04004788399,0.08114317805,
T,0.08036326617,-,0.09062772244,0.04057650641,
C,0.08036326617,0.1834317744,-,0.04057650641,
G,0.1607070565,0.08105748147,0.04004788399,-,
