Model,#Param,BIC,AICc,lnL,Invariant,Gamma,R,Freq A,Freq T,Freq C,Freq G,A=>T,A=>C,A=>G,T=>A,T=>C,T=>G,C=>A,C=>T,C=>G,G=>A,G=>T,G=>C,
T92+G,74,22025.02539,21426.10352,-10638.82324,n/a,3.076663733,0.9028403759,0.3392710388,0.3392710388,0.1607289612,0.1607289612,0.07999999821,0.03999999911,0.07999999821,0.07999999821,0.07999999821,0.03999999911,0.07999999821,0.1700000018,0.03999999911,0.1700000018,0.07999999821,0.03999999911,
From\To,A,T,C,G,
A,-,0.08336779475,0.03949531913,0.08173832297,
T,0.08336779475,-,0.08173832297,0.03949531913,
C,0.08336779475,0.1725354493,-,0.03949531913,
G,0.1725354493,0.08336779475,0.03949531913,-,
T92+G+I,75,22035.125,21428.11523,-10638.82324,0,3.076671362,0.9028402567,0.3392710388,0.3392710388,0.1607289612,0.1607289612,0.07999999821,0.03999999911,0.07999999821,0.07999999821,0.07999999821,0.03999999911,0.07999999821,0.1700000018,0.03999999911,0.1700000018,0.07999999821,0.03999999911,
From\To,A,T,C,G,
A,-,0.08336779475,0.03949532285,0.08173831552,
T,0.08336779475,-,0.08173831552,0.03949532285,
C,0.08336779475,0.1725354493,-,0.03949532285,
G,0.1725354493,0.08336779475,0.03949532285,-,
GTR+G,80,22052.62695,21405.18359,-10622.3252,n/a,3.074966192,0.9065391421,0.3295529187,0.3487426043,0.1608727872,0.1605851352,0.0700000003,0.05000000075,0.07999999821,0.0700000003,0.07999999821,0.05000000075,0.1000000015,0.1800000072,0.01999999955,0.1700000018,0.1099999994,0.01999999955,
From\To,A,T,C,G,
A,-,0.0718126446,0.047876589,0.0817399919,
T,0.06786112487,-,0.08099165559,0.0499371253,
C,0.09807669371,0.1755750179,-,0.02494460344,
G,0.1677468568,0.1084484085,0.02498928457,-,
HKY+G+I,77,22053.94336,21430.75977,-10638.13281,0,3.085011482,0.9084793329,0.3295529187,0.3487426043,0.1608727872,0.1605851352,0.09000000358,0.03999999911,0.07999999821,0.07999999821,0.07999999821,0.03999999911,0.07999999821,0.1800000072,0.03999999911,0.1700000018,0.09000000358,0.03999999911,
From\To,A,T,C,G,
A,-,0.08546824008,0.0394259654,0.08191379905,
T,0.08076532185,-,0.08206052333,0.03935547173,
C,0.08076532185,0.1778921187,-,0.03935547173,
G,0.1681035459,0.08546824008,0.0394259654,-,
GTR+G+I,81,22062.72656,21407.19727,-10622.3252,0,3.074992657,0.9065374732,0.3295529187,0.3487426043,0.1608727872,0.1605851352,0.0700000003,0.05000000075,0.07999999821,0.0700000003,0.07999999821,0.05000000075,0.1000000015,0.1800000072,0.01999999955,0.1700000018,0.1099999994,0.01999999955,
From\To,A,T,C,G,
A,-,0.07181272656,0.0478766337,0.08174017072,
T,0.06786120683,-,0.08099134266,0.04993714765,
C,0.09807678312,0.1755743325,-,0.02494465001,
G,0.1677472293,0.1084484532,0.02498933114,-,
TN93+G+I,78,22064.03125,21432.76172,-10638.12695,0,3.085886955,0.9083646536,0.3295529187,0.3487426043,0.1608727872,0.1605851352,0.09000000358,0.03999999911,0.07999999821,0.07999999821,0.07999999821,0.03999999911,0.07999999821,0.1800000072,0.03999999911,0.1700000018,0.09000000358,0.03999999911,
From\To,A,T,C,G,
A,-,0.08547186106,0.03942763805,0.08228226006,
T,0.08076874912,-,0.08169895411,0.03935714066,
C,0.08076874912,0.1771083027,-,0.03935714066,
G,0.1688597053,0.08547186106,0.03942763805,-,
T92,73,22083.07617,21492.24219,-10672.89844,n/a,n/a,0.8878542781,0.3392710388,0.3392710388,0.1607289612,0.1607289612,0.07999999821,0.03999999911,0.07999999821,0.07999999821,0.07999999821,0.03999999911,0.07999999821,0.1700000018,0.03999999911,0.1700000018,0.07999999821,0.03999999911,
From\To,A,T,C,G,
A,-,0.08407751471,0.03983154893,0.08106586337,
T,0.08407751471,-,0.08106586337,0.03983154893,
C,0.08407751471,0.1711160094,-,0.03983154893,
G,0.1711160094,0.08407751471,0.03983154893,-,
GTR+I,80,22105.43359,21457.99023,-10648.72754,0.04967011139,n/a,0.8870075345,0.3295529187,0.3487426043,0.1608727872,0.1605851352,0.0700000003,0.05000000075,0.07999999821,0.0700000003,0.07999999821,0.05000000075,0.1000000015,0.1700000018,0.02999999933,0.1700000018,0.1099999994,0.02999999933,
From\To,A,T,C,G,
A,-,0.07358074933,0.04785163701,0.08073037863,
T,0.06953193992,-,0.08034870028,0.04990461469,
C,0.09802557528,0.1741811931,-,0.02587306313,
G,0.1656749398,0.1083777994,0.02591940761,-,
GTR,79,22111.05469,21471.69922,-10656.58887,n/a,n/a,0.8886295557,0.3295529187,0.3487426043,0.1608727872,0.1605851352,0.0700000003,0.05000000075,0.07999999821,0.0700000003,0.07999999821,0.05000000075,0.1000000015,0.1700000018,0.02999999933,0.1700000018,0.1099999994,0.02999999933,
From\To,A,T,C,G,
A,-,0.07202843577,0.04767619446,0.08092496544,
T,0.06806504726,-,0.0799818635,0.05047886819,
C,0.09766617417,0.1733859777,-,0.02702245302,
G,0.1660742611,0.1096249148,0.02707085572,-,
HKY,75,22324.22461,21717.2168,-10783.37402,n/a,n/a,0.8886009455,0.3295529187,0.3487426043,0.1608727872,0.1605851352,0.09000000358,0.03999999911,0.07999999821,0.07999999821,0.07999999821,0.03999999911,0.07999999821,0.1800000072,0.03999999911,0.1700000018,0.09000000358,0.03999999911,
From\To,A,T,C,G,
A,-,0.08643271029,0.03987086937,0.08102557808,
T,0.08167672157,-,0.08117071539,0.03979958221,
C,0.08167672157,0.1759631783,-,0.03979958221,
G,0.1662807465,0.08643271029,0.03987086937,-,
TN93,76,22334.28711,21719.19141,-10783.35449,n/a,n/a,0.8884684443,0.3295529187,0.3487426043,0.1608727872,0.1605851352,0.09000000358,0.03999999911,0.07999999821,0.07999999821,0.07999999821,0.03999999911,0.07999999821,0.1700000018,0.03999999911,0.1700000018,0.09000000358,0.03999999911,
From\To,A,T,C,G,
A,-,0.08643620461,0.03987248242,0.08160986751,
T,0.08168002963,-,0.08060142398,0.03980119154,
C,0.08168002963,0.1747290641,-,0.03980119154,
G,0.167479828,0.08643620461,0.03987248242,-,
T92+I,74,22370.61719,21771.69727,-10811.61914,0.0760242939,n/a,0.9263352752,0.3392710388,0.3392710388,0.1607289612,0.1607289612,0.07999999821,0.03999999911,0.07999999821,0.07999999821,0.07999999821,0.03999999911,0.07999999821,0.1700000018,0.03999999911,0.1700000018,0.07999999821,0.03999999911,
From\To,A,T,C,G,
A,-,0.0822789073,0.03897946328,0.08277003467,
T,0.0822789073,-,0.08277003467,0.03897946328,
C,0.0822789073,0.1747132242,-,0.03897946328,
G,0.1747132242,0.0822789073,0.03897946328,-,
K2+G,73,22531.67969,21940.8457,-10897.2002,n/a,2.731929779,1.037279129,0.25,0.25,0.25,0.25,0.05999999866,0.05999999866,0.1299999952,0.05999999866,0.1299999952,0.05999999866,0.05999999866,0.1299999952,0.05999999866,0.1299999952,0.05999999866,0.05999999866,
From\To,A,T,C,G,
A,-,0.06135634705,0.06135634705,0.1272873133,
T,0.06135634705,-,0.1272873133,0.06135634705,
C,0.06135634705,0.1272873133,-,0.06135634705,
G,0.1272873133,0.06135634705,0.06135634705,-,
K2+G+I,74,22542.01758,21943.0957,-10897.31934,0,2.731012106,1.039138079,0.25,0.25,0.25,0.25,0.05999999866,0.05999999866,0.1299999952,0.05999999866,0.1299999952,0.05999999866,0.05999999866,0.1299999952,0.05999999866,0.1299999952,0.05999999866,0.05999999866,
From\To,A,T,C,G,
A,-,0.06130041182,0.06130041182,0.1273991764,
T,0.06130041182,-,0.1273991764,0.06130041182,
C,0.06130041182,0.1273991764,-,0.06130041182,
G,0.1273991764,0.06130041182,0.06130041182,-,
K2+I,73,22578.79297,21987.95898,-10920.75684,0.07173445821,n/a,1.019249797,0.25,0.25,0.25,0.25,0.05999999866,0.05999999866,0.1299999952,0.05999999866,0.1299999952,0.05999999866,0.05999999866,0.1299999952,0.05999999866,0.1299999952,0.05999999866,0.05999999866,
From\To,A,T,C,G,
A,-,0.06190418079,0.06190418079,0.1261916459,
T,0.06190418079,-,0.1261916459,0.06190418079,
C,0.06190418079,0.1261916459,-,0.06190418079,
G,0.1261916459,0.06190418079,0.06190418079,-,
K2,72,22606.125,22023.37891,-10939.47266,n/a,n/a,1.013979077,0.25,0.25,0.25,0.25,0.05999999866,0.05999999866,0.1299999952,0.05999999866,0.1299999952,0.05999999866,0.05999999866,0.1299999952,0.05999999866,0.1299999952,0.05999999866,0.05999999866,
From\To,A,T,C,G,
A,-,0.06206618622,0.06206618622,0.125867635,
T,0.06206618622,-,0.125867635,0.06206618622,
C,0.06206618622,0.125867635,-,0.06206618622,
G,0.125867635,0.06206618622,0.06206618622,-,
JC+G,72,22611.2793,22028.5332,-10942.0498,n/a,2.782161951,0.5,0.25,0.25,0.25,0.25,0.07999999821,0.07999999821,0.07999999821,0.07999999821,0.07999999821,0.07999999821,0.07999999821,0.07999999821,0.07999999821,0.07999999821,0.07999999821,0.07999999821,
From\To,A,T,C,G,
A,-,0.08333333582,0.08333333582,0.08333333582,
T,0.08333333582,-,0.08333333582,0.08333333582,
C,0.08333333582,0.08333333582,-,0.08333333582,
G,0.08333333582,0.08333333582,0.08333333582,-,
HKY+G,76,22636.24609,22021.15039,-10934.33398,n/a,2.030841827,0.8985197544,0.3295529187,0.3487426043,0.1608727872,0.1605851352,0.09000000358,0.03999999911,0.07999999821,0.07999999821,0.07999999821,0.03999999911,0.07999999821,0.1800000072,0.03999999911,0.1700000018,0.09000000358,0.03999999911,
From\To,A,T,C,G,
A,-,0.08594876528,0.03964762762,0.08147127181,
T,0.08121940494,-,0.08161719888,0.03957673535,
C,0.08121940494,0.1769310832,-,0.03957673535,
G,0.1671953946,0.08594876528,0.03964762762,-,
TN93+G,77,22646.14062,22022.95703,-10934.23145,n/a,2.032808781,0.8980481625,0.3295529187,0.3487426043,0.1608727872,0.1605851352,0.09000000358,0.03999999911,0.07999999821,0.07999999821,0.07999999821,0.03999999911,0.07999999821,0.1700000018,0.03999999911,0.1700000018,0.09000000358,0.03999999911,
From\To,A,T,C,G,
A,-,0.08596353233,0.03965444118,0.08305069059,
T,0.08123335987,-,0.08006868511,0.03958353773,
C,0.08123335987,0.1735741794,-,0.03958353773,
G,0.1704366803,0.08596353233,0.03965444118,-,
JC,71,22685.47656,22110.81836,-10984.19824,n/a,n/a,0.5,0.25,0.25,0.25,0.25,0.07999999821,0.07999999821,0.07999999821,0.07999999821,0.07999999821,0.07999999821,0.07999999821,0.07999999821,0.07999999821,0.07999999821,0.07999999821,0.07999999821,
From\To,A,T,C,G,
A,-,0.08333333582,0.08333333582,0.08333333582,
T,0.08333333582,-,0.08333333582,0.08333333582,
C,0.08333333582,0.08333333582,-,0.08333333582,
G,0.08333333582,0.08333333582,0.08333333582,-,
JC+G+I,73,22761.28906,22170.45508,-11012.00488,0,1.724999428,0.5,0.25,0.25,0.25,0.25,0.07999999821,0.07999999821,0.07999999821,0.07999999821,0.07999999821,0.07999999821,0.07999999821,0.07999999821,0.07999999821,0.07999999821,0.07999999821,0.07999999821,
From\To,A,T,C,G,
A,-,0.08333333582,0.08333333582,0.08333333582,
T,0.08333333582,-,0.08333333582,0.08333333582,
C,0.08333333582,0.08333333582,-,0.08333333582,
G,0.08333333582,0.08333333582,0.08333333582,-,
JC+I,72,23022.64062,22439.89453,-11147.73047,0.09773229063,n/a,0.5,0.25,0.25,0.25,0.25,0.07999999821,0.07999999821,0.07999999821,0.07999999821,0.07999999821,0.07999999821,0.07999999821,0.07999999821,0.07999999821,0.07999999821,0.07999999821,0.07999999821,
From\To,A,T,C,G,
A,-,0.08333333582,0.08333333582,0.08333333582,
T,0.08333333582,-,0.08333333582,0.08333333582,
C,0.08333333582,0.08333333582,-,0.08333333582,
G,0.08333333582,0.08333333582,0.08333333582,-,
HKY+I,76,23652.99414,23037.89844,-11442.70801,0.09410063922,n/a,0.8919129372,0.3295529187,0.3487426043,0.1608727872,0.1605851352,0.09000000358,0.03999999911,0.07999999821,0.07999999821,0.07999999821,0.03999999911,0.07999999821,0.1800000072,0.03999999911,0.1700000018,0.09000000358,0.03999999911,
From\To,A,T,C,G,
A,-,0.08627051115,0.03979604691,0.08117495477,
T,0.08152344823,-,0.0813203603,0.03972489387,
C,0.08152344823,0.1762875766,-,0.03972489387,
G,0.1665872931,0.08627051115,0.03979604691,-,
TN93+I,77,23662.875,23039.69141,-11442.59863,0.09411734343,n/a,0.8913065195,0.3295529187,0.3487426043,0.1608727872,0.1605851352,0.09000000358,0.03999999911,0.07999999821,0.07999999821,0.07999999821,0.03999999911,0.07999999821,0.1800000072,0.03999999911,0.1700000018,0.09000000358,0.03999999911,
From\To,A,T,C,G,
A,-,0.08630212396,0.03981063142,0.08076220751,
T,0.08155332506,-,0.08166082948,0.03973944858,
C,0.08155332506,0.1770256609,-,0.03973944858,
G,0.1657402515,0.08630212396,0.03981063142,-,
