Model,#Param,BIC,AICc,lnL,Invariant,Gamma,R,Freq A,Freq T,Freq C,Freq G,A=>T,A=>C,A=>G,T=>A,T=>C,T=>G,C=>A,C=>T,C=>G,G=>A,G=>T,G=>C,
T92+G,68,19723.3457,19190.08594,-9526.794922,n/a,0.9490056038,1.181946993,0.2083025426,0.2083025426,0.2916974425,0.2916974425,0.05000000075,0.0700000003,0.1599999964,0.05000000075,0.1599999964,0.0700000003,0.05000000075,0.1099999994,0.0700000003,0.1099999994,0.05000000075,0.0700000003,
From\To,A,T,C,G,
A,-,0.04700458795,0.06582310051,0.1600512564,
T,0.04700458795,-,0.1600512564,0.06582310051,
C,0.04700458795,0.1142933667,-,0.06582310051,
G,0.1142933667,0.04700458795,0.06582310051,-,
GTR+G,74,19731.26562,19151.00195,-9501.207031,n/a,0.9172744155,1.176258445,0.2033146769,0.2126042396,0.2891903222,0.2942045927,0.07999999821,0.0700000003,0.1700000018,0.07999999821,0.1400000006,0.05999999866,0.05000000075,0.1099999994,0.03999999911,0.1199999973,0.05000000075,0.03999999911,
From\To,A,T,C,G,
A,-,0.08012162894,0.06664294004,0.1711486876,
T,0.07662077993,-,0.1429469585,0.06380158663,
C,0.0468531847,0.1050904021,-,0.04155069217,
G,0.1182749793,0.04610563442,0.04084252566,-,
K2+G,67,19733.17383,19207.75,-9536.633789,n/a,0.9849711657,1.145511866,0.25,0.25,0.25,0.25,0.05999999866,0.05999999866,0.1299999952,0.05999999866,0.1299999952,0.05999999866,0.05999999866,0.1299999952,0.05999999866,0.1299999952,0.05999999866,0.05999999866,
From\To,A,T,C,G,
A,-,0.05826115608,0.05826115608,0.1334776878,
T,0.05826115608,-,0.1334776878,0.05826115608,
C,0.05826115608,0.1334776878,-,0.05826115608,
G,0.1334776878,0.05826115608,0.05826115608,-,
HKY+G,70,19748.54883,19199.62109,-9529.547852,n/a,0.9649312496,1.200995207,0.2033146769,0.2126042396,0.2891903222,0.2942045927,0.05000000075,0.05999999866,0.1599999964,0.05000000075,0.1599999964,0.0700000003,0.05000000075,0.1199999973,0.0700000003,0.1099999994,0.05000000075,0.05999999866,
From\To,A,T,C,G,
A,-,0.04757561535,0.06471370161,0.162735045,
T,0.04549684003,-,0.1599614918,0.06583577394,
C,0.04549684003,0.1175989881,-,0.06583577394,
G,0.1124606058,0.04757561535,0.06471370161,-,
TN93+G,71,19755.24023,19198.47852,-9527.96875,n/a,0.9627169371,1.202566862,0.2033146769,0.2126042396,0.2891903222,0.2942045927,0.05000000075,0.05999999866,0.1800000072,0.05000000075,0.150000006,0.0700000003,0.05000000075,0.1099999994,0.0700000003,0.1199999973,0.05000000075,0.05999999866,
From\To,A,T,C,G,
A,-,0.04752148688,0.06464007497,0.1758551747,
T,0.04544507712,-,0.147468105,0.06576086581,
C,0.04544507712,0.1084142253,-,0.06576086581,
G,0.1215274706,0.04752148688,0.06464007497,-,
HKY+G+I,71,19758.39844,19201.63672,-9529.547852,0,0.9649041891,1.20100379,0.2033146769,0.2126042396,0.2891903222,0.2942045927,0.05000000075,0.05999999866,0.1599999964,0.05000000075,0.1599999964,0.0700000003,0.05000000075,0.1199999973,0.0700000003,0.1099999994,0.05000000075,0.05999999866,
From\To,A,T,C,G,
A,-,0.04757542908,0.06471344829,0.1627355665,
T,0.04549666122,-,0.1599619985,0.06583551317,
C,0.04549666122,0.1175993681,-,0.06583551317,
G,0.1124609634,0.04757542908,0.06471344829,-,
TN93+G+I,72,19765.08984,19200.49414,-9527.96875,0,0.9626882076,1.202577949,0.2033146769,0.2126042396,0.2891903222,0.2942045927,0.05000000075,0.05999999866,0.1800000072,0.05000000075,0.150000006,0.0700000003,0.05000000075,0.1099999994,0.0700000003,0.1199999973,0.05000000075,0.05999999866,
From\To,A,T,C,G,
A,-,0.04752124473,0.06463974714,0.1758560985,
T,0.04544484615,-,0.1474685073,0.06576053053,
C,0.04544484615,0.1084145233,-,0.06576053053,
G,0.1215281188,0.04752124473,0.06463974714,-,
T92+G+I,69,19804.25,19263.1582,-9562.323242,0,0.9331938624,1.19829464,0.2083025426,0.2083025426,0.2916974425,0.2916974425,0.05000000075,0.0700000003,0.1599999964,0.05000000075,0.1599999964,0.0700000003,0.05000000075,0.1199999973,0.0700000003,0.1199999973,0.05000000075,0.0700000003,
From\To,A,T,C,G,
A,-,0.04665055498,0.06532733142,0.1610427946,
T,0.04665055498,-,0.1610427946,0.06532733142,
C,0.04665055498,0.1150014326,-,0.06532733142,
G,0.1150014326,0.04665055498,0.06532733142,-,
GTR+G+I,75,19812.43945,19224.3418,-9536.869141,0,0.9016677141,1.192103148,0.2033146769,0.2126042396,0.2891903222,0.2942045927,0.07999999821,0.0700000003,0.1700000018,0.07999999821,0.1400000006,0.05999999866,0.05000000075,0.1000000015,0.03999999911,0.1199999973,0.05000000075,0.03999999911,
From\To,A,T,C,G,
A,-,0.08030533791,0.0659597218,0.1733607799,
T,0.07679646462,-,0.1425875872,0.06340120733,
C,0.04637284949,0.1048262119,-,0.040732041,
G,0.1198036745,0.04581629857,0.0400378257,-,
K2+G+I,68,19816.37305,19283.11328,-9573.308594,0,0.9664481878,1.160192728,0.25,0.25,0.25,0.25,0.05999999866,0.05999999866,0.1299999952,0.05999999866,0.1299999952,0.05999999866,0.05999999866,0.1299999952,0.05999999866,0.1299999952,0.05999999866,0.05999999866,
From\To,A,T,C,G,
A,-,0.05786520988,0.05786520988,0.1342695802,
T,0.05786520988,-,0.1342695802,0.05786520988,
C,0.05786520988,0.1342695802,-,0.05786520988,
G,0.1342695802,0.05786520988,0.05786520988,-,
JC+G,66,19924.74805,19407.16016,-9637.345703,n/a,1.00926733,0.5,0.25,0.25,0.25,0.25,0.07999999821,0.07999999821,0.07999999821,0.07999999821,0.07999999821,0.07999999821,0.07999999821,0.07999999821,0.07999999821,0.07999999821,0.07999999821,0.07999999821,
From\To,A,T,C,G,
A,-,0.08333333582,0.08333333582,0.08333333582,
T,0.08333333582,-,0.08333333582,0.08333333582,
C,0.08333333582,0.08333333582,-,0.08333333582,
G,0.08333333582,0.08333333582,0.08333333582,-,
K2+I,67,20030.68555,19505.26172,-9685.389648,0.1528705209,n/a,1.077591181,0.25,0.25,0.25,0.25,0.05999999866,0.05999999866,0.1299999952,0.05999999866,0.1299999952,0.05999999866,0.05999999866,0.1299999952,0.05999999866,0.1299999952,0.05999999866,0.05999999866,
From\To,A,T,C,G,
A,-,0.06016583368,0.06016583368,0.1296683401,
T,0.06016583368,-,0.1296683401,0.06016583368,
C,0.06016583368,0.1296683401,-,0.06016583368,
G,0.1296683401,0.06016583368,0.06016583368,-,
T92+I,68,20031.67578,19498.41797,-9680.960938,0.1529123187,n/a,1.090268731,0.2083025426,0.2083025426,0.2916974425,0.2916974425,0.05000000075,0.0700000003,0.150000006,0.05000000075,0.150000006,0.0700000003,0.05000000075,0.1099999994,0.0700000003,0.1099999994,0.05000000075,0.0700000003,
From\To,A,T,C,G,
A,-,0.04909399524,0.06874901056,0.1541994363,
T,0.04909399524,-,0.1541994363,0.06874901056,
C,0.04909399524,0.1101145521,-,0.06874901056,
G,0.1101145521,0.04909399524,0.06874901056,-,
JC+G+I,67,20044.86133,19519.4375,-9692.477539,0,0.8225116134,0.5,0.25,0.25,0.25,0.25,0.07999999821,0.07999999821,0.07999999821,0.07999999821,0.07999999821,0.07999999821,0.07999999821,0.07999999821,0.07999999821,0.07999999821,0.07999999821,0.07999999821,
From\To,A,T,C,G,
A,-,0.08333333582,0.08333333582,0.08333333582,
T,0.08333333582,-,0.08333333582,0.08333333582,
C,0.08333333582,0.08333333582,-,0.08333333582,
G,0.08333333582,0.08333333582,0.08333333582,-,
GTR+I,74,20059.14453,19478.88086,-9665.145508,0.1527400166,n/a,1.089023829,0.2033146769,0.2126042396,0.2891903222,0.2942045927,0.0700000003,0.0700000003,0.1700000018,0.0700000003,0.1400000006,0.0700000003,0.05000000075,0.1000000015,0.05000000075,0.1199999973,0.05000000075,0.05000000075,
From\To,A,T,C,G,
A,-,0.07409791648,0.0672814399,0.1686947197,
T,0.07086027414,-,0.136088863,0.06803368777,
C,0.04730207846,0.100048542,-,0.05136240646,
G,0.1165791303,0.04916392267,0.0504870154,-,
K2,66,20150.99414,19633.40625,-9750.46875,n/a,n/a,1.022966623,0.25,0.25,0.25,0.25,0.05999999866,0.05999999866,0.1299999952,0.05999999866,0.1299999952,0.05999999866,0.05999999866,0.1299999952,0.05999999866,0.1299999952,0.05999999866,0.05999999866,
From\To,A,T,C,G,
A,-,0.06179044023,0.06179044023,0.126419127,
T,0.06179044023,-,0.126419127,0.06179044023,
C,0.06179044023,0.126419127,-,0.06179044023,
G,0.126419127,0.06179044023,0.06179044023,-,
T92,67,20155.48438,19630.0625,-9747.789062,n/a,n/a,1.046260118,0.2083025426,0.2083025426,0.2916974425,0.2916974425,0.05000000075,0.0700000003,0.150000006,0.05000000075,0.150000006,0.0700000003,0.05000000075,0.1099999994,0.0700000003,0.1099999994,0.05000000075,0.0700000003,
From\To,A,T,C,G,
A,-,0.05016440526,0.07024796307,0.1512015313,
T,0.05016440526,-,0.1512015313,0.07024796307,
C,0.05016440526,0.1079737395,-,0.07024796307,
G,0.1079737395,0.05016440526,0.07024796307,-,
GTR,73,20180.42383,19607.99414,-9730.710938,n/a,n/a,1.040883899,0.2033146769,0.2126042396,0.2891903222,0.2942045927,0.0700000003,0.0700000003,0.1599999964,0.0700000003,0.1400000006,0.0700000003,0.05000000075,0.1000000015,0.05000000075,0.1099999994,0.05000000075,0.05000000075,
From\To,A,T,C,G,
A,-,0.07437609881,0.07054503262,0.1599467397,
T,0.07112630457,-,0.1381949335,0.06927346438,
C,0.04959654436,0.1015968621,-,0.05282540992,
G,0.1105336919,0.05005983636,0.05192508548,-,
HKY,69,20292.01562,19750.92188,-9806.205078,n/a,n/a,1.074148774,0.2033146769,0.2126042396,0.2891903222,0.2942045927,0.05000000075,0.0700000003,0.150000006,0.05000000075,0.150000006,0.0700000003,0.05000000075,0.1099999994,0.0700000003,0.1099999994,0.05000000075,0.0700000003,
From\To,A,T,C,G,
A,-,0.05052532628,0.06872598827,0.1545713544,
T,0.0483176671,-,0.1519369185,0.06991761923,
C,0.0483176671,0.1116995662,-,0.06991761923,
G,0.1068189517,0.05052532628,0.06872598827,-,
TN93,70,20297.08789,19748.16016,-9803.816406,n/a,n/a,1.074535131,0.2033146769,0.2126042396,0.2891903222,0.2942045927,0.05000000075,0.0700000003,0.1700000018,0.05000000075,0.1400000006,0.0700000003,0.05000000075,0.1000000015,0.0700000003,0.1199999973,0.05000000075,0.0700000003,
From\To,A,T,C,G,
A,-,0.05049620941,0.06868638098,0.1667593271,
T,0.04828982055,-,0.1402164996,0.06987732649,
C,0.04828982055,0.1030830592,-,0.06987732649,
G,0.1152416393,0.05049620941,0.06868638098,-,
JC,65,20322.55664,19812.80273,-9841.173828,n/a,n/a,0.5,0.25,0.25,0.25,0.25,0.07999999821,0.07999999821,0.07999999821,0.07999999821,0.07999999821,0.07999999821,0.07999999821,0.07999999821,0.07999999821,0.07999999821,0.07999999821,0.07999999821,
From\To,A,T,C,G,
A,-,0.08333333582,0.08333333582,0.08333333582,
T,0.08333333582,-,0.08333333582,0.08333333582,
C,0.08333333582,0.08333333582,-,0.08333333582,
G,0.08333333582,0.08333333582,0.08333333582,-,
JC+I,66,20413.60156,19896.01367,-9881.772461,0.1378371865,n/a,0.5,0.25,0.25,0.25,0.25,0.07999999821,0.07999999821,0.07999999821,0.07999999821,0.07999999821,0.07999999821,0.07999999821,0.07999999821,0.07999999821,0.07999999821,0.07999999821,0.07999999821,
From\To,A,T,C,G,
A,-,0.08333333582,0.08333333582,0.08333333582,
T,0.08333333582,-,0.08333333582,0.08333333582,
C,0.08333333582,0.08333333582,-,0.08333333582,
G,0.08333333582,0.08333333582,0.08333333582,-,
TN93+I,71,20557.39648,20000.63477,-9929.045898,0.1648946702,n/a,1.118690968,0.2033146769,0.2126042396,0.2891903222,0.2942045927,0.05000000075,0.0700000003,0.1800000072,0.05000000075,0.1400000006,0.0700000003,0.05000000075,0.1000000015,0.0700000003,0.1199999973,0.05000000075,0.0700000003,
From\To,A,T,C,G,
A,-,0.0494199954,0.06722248346,0.175798431,
T,0.04726063088,-,0.1372378021,0.06838804483,
C,0.04726063088,0.1008931994,-,0.06838804483,
G,0.1214882582,0.0494199954,0.06722248346,-,
HKY+I,70,20657.17969,20108.25195,-9983.862305,0.1647568643,n/a,1.124037027,0.2033146769,0.2126042396,0.2891903222,0.2942045927,0.05000000075,0.0700000003,0.1599999964,0.05000000075,0.1599999964,0.0700000003,0.05000000075,0.1099999994,0.0700000003,0.1099999994,0.05000000075,0.0700000003,
From\To,A,T,C,G,
A,-,0.04932261631,0.06709002703,0.1579000056,
T,0.04716750979,-,0.155208841,0.06825329363,
C,0.04716750979,0.1141049862,-,0.06825329363,
G,0.1091192737,0.04932261631,0.06709002703,-,
