Model,#Param,BIC,AICc,lnL,Invariant,Gamma,R,Freq A,Freq T,Freq C,Freq G,A=>T,A=>C,A=>G,T=>A,T=>C,T=>G,C=>A,C=>T,C=>G,G=>A,G=>T,G=>C,
K2+G,595,99920.49219,93936.40625,-46371.15234,n/a,0.9628235102,1.744737267,0.25,0.25,0.25,0.25,0.05000000075,0.05000000075,0.1599999964,0.05000000075,0.1599999964,0.05000000075,0.05000000075,0.1599999964,0.05000000075,0.1599999964,0.05000000075,0.05000000075,
From\To,A,T,C,G,
A,-,0.04554169998,0.04554169998,0.1589166075,
T,0.04554169998,-,0.1589166075,0.04554169998,
C,0.04554169998,0.1589166075,-,0.04554169998,
G,0.1589166075,0.04554169998,0.04554169998,-,
GTR+G,602,100390.375,94335.9375,-46563.87109,n/a,0.9498175979,1.339795589,0.1978264451,0.2000507116,0.3007185757,0.3007185757,0.0700000003,0.05999999866,0.1700000018,0.0700000003,0.1800000072,0.05999999866,0.03999999911,0.1199999973,0.03999999911,0.1099999994,0.03999999911,0.03999999911,
From\To,A,T,C,G,
A,-,0.07392057031,0.05742667615,0.1669318676,
T,0.07309868932,-,0.1765247732,0.0617107898,
C,0.0377779007,0.1174317524,-,0.04215445369,
G,0.1098154336,0.04105262831,0.04215445369,-,
K2+G+I,596,100397.1641,94403.03906,-46603.46094,0.008567919955,0.8890085816,1.84818089,0.25,0.25,0.25,0.25,0.03999999911,0.03999999911,0.1599999964,0.03999999911,0.1599999964,0.03999999911,0.03999999911,0.1599999964,0.03999999911,0.1599999964,0.03999999911,0.03999999911,
From\To,A,T,C,G,
A,-,0.04388765991,0.04388765991,0.1622246802,
T,0.04388765991,-,0.1622246802,0.04388765991,
C,0.04388765991,0.1622246802,-,0.04388765991,
G,0.1622246802,0.04388765991,0.04388765991,-,
GTR+G+I,603,100728.8359,94664.35156,-46727.07031,0.01348566078,0.8650880456,1.367914438,0.1978264451,0.2000507116,0.3007185757,0.3007185757,0.0700000003,0.05999999866,0.1700000018,0.0700000003,0.1800000072,0.05999999866,0.03999999911,0.1199999973,0.03999999911,0.1099999994,0.03999999911,0.03999999911,
From\To,A,T,C,G,
A,-,0.07458546758,0.05638553202,0.169637531,
T,0.07375618815,-,0.1764395088,0.06176681072,
C,0.03709298745,0.1173750311,-,0.0401378572,
G,0.1115953401,0.04108989611,0.0401378572,-,
T92+G,596,100729.4297,94735.30469,-46769.59375,n/a,0.9490337372,1.64515841,0.1992814392,0.1992814392,0.3007185757,0.3007185757,0.03999999911,0.05999999866,0.1899999976,0.03999999911,0.1899999976,0.05999999866,0.03999999911,0.1299999952,0.05999999866,0.1299999952,0.03999999911,0.05999999866,
From\To,A,T,C,G,
A,-,0.03668959066,0.05536511913,0.18998833,
T,0.03668959066,-,0.18998833,0.05536511913,
C,0.03668959066,0.1259022653,-,0.05536511913,
G,0.1259022653,0.03668959066,0.05536511913,-,
T92+G+I,597,101172.125,95167.94531,-46984.90625,0.01193760801,0.8757837415,1.667879701,0.1992814392,0.1992814392,0.3007185757,0.3007185757,0.03999999911,0.05000000075,0.1899999976,0.03999999911,0.1899999976,0.05000000075,0.03999999911,0.1299999952,0.05000000075,0.1299999952,0.03999999911,0.05000000075,
From\To,A,T,C,G,
A,-,0.03637222201,0.05488620698,0.1909461468,
T,0.03637222201,-,0.1909461468,0.05488620698,
C,0.03637222201,0.1265369952,-,0.05488620698,
G,0.1265369952,0.03637222201,0.05488620698,-,
JC+G+I,595,102371.3984,96387.32031,-47596.60938,0.006342886016,0.9904215932,0.5,0.25,0.25,0.25,0.25,0.07999999821,0.07999999821,0.07999999821,0.07999999821,0.07999999821,0.07999999821,0.07999999821,0.07999999821,0.07999999821,0.07999999821,0.07999999821,0.07999999821,
From\To,A,T,C,G,
A,-,0.08333333582,0.08333333582,0.08333333582,
T,0.08333333582,-,0.08333333582,0.08333333582,
C,0.08333333582,0.08333333582,-,0.08333333582,
G,0.08333333582,0.08333333582,0.08333333582,-,
JC+G,594,102466.8281,96492.80469,-47650.35547,n/a,0.9769941568,0.5,0.25,0.25,0.25,0.25,0.07999999821,0.07999999821,0.07999999821,0.07999999821,0.07999999821,0.07999999821,0.07999999821,0.07999999821,0.07999999821,0.07999999821,0.07999999821,0.07999999821,
From\To,A,T,C,G,
A,-,0.08333333582,0.08333333582,0.08333333582,
T,0.08333333582,-,0.08333333582,0.08333333582,
C,0.08333333582,0.08333333582,-,0.08333333582,
G,0.08333333582,0.08333333582,0.08333333582,-,
K2,594,104758.1016,98784.07031,-48795.99219,n/a,n/a,1.616844773,0.25,0.25,0.25,0.25,0.05000000075,0.05000000075,0.150000006,0.05000000075,0.150000006,0.05000000075,0.05000000075,0.150000006,0.05000000075,0.150000006,0.05000000075,0.05000000075,
From\To,A,T,C,G,
A,-,0.04776744917,0.04776744917,0.1544651091,
T,0.04776744917,-,0.1544651091,0.04776744917,
C,0.04776744917,0.1544651091,-,0.04776744917,
G,0.1544651091,0.04776744917,0.04776744917,-,
GTR,601,105312.2188,99267.84375,-49030.82812,n/a,n/a,1.263729095,0.1978264451,0.2000507116,0.3007185757,0.3007185757,0.0700000003,0.05999999866,0.1700000018,0.0700000003,0.1599999964,0.05999999866,0.03999999911,0.1099999994,0.05000000075,0.1099999994,0.03999999911,0.05000000075,
From\To,A,T,C,G,
A,-,0.06787711382,0.06252913177,0.1727413833,
T,0.06712242216,-,0.1637671143,0.06440018117,
C,0.04113452882,0.1089448109,-,0.0475021936,
G,0.1136372015,0.04284172133,0.0475021936,-,
K2+I,595,105396.4453,99412.36719,-49109.13281,0.03402791917,n/a,1.685688496,0.25,0.25,0.25,0.25,0.05000000075,0.05000000075,0.1599999964,0.05000000075,0.1599999964,0.05000000075,0.05000000075,0.1599999964,0.05000000075,0.1599999964,0.05000000075,0.05000000075,
From\To,A,T,C,G,
A,-,0.0465429984,0.0465429984,0.1569139957,
T,0.0465429984,-,0.1569139957,0.0465429984,
C,0.0465429984,0.1569139957,-,0.0465429984,
G,0.1569139957,0.0465429984,0.0465429984,-,
T92,595,105653.5625,99669.48438,-49237.69141,n/a,n/a,1.4979949,0.1992814392,0.1992814392,0.3007185757,0.3007185757,0.03999999911,0.05999999866,0.1800000072,0.03999999911,0.1800000072,0.05999999866,0.03999999911,0.1199999973,0.05999999866,0.1199999973,0.03999999911,0.05999999866,
From\To,A,T,C,G,
A,-,0.03888728097,0.05868146941,0.1833556294,
T,0.03888728097,-,0.1833556294,0.05868146941,
C,0.03888728097,0.1215068772,-,0.05868146941,
G,0.1215068772,0.03888728097,0.05868146941,-,
GTR+I,602,105936.1406,99881.71094,-49336.75781,0.03475330397,n/a,1.305121422,0.1978264451,0.2000507116,0.3007185757,0.3007185757,0.0700000003,0.05999999866,0.1700000018,0.0700000003,0.1700000018,0.05999999866,0.03999999911,0.1099999994,0.05000000075,0.1199999973,0.03999999911,0.05000000075,
From\To,A,T,C,G,
A,-,0.06956168264,0.06056426466,0.174846217,
T,0.06878826022,-,0.1659594327,0.062050201,
C,0.03984194621,0.1104032323,-,0.04584223777,
G,0.1150218546,0.04127841815,0.04584223777,-,
T92+I,596,106235.9688,100241.8438,-49522.86328,0.03540039062,n/a,1.592558503,0.1992814392,0.1992814392,0.3007185757,0.3007185757,0.03999999911,0.05999999866,0.1899999976,0.03999999911,0.1899999976,0.05999999866,0.03999999911,0.1199999973,0.05999999866,0.1199999973,0.03999999911,0.05999999866,
From\To,A,T,C,G,
A,-,0.03744598478,0.05650653318,0.1877055019,
T,0.03744598478,-,0.1877055019,0.05650653318,
C,0.03744598478,0.1243894622,-,0.05650653318,
G,0.1243894622,0.03744598478,0.05650653318,-,
HKY,597,106665.6484,100661.4688,-49731.67188,n/a,n/a,1.541337371,0.1978264451,0.2000507116,0.3007185757,0.3007185757,0.03999999911,0.05999999866,0.1899999976,0.03999999911,0.1899999976,0.05999999866,0.03999999911,0.1199999973,0.05999999866,0.1199999973,0.03999999911,0.05999999866,
From\To,A,T,C,G,
A,-,0.03837880865,0.05769147351,0.1855419576,
T,0.03795209527,-,0.1855419576,0.05769147351,
C,0.03795209527,0.1234303638,-,0.05769147351,
G,0.1220580041,0.03837880865,0.05769147351,-,
JC+I,594,106668.4922,100694.4609,-49751.1875,0.05197739974,n/a,0.5,0.25,0.25,0.25,0.25,0.07999999821,0.07999999821,0.07999999821,0.07999999821,0.07999999821,0.07999999821,0.07999999821,0.07999999821,0.07999999821,0.07999999821,0.07999999821,0.07999999821,
From\To,A,T,C,G,
A,-,0.08333333582,0.08333333582,0.08333333582,
T,0.08333333582,-,0.08333333582,0.08333333582,
C,0.08333333582,0.08333333582,-,0.08333333582,
G,0.08333333582,0.08333333582,0.08333333582,-,
HKY+G+I,599,106920.7656,100896.4844,-49847.16406,0.01247240044,0.8486293554,1.762389064,0.1978264451,0.2000507116,0.3007185757,0.3007185757,0.03999999911,0.05000000075,0.1899999976,0.02999999933,0.1899999976,0.05000000075,0.02999999933,0.1299999952,0.05000000075,0.1299999952,0.03999999911,0.05000000075,
From\To,A,T,C,G,
A,-,0.0352608338,0.0530044958,0.1949159205,
T,0.03486878425,-,0.1949159205,0.0530044958,
C,0.03486878425,0.1296663135,-,0.0530044958,
G,0.1282246262,0.0352608338,0.0530044958,-,
TN93+G+I,600,107007.5234,100973.1953,-49884.51172,0.01067048218,0.8507370949,1.755816102,0.1978264451,0.2000507116,0.3007185757,0.3007185757,0.03999999911,0.05000000075,0.2099999934,0.02999999933,0.1700000018,0.05000000075,0.02999999933,0.1199999973,0.05000000075,0.1400000006,0.03999999911,0.05000000075,
From\To,A,T,C,G,
A,-,0.0353384167,0.05312111974,0.2144750059,
T,0.0349455066,-,0.1749782413,0.05312111974,
C,0.0349455066,0.1164029241,-,0.05312111974,
G,0.1410914958,0.0353384167,0.05312111974,-,
JC,593,107190.1328,101226.1484,-50018.03906,n/a,n/a,0.5,0.25,0.25,0.25,0.25,0.07999999821,0.07999999821,0.07999999821,0.07999999821,0.07999999821,0.07999999821,0.07999999821,0.07999999821,0.07999999821,0.07999999821,0.07999999821,0.07999999821,
From\To,A,T,C,G,
A,-,0.08333333582,0.08333333582,0.08333333582,
T,0.08333333582,-,0.08333333582,0.08333333582,
C,0.08333333582,0.08333333582,-,0.08333333582,
G,0.08333333582,0.08333333582,0.08333333582,-,
TN93+I,599,114352.7578,108328.4766,-53563.16016,0.03612753376,n/a,1.663256526,0.1978264451,0.2000507116,0.3007185757,0.3007185757,0.03999999911,0.05000000075,0.2099999934,0.03999999911,0.1700000018,0.05000000075,0.03999999911,0.1099999994,0.05000000075,0.1400000006,0.03999999911,0.05000000075,
From\To,A,T,C,G,
A,-,0.03658574447,0.05499611795,0.2113816589,
T,0.03617896512,-,0.170574531,0.05499611795,
C,0.03617896512,0.113473393,-,0.05499611795,
G,0.1390565336,0.03658574447,0.05499611795,-,
HKY+I,598,127828.0547,121813.8203,-60306.83984,0.05471620709,n/a,1.552049279,0.1978264451,0.2000507116,0.3007185757,0.3007185757,0.03999999911,0.05999999866,0.1899999976,0.03999999911,0.1899999976,0.05999999866,0.03999999911,0.1199999973,0.05999999866,0.1199999973,0.03999999911,0.05999999866,
From\To,A,T,C,G,
A,-,0.03821505606,0.05744532123,0.1860342771,
T,0.03779016435,-,0.1860342771,0.05744532123,
C,0.03779016435,0.123757869,-,0.05744532123,
G,0.122381866,0.03821505606,0.05744532123,-,
TN93,598,129249.2891,123235.0547,-61017.45703,n/a,n/a,1.545481801,0.1978264451,0.2000507116,0.3007185757,0.3007185757,0.03999999911,0.05999999866,0.200000003,0.03999999911,0.1700000018,0.05999999866,0.03999999911,0.1099999994,0.05999999866,0.1299999952,0.03999999911,0.05999999866,
From\To,A,T,C,G,
A,-,0.03830759227,0.05758442357,0.2037556469,
T,0.03788167238,-,0.1678364277,0.05758442357,
C,0.03788167238,0.1116518974,-,0.05758442357,
G,0.1340398043,0.03830759227,0.05758442357,-,
TN93+G,599,146091.7188,140067.4375,-69432.64062,n/a,0.9610737562,1.678547263,0.1978264451,0.2000507116,0.3007185757,0.3007185757,0.03999999911,0.05000000075,0.2099999934,0.03999999911,0.1800000072,0.05000000075,0.03999999911,0.1199999973,0.05000000075,0.1400000006,0.03999999911,0.05000000075,
From\To,A,T,C,G,
A,-,0.03637521341,0.05467964336,0.2080591321,
T,0.03597077355,-,0.1751453876,0.05467964336,
C,0.03597077355,0.1165141165,-,0.05467964336,
G,0.1368708313,0.03637521341,0.05467964336,-,
HKY+G,598,146099.9062,140085.6719,-69442.76562,n/a,0.9572988153,1.678468227,0.1978264451,0.2000507116,0.3007185757,0.3007185757,0.03999999911,0.05000000075,0.1899999976,0.03999999911,0.1899999976,0.05000000075,0.03999999911,0.1299999952,0.05000000075,0.1299999952,0.03999999911,0.05000000075,
From\To,A,T,C,G,
A,-,0.03638299555,0.0546913445,0.1915422231,
T,0.03597847372,-,0.1915422231,0.0546913445,
C,0.03597847372,0.12742199,-,0.0546913445,
G,0.1260052472,0.03638299555,0.0546913445,-,
