{
    "version": 2,
    "name": "Fiber Extruder",
    "inherits": "fdmextruder",
    "metadata": {
        "machine": "sfe520",
        "position": "1"
    },
    "overrides": {
        "extruder_nr": {
            "default_value": 1,
            "maximum_value": "1"
        },
        "machine_nozzle_offset_x": {
            "default_value": 17.3
        },
        "machine_nozzle_offset_y": {
            "default_value": 0.0
        },
        "machine_nozzle_size": {
            "default_value": 0.4
        },
        "material_diameter": {
            "default_value": 0.4
        },
        "machine_fiber_extruder": {
            "default_value": true
        },
        "machine_fiber_cut_distance": {
            "default_value": 15.4
        },
        "machine_fiber_cut_min_distance": {
            "default_value": 15.4
        },
        "machine_fiber_restart_length": {
            "default_value": 15.4
        },
        "machine_fiber_cut_code": {
            "default_value": ";FIBER CUT\nM400\nG92 B0\nG0 B1 F100\nG92 B0\nM400\n;END FIBER CUT"
        },
        "machine_fiber_prime_code": {
            "default_value": ";PRIME FIBER\nM400\nG92 E0\nG1 F1200 E{machine_fiber_restart_length}\nG92 E0\nM400\n;END FIBER PRIME"
        },
        "machine_extruder_start_code": {
            "default_value": ""
        },
        "machine_extruder_start_pos_abs": {
            "default_value": true
        },
        "machine_extruder_start_pos_x": {
            "value": 0
        },
        "machine_extruder_start_pos_y": {
            "value": 0
        },
        "machine_extruder_end_pos_abs": {
            "default_value": false
        },
        "machine_extruder_end_pos_x": {
            "value": 0
        },
        "machine_extruder_end_pos_y": {
            "value": 0
        }
    }
}