{
  "contacts": [
    {
      "id": 1,
      "name": "Wayne Rooney",
      "phone": "0123456789",
      "address": "123, Some Street\nLeicester\nLE1 2AB",
      "email": "steve228uk@gmail.com",
      "website": "stepsrl.orgss",
      "notes": ""
    },
    {
      "id": 2,
      "name": "Declan Proud",
      "phone": "9123485933333",
      "address": "234, Some Street\nLeicester\nLE1 2AB",
      "email": "declan@declan.com",
      "website": "declanproud.me",
      "notes": "Some notes about the contact."
    }
  ],
  "student": [
    {
      "id": "1",
      "name": "Fausto",
      "gender": "Male",
      "age": "37"
    },
    {
      "id": 2,
      "name": "Giuseppe",
      "gender": "Male",
      "age": 32
    },
    {
      "id": 3,
      "name": "Carmen",
      "gender": "Female",
      "age": 37
    },
    {
      "id": 4,
      "name": "Carmen",
      "gender": "Female",
      "age": 37
    },
    {
      "id": 5,
      "name": "Carmen",
      "gender": "Female",
      "age": 37
    },
    {
      "id": 6,
      "name": "Carmen",
      "gender": "Female",
      "age": 37
    },
    {
      "id": 7,
      "name": "Carmen",
      "gender": "Female",
      "age": 37
    },
    {
      "id": 8,
      "name": "Carmen",
      "gender": "Female",
      "age": 37
    },
    {
      "id": 9,
      "name": "Carmen",
      "gender": "Female",
      "age": 37
    },
    {
      "id": 10,
      "name": "Carmen",
      "gender": "Female",
      "age": 37
    },
    {
      "id": 11,
      "name": "Carmen",
      "gender": "Female",
      "age": 37
    },
    {
      "id": 12,
      "name": "Carmen",
      "gender": "Female",
      "age": 37
    },
    {
      "id": 13,
      "name": "Carmen",
      "gender": "Female",
      "age": 37
    },
    {
      "id": 14,
      "name": "Carmen",
      "gender": "Female",
      "age": 37
    },
    {
      "id": 15,
      "name": "Carmen",
      "gender": "Female",
      "age": 37
    },
    {
      "id": 16,
      "name": "Carmen",
      "gender": "Female",
      "age": 37
    },
    {
      "id": 17,
      "name": "Carmen",
      "gender": "Female",
      "age": 37
    },
    {
      "id": 18,
      "name": "Carmen",
      "gender": "Female",
      "age": 37
    }
  ]
}