D:\eclipse-workspaces\eclipse-oxygen-64bits\workspace-ogeric\swagger.client\target\generated-sources\main\java\gti4\dev\prozu\client\model\Order.java
D:\eclipse-workspaces\eclipse-oxygen-64bits\workspace-ogeric\swagger.client\target\generated-sources\main\java\gti4\dev\prozu\client\invoker\ApiCallback.java
D:\eclipse-workspaces\eclipse-oxygen-64bits\workspace-ogeric\swagger.client\target\generated-sources\main\java\gti4\dev\prozu\client\invoker\Pair.java
D:\eclipse-workspaces\eclipse-oxygen-64bits\workspace-ogeric\swagger.client\target\generated-sources\main\java\gti4\dev\prozu\client\model\User.java
D:\eclipse-workspaces\eclipse-oxygen-64bits\workspace-ogeric\swagger.client\target\generated-sources\main\java\gti4\dev\prozu\client\invoker\auth\OAuth.java
D:\eclipse-workspaces\eclipse-oxygen-64bits\workspace-ogeric\swagger.client\target\generated-sources\main\java\gti4\dev\prozu\client\invoker\auth\HttpBasicAuth.java
D:\eclipse-workspaces\eclipse-oxygen-64bits\workspace-ogeric\swagger.client\target\generated-sources\main\java\gti4\dev\prozu\client\model\Tag.java
D:\eclipse-workspaces\eclipse-oxygen-64bits\workspace-ogeric\swagger.client\target\generated-sources\main\java\gti4\dev\prozu\client\model\Pet.java
D:\eclipse-workspaces\eclipse-oxygen-64bits\workspace-ogeric\swagger.client\target\generated-sources\main\java\gti4\dev\prozu\client\invoker\Configuration.java
D:\eclipse-workspaces\eclipse-oxygen-64bits\workspace-ogeric\swagger.client\target\generated-sources\main\java\gti4\dev\prozu\client\api\PetApi.java
D:\eclipse-workspaces\eclipse-oxygen-64bits\workspace-ogeric\swagger.client\target\generated-sources\main\java\gti4\dev\prozu\client\invoker\auth\OAuthFlow.java
D:\eclipse-workspaces\eclipse-oxygen-64bits\workspace-ogeric\swagger.client\target\generated-sources\main\java\gti4\dev\prozu\client\model\Category.java
D:\eclipse-workspaces\eclipse-oxygen-64bits\workspace-ogeric\swagger.client\target\generated-sources\main\java\gti4\dev\prozu\client\invoker\ProgressResponseBody.java
D:\eclipse-workspaces\eclipse-oxygen-64bits\workspace-ogeric\swagger.client\target\generated-sources\main\java\gti4\dev\prozu\client\invoker\ApiClient.java
D:\eclipse-workspaces\eclipse-oxygen-64bits\workspace-ogeric\swagger.client\target\generated-sources\main\java\gti4\dev\prozu\client\invoker\GzipRequestInterceptor.java
D:\eclipse-workspaces\eclipse-oxygen-64bits\workspace-ogeric\swagger.client\target\generated-sources\main\java\gti4\dev\prozu\client\invoker\StringUtil.java
D:\eclipse-workspaces\eclipse-oxygen-64bits\workspace-ogeric\swagger.client\target\generated-sources\main\java\gti4\dev\prozu\client\model\ModelApiResponse.java
D:\eclipse-workspaces\eclipse-oxygen-64bits\workspace-ogeric\swagger.client\target\generated-sources\main\java\gti4\dev\prozu\client\invoker\auth\Authentication.java
D:\eclipse-workspaces\eclipse-oxygen-64bits\workspace-ogeric\swagger.client\target\generated-sources\main\java\gti4\dev\prozu\client\invoker\ApiResponse.java
D:\eclipse-workspaces\eclipse-oxygen-64bits\workspace-ogeric\swagger.client\target\generated-sources\main\java\gti4\dev\prozu\client\invoker\JSON.java
D:\eclipse-workspaces\eclipse-oxygen-64bits\workspace-ogeric\swagger.client\target\generated-sources\main\java\gti4\dev\prozu\client\api\StoreApi.java
D:\eclipse-workspaces\eclipse-oxygen-64bits\workspace-ogeric\swagger.client\target\generated-sources\main\java\gti4\dev\prozu\client\invoker\auth\ApiKeyAuth.java
D:\eclipse-workspaces\eclipse-oxygen-64bits\workspace-ogeric\swagger.client\target\generated-sources\main\java\gti4\dev\prozu\client\invoker\ApiException.java
D:\eclipse-workspaces\eclipse-oxygen-64bits\workspace-ogeric\swagger.client\target\generated-sources\main\java\gti4\dev\prozu\client\api\UserApi.java
D:\eclipse-workspaces\eclipse-oxygen-64bits\workspace-ogeric\swagger.client\target\generated-sources\main\java\gti4\dev\prozu\client\invoker\ProgressRequestBody.java
