<?xml version="1.0" encoding="UTF-8" standalone="no"?>
<svg
   xmlns:dc="http://purl.org/dc/elements/1.1/"
   xmlns:cc="http://creativecommons.org/ns#"
   xmlns:rdf="http://www.w3.org/1999/02/22-rdf-syntax-ns#"
   xmlns:svg="http://www.w3.org/2000/svg"
   xmlns="http://www.w3.org/2000/svg"
   width="130mm"
   height="130mm"
   viewBox="0 0 130 130"
   version="1.1"
   id="svg8">
  <defs
     id="defs2" />
  <metadata
     id="metadata5">
    <rdf:RDF>
      <cc:Work
         rdf:about="">
        <dc:format>image/svg+xml</dc:format>
        <dc:type
           rdf:resource="http://purl.org/dc/dcmitype/StillImage" />
        <dc:title></dc:title>
      </cc:Work>
    </rdf:RDF>
  </metadata>
  <ellipse
     ry="16.846764"
     rx="13.994555"
     cy="71.774651"
     cx="46.74081"
     id="path4508"
     style="opacity:1;fill:none;fill-opacity:1;stroke:#000000;stroke-width:8.55662537;stroke-linecap:square;stroke-linejoin:miter;stroke-miterlimit:4;stroke-dasharray:none;stroke-dashoffset:0;stroke-opacity:1" />
  <ellipse
     ry="16.846764"
     rx="13.994555"
     cy="71.774986"
     cx="90.096153"
     id="path4508-3"
     style="opacity:1;fill:none;fill-opacity:1;stroke:#000000;stroke-width:8.55662537;stroke-linecap:square;stroke-linejoin:miter;stroke-miterlimit:4;stroke-dasharray:none;stroke-dashoffset:0;stroke-opacity:1" />
  <path
     id="path4525"
     d="m 56.438307,75.767715 11.40884,34.226525 11.40883,-34.226525"
     style="fill:none;fill-rule:evenodd;stroke:#000000;stroke-width:8.55662537;stroke-linecap:butt;stroke-linejoin:miter;stroke-miterlimit:4;stroke-dasharray:none;stroke-opacity:1" />
  <path
     id="path4527"
     d="m 26.204907,36.407235 11.40883,-22.81766 11.40883,22.81766"
     style="fill:none;fill-rule:evenodd;stroke:#000000;stroke-width:9.98272991;stroke-linecap:butt;stroke-linejoin:miter;stroke-miterlimit:4;stroke-dasharray:none;stroke-opacity:1" />
  <path
     id="path4527-6"
     d="m 79.826447,34.695925 11.40885,-22.81767 11.408873,22.81767"
     style="fill:none;fill-rule:evenodd;stroke:#000000;stroke-width:9.98272991;stroke-linecap:butt;stroke-linejoin:miter;stroke-miterlimit:4;stroke-dasharray:none;stroke-opacity:1" />
  <circle
     r="5.7044163"
     cy="78.456947"
     cx="47.474239"
     id="path4560"
     style="opacity:1;fill:none;fill-opacity:1;stroke:#000000;stroke-width:7.546;stroke-linecap:square;stroke-linejoin:miter;stroke-miterlimit:4;stroke-dasharray:none;stroke-dashoffset:0;stroke-opacity:1" />
  <circle
     r="5.7044163"
     cy="78.701439"
     cx="91.479729"
     id="path4560-7"
     style="opacity:1;fill:none;fill-opacity:1;stroke:#000000;stroke-width:7.546;stroke-linecap:square;stroke-linejoin:miter;stroke-miterlimit:4;stroke-dasharray:none;stroke-dashoffset:0;stroke-opacity:1" />
  <path
     id="path4623"
     d="M 39.422927,123.38542 H 18.256255 V 38.718775 H 113.50633 V 123.38542 H 92.339597"
     style="fill:none;fill-rule:evenodd;stroke:#000000;stroke-width:13.22916603;stroke-linecap:butt;stroke-linejoin:miter;stroke-miterlimit:4;stroke-dasharray:none;stroke-opacity:1" />
</svg>
