%YAML 1.1
%TAG !u! tag:unity3d.com,2011:
--- !u!114 &11400000
MonoBehaviour:
  m_ObjectHideFlags: 0
  m_CorrespondingSourceObject: {fileID: 0}
  m_PrefabInstance: {fileID: 0}
  m_PrefabAsset: {fileID: 0}
  m_GameObject: {fileID: 0}
  m_Enabled: 1
  m_EditorHideFlags: 0
  m_Script: {fileID: 11500000, guid: 9bc1f65ec54e4e5085251696fa07cc85, type: 3}
  m_Name: MoneyBonusStaticData
  m_EditorClassIdentifier: 
  Type: 1
  Prefab: {fileID: 5234678211700467923, guid: 41ce60d96860a80499699b054d6ba499, type: 3}
