%YAML 1.1
%TAG !u! tag:unity3d.com,2011:
--- !u!114 &11400000
MonoBehaviour:
  m_ObjectHideFlags: 0
  m_CorrespondingSourceObject: {fileID: 0}
  m_PrefabInstance: {fileID: 0}
  m_PrefabAsset: {fileID: 0}
  m_GameObject: {fileID: 0}
  m_Enabled: 1
  m_EditorHideFlags: 0
  m_Script: {fileID: 11500000, guid: 3b8def1af7cd4addb33cb8ccc0fafa98, type: 3}
  m_Name: Sting Sword
  m_EditorClassIdentifier: 
  ID: 9084387c-6810-43b7-9e6c-15b6311aafdc
  Name: Sting Sword
  Description: Sting Sword
  Icon: {fileID: 21300000, guid: af50dc4fa7b6d314895d0f8c79adb4a5, type: 3}
  Rarity: 3
  Type: 1
  StackableType: 0
  Characteristics:
  - Type: 2
    Value: 100
  - Type: 1
    Value: 300
  SellCost: 50
  BuyCost: 100
  Prefab: {fileID: 2698968396759130890, guid: aa6745f0866b0ce4cb5ad5a0d2a1bb34, type: 3}
