%YAML 1.1
%TAG !u! tag:unity3d.com,2011:
--- !u!114 &11400000
MonoBehaviour:
  m_ObjectHideFlags: 0
  m_CorrespondingSourceObject: {fileID: 0}
  m_PrefabInstance: {fileID: 0}
  m_PrefabAsset: {fileID: 0}
  m_GameObject: {fileID: 0}
  m_Enabled: 1
  m_EditorHideFlags: 0
  m_Script: {fileID: 11500000, guid: 3b8def1af7cd4addb33cb8ccc0fafa98, type: 3}
  m_Name: Cloth Armor
  m_EditorClassIdentifier: 
  ID: 50c9baed-40fe-440a-b483-acb89cc7df54
  Name: Cloth Armor
  Description: Cloth Armor
  Icon: {fileID: 21300000, guid: 65a9410232dbc154c9cec96a5fbd07b1, type: 3}
  Rarity: 1
  Type: 4
  StackableType: 0
  Characteristics:
  - Type: 1
    Value: 5
  SellCost: 50
  BuyCost: 100
  Prefab: {fileID: 3695127209119335518, guid: 5625ab15ab14c3a45958cb79f983e28c, type: 3}
