%YAML 1.1
%TAG !u! tag:unity3d.com,2011:
--- !u!114 &11400000
MonoBehaviour:
  m_ObjectHideFlags: 0
  m_CorrespondingSourceObject: {fileID: 0}
  m_PrefabInstance: {fileID: 0}
  m_PrefabAsset: {fileID: 0}
  m_GameObject: {fileID: 0}
  m_Enabled: 1
  m_EditorHideFlags: 0
  m_Script: {fileID: 11500000, guid: 87fd0fb7f8434660a10f2db2435efa68, type: 3}
  m_Name: LevelWaveStaticData
  m_EditorClassIdentifier: 
  FirstWaveDelay: 0
  Waves:
  - WaveIndex: 1
    Enemies:
    - Id: 0
      Count: 1
      HpCoeff: 0.5
      DamageCoeff: 10
    Bonuses:
    - TypeId: 0
      Value: 50
      Count: 1
    - TypeId: 1
      Value: 100
      Count: 1
    WaveWaitTime: 5
  - WaveIndex: 2
    Enemies:
    - Id: 0
      Count: 3
      HpCoeff: 0.5
      DamageCoeff: 5
    Bonuses:
    - TypeId: 0
      Value: 100
      Count: 1
    WaveWaitTime: 10
  - WaveIndex: 3
    Enemies:
    - Id: 0
      Count: 10
      HpCoeff: 0.5
      DamageCoeff: 1
    Bonuses:
    - TypeId: 1
      Value: 3000
      Count: 1
    WaveWaitTime: 20
  - WaveIndex: 4
    Enemies:
    - Id: 0
      Count: 10
      HpCoeff: 0.5
      DamageCoeff: 1
    Bonuses:
    - TypeId: 1
      Value: 3000
      Count: 1
    WaveWaitTime: 20
  - WaveIndex: 5
    Enemies:
    - Id: 0
      Count: 10
      HpCoeff: 0.5
      DamageCoeff: 1
    Bonuses:
    - TypeId: 1
      Value: 3000
      Count: 1
    WaveWaitTime: 20
  - WaveIndex: 6
    Enemies:
    - Id: 0
      Count: 10
      HpCoeff: 0.5
      DamageCoeff: 1
    Bonuses:
    - TypeId: 1
      Value: 3000
      Count: 1
    WaveWaitTime: 20
