%YAML 1.1
%TAG !u! tag:unity3d.com,2011:
--- !u!1 &5878565469632646425
GameObject:
  m_ObjectHideFlags: 0
  m_CorrespondingSourceObject: {fileID: 0}
  m_PrefabInstance: {fileID: 0}
  m_PrefabAsset: {fileID: 0}
  serializedVersion: 6
  m_Component:
  - component: {fileID: 5878565469632646406}
  - component: {fileID: 5878565469632646405}
  - component: {fileID: 5878565469632646404}
  - component: {fileID: 5878565469632646407}
  m_Layer: 0
  m_Name: Point light 12 (43)
  m_TagString: Untagged
  m_Icon: {fileID: 0}
  m_NavMeshLayer: 0
  m_StaticEditorFlags: 0
  m_IsActive: 1
--- !u!4 &5878565469632646406
Transform:
  m_ObjectHideFlags: 0
  m_CorrespondingSourceObject: {fileID: 0}
  m_PrefabInstance: {fileID: 0}
  m_PrefabAsset: {fileID: 0}
  m_GameObject: {fileID: 5878565469632646425}
  m_LocalRotation: {x: 0.0060372204, y: -0.024312228, z: -0.2792521, w: -0.9598911}
  m_LocalPosition: {x: 0, y: 0, z: 0}
  m_LocalScale: {x: 1, y: 1, z: 1}
  m_ConstrainProportionsScale: 0
  m_Children: []
  m_Father: {fileID: 5878565470972748700}
  m_RootOrder: 1
  m_LocalEulerAnglesHint: {x: 0, y: 0, z: 0}
--- !u!108 &5878565469632646405
Light:
  m_ObjectHideFlags: 0
  m_CorrespondingSourceObject: {fileID: 0}
  m_PrefabInstance: {fileID: 0}
  m_PrefabAsset: {fileID: 0}
  m_GameObject: {fileID: 5878565469632646425}
  m_Enabled: 1
  serializedVersion: 10
  m_Type: 2
  m_Shape: 0
  m_Color: {r: 1, g: 0.6914807, b: 0.1397059, a: 1}
  m_Intensity: 3
  m_Range: 10
  m_SpotAngle: 30
  m_InnerSpotAngle: 21.80208
  m_CookieSize: 10
  m_Shadows:
    m_Type: 0
    m_Resolution: -1
    m_CustomResolution: -1
    m_Strength: 0.75
    m_Bias: 0.05
    m_NormalBias: 0.4
    m_NearPlane: 0.2
    m_CullingMatrixOverride:
      e00: 1
      e01: 0
      e02: 0
      e03: 0
      e10: 0
      e11: 1
      e12: 0
      e13: 0
      e20: 0
      e21: 0
      e22: 1
      e23: 0
      e30: 0
      e31: 0
      e32: 0
      e33: 1
    m_UseCullingMatrixOverride: 0
  m_Cookie: {fileID: 0}
  m_DrawHalo: 0
  m_Flare: {fileID: 0}
  m_RenderMode: 0
  m_CullingMask:
    serializedVersion: 2
    m_Bits: 4294967295
  m_RenderingLayerMask: 1
  m_Lightmapping: 4
  m_LightShadowCasterMode: 0
  m_AreaSize: {x: 1, y: 1}
  m_BounceIntensity: 1
  m_ColorTemperature: 6570
  m_UseColorTemperature: 0
  m_BoundingSphereOverride: {x: 0, y: 0, z: 0, w: 0}
  m_UseBoundingSphereOverride: 0
  m_UseViewFrustumForShadowCasterCull: 1
  m_ShadowRadius: 0
  m_ShadowAngle: 0
--- !u!111 &5878565469632646404
Animation:
  m_ObjectHideFlags: 0
  m_CorrespondingSourceObject: {fileID: 0}
  m_PrefabInstance: {fileID: 0}
  m_PrefabAsset: {fileID: 0}
  m_GameObject: {fileID: 5878565469632646425}
  m_Enabled: 1
  serializedVersion: 3
  m_Animation: {fileID: 7400000, guid: bef94c75514300347a74498742c666af, type: 2}
  m_Animations:
  - {fileID: 7400000, guid: bef94c75514300347a74498742c666af, type: 2}
  m_WrapMode: 4
  m_PlayAutomatically: 1
  m_AnimatePhysics: 0
  m_CullingType: 0
--- !u!114 &5878565469632646407
MonoBehaviour:
  m_ObjectHideFlags: 0
  m_CorrespondingSourceObject: {fileID: 0}
  m_PrefabInstance: {fileID: 0}
  m_PrefabAsset: {fileID: 0}
  m_GameObject: {fileID: 5878565469632646425}
  m_Enabled: 1
  m_EditorHideFlags: 0
  m_Script: {fileID: 11500000, guid: 474bcb49853aa07438625e644c072ee6, type: 3}
  m_Name: 
  m_EditorClassIdentifier: 
  m_Version: 1
  m_UsePipelineSettings: 1
  m_AdditionalLightsShadowResolutionTier: 2
  m_LightLayerMask: 1
  m_CustomShadowLayers: 0
  m_ShadowLayerMask: 1
  m_LightCookieSize: {x: 1, y: 1}
  m_LightCookieOffset: {x: 0, y: 0}
--- !u!1 &5878565470972748703
GameObject:
  m_ObjectHideFlags: 0
  m_CorrespondingSourceObject: {fileID: 0}
  m_PrefabInstance: {fileID: 0}
  m_PrefabAsset: {fileID: 0}
  serializedVersion: 6
  m_Component:
  - component: {fileID: 5878565470972748700}
  m_Layer: 0
  m_Name: WallCandle
  m_TagString: Untagged
  m_Icon: {fileID: 0}
  m_NavMeshLayer: 0
  m_StaticEditorFlags: 0
  m_IsActive: 1
--- !u!4 &5878565470972748700
Transform:
  m_ObjectHideFlags: 0
  m_CorrespondingSourceObject: {fileID: 0}
  m_PrefabInstance: {fileID: 0}
  m_PrefabAsset: {fileID: 0}
  m_GameObject: {fileID: 5878565470972748703}
  m_LocalRotation: {x: 0, y: 1, z: 0, w: 0}
  m_LocalPosition: {x: -19.73, y: 2.12, z: 57.49}
  m_LocalScale: {x: 1, y: 1, z: 1}
  m_ConstrainProportionsScale: 0
  m_Children:
  - {fileID: 5878565471080728048}
  - {fileID: 5878565469632646406}
  m_Father: {fileID: 0}
  m_RootOrder: 0
  m_LocalEulerAnglesHint: {x: 0, y: 180, z: 0}
--- !u!1001 &5878565471080664344
PrefabInstance:
  m_ObjectHideFlags: 0
  serializedVersion: 2
  m_Modification:
    m_TransformParent: {fileID: 5878565470972748700}
    m_Modifications:
    - target: {fileID: 198228, guid: ecfc727ab52f6f44da6c79e536989f0f, type: 3}
      propertyPath: m_Name
      value: SM_Prop_Torch_Ornate_07 (1)
      objectReference: {fileID: 0}
    - target: {fileID: 198228, guid: ecfc727ab52f6f44da6c79e536989f0f, type: 3}
      propertyPath: m_IsActive
      value: 1
      objectReference: {fileID: 0}
    - target: {fileID: 461032, guid: ecfc727ab52f6f44da6c79e536989f0f, type: 3}
      propertyPath: m_RootOrder
      value: 0
      objectReference: {fileID: 0}
    - target: {fileID: 461032, guid: ecfc727ab52f6f44da6c79e536989f0f, type: 3}
      propertyPath: m_LocalPosition.x
      value: 0.39700317
      objectReference: {fileID: 0}
    - target: {fileID: 461032, guid: ecfc727ab52f6f44da6c79e536989f0f, type: 3}
      propertyPath: m_LocalPosition.y
      value: -0.504
      objectReference: {fileID: 0}
    - target: {fileID: 461032, guid: ecfc727ab52f6f44da6c79e536989f0f, type: 3}
      propertyPath: m_LocalPosition.z
      value: -0.006996155
      objectReference: {fileID: 0}
    - target: {fileID: 461032, guid: ecfc727ab52f6f44da6c79e536989f0f, type: 3}
      propertyPath: m_LocalRotation.w
      value: -0.7071045
      objectReference: {fileID: 0}
    - target: {fileID: 461032, guid: ecfc727ab52f6f44da6c79e536989f0f, type: 3}
      propertyPath: m_LocalRotation.x
      value: -0
      objectReference: {fileID: 0}
    - target: {fileID: 461032, guid: ecfc727ab52f6f44da6c79e536989f0f, type: 3}
      propertyPath: m_LocalRotation.y
      value: 0.7071091
      objectReference: {fileID: 0}
    - target: {fileID: 461032, guid: ecfc727ab52f6f44da6c79e536989f0f, type: 3}
      propertyPath: m_LocalRotation.z
      value: -0
      objectReference: {fileID: 0}
    m_RemovedComponents: []
  m_SourcePrefab: {fileID: 100100000, guid: ecfc727ab52f6f44da6c79e536989f0f, type: 3}
--- !u!4 &5878565471080728048 stripped
Transform:
  m_CorrespondingSourceObject: {fileID: 461032, guid: ecfc727ab52f6f44da6c79e536989f0f,
    type: 3}
  m_PrefabInstance: {fileID: 5878565471080664344}
  m_PrefabAsset: {fileID: 0}
