%YAML 1.1
%TAG !u! tag:unity3d.com,2011:
--- !u!114 &11400000
MonoBehaviour:
  m_ObjectHideFlags: 0
  m_CorrespondingSourceObject: {fileID: 0}
  m_PrefabInstance: {fileID: 0}
  m_PrefabAsset: {fileID: 0}
  m_GameObject: {fileID: 0}
  m_Enabled: 1
  m_EditorHideFlags: 0
  m_Script: {fileID: 11500000, guid: e02401e3047f4709b957a61963da6d5e, type: 3}
  m_Name: KeyMandatoryInventoryItemStaticData
  m_EditorClassIdentifier: 
  Type: 6
  Prefab: {fileID: 6861376755807489607, guid: 70678aae559f9ee4fb204a63045b1054, type: 3}
  Icon: {fileID: 21300000, guid: 91963cef5ae0e1141bf9e095f8507435, type: 3}
