%YAML 1.1
%TAG !u! tag:unity3d.com,2011:
--- !u!114 &11400000
MonoBehaviour:
  m_ObjectHideFlags: 0
  m_CorrespondingSourceObject: {fileID: 0}
  m_PrefabInstance: {fileID: 0}
  m_PrefabAsset: {fileID: 0}
  m_GameObject: {fileID: 0}
  m_Enabled: 1
  m_EditorHideFlags: 0
  m_Script: {fileID: 11500000, guid: 3834bc35af024d141b3a66ce159bd5a3, type: 3}
  m_Name: AudioStaticData
  m_EditorClassIdentifier: 
  Audios:
  - LevelName: MainMenu
    AudioClip: {fileID: 8300000, guid: a527e3cdfdcca2d4ca3e19a1b701a2f9, type: 3}
  - LevelName: Game
    AudioClip: {fileID: 8300000, guid: 87baa0ee0a38a654eb766f36ee85bdc5, type: 3}
  - LevelName: Game2
    AudioClip: {fileID: 8300000, guid: a527e3cdfdcca2d4ca3e19a1b701a2f9, type: 3}
