%YAML 1.1
%TAG !u! tag:unity3d.com,2011:
--- !u!114 &11400000
MonoBehaviour:
  m_ObjectHideFlags: 0
  m_CorrespondingSourceObject: {fileID: 0}
  m_PrefabInstance: {fileID: 0}
  m_PrefabAsset: {fileID: 0}
  m_GameObject: {fileID: 0}
  m_Enabled: 1
  m_EditorHideFlags: 0
  m_Script: {fileID: 11500000, guid: 61f0c631653745ca98044409f6d5df99, type: 3}
  m_Name: MonsterStaticData
  m_EditorClassIdentifier: 
  Id: 0
  Hp: 100
  MoveData: {fileID: 11400000, guid: 9b935553aa05b734baa9344f44220a9c, type: 2}
  AttackData: {fileID: 11400000, guid: 7914f64ccf68c0c40aaa138ffe042740, type: 2}
  Prefab: {fileID: 142548, guid: 100d11a972102fd49823a64ea77dcdb8, type: 3}
