%YAML 1.1
%TAG !u! tag:unity3d.com,2011:
--- !u!1 &1047608724278983893
GameObject:
  m_ObjectHideFlags: 0
  m_CorrespondingSourceObject: {fileID: 0}
  m_PrefabInstance: {fileID: 0}
  m_PrefabAsset: {fileID: 0}
  serializedVersion: 6
  m_Component:
  - component: {fileID: 1047608724278983892}
  - component: {fileID: 1047608724278983889}
  - component: {fileID: 1047608724278983890}
  - component: {fileID: 1047608724278983891}
  m_Layer: 0
  m_Name: Point light 12 (43)
  m_TagString: Untagged
  m_Icon: {fileID: 0}
  m_NavMeshLayer: 0
  m_StaticEditorFlags: 0
  m_IsActive: 1
--- !u!4 &1047608724278983892
Transform:
  m_ObjectHideFlags: 0
  m_CorrespondingSourceObject: {fileID: 0}
  m_PrefabInstance: {fileID: 0}
  m_PrefabAsset: {fileID: 0}
  m_GameObject: {fileID: 1047608724278983893}
  m_LocalRotation: {x: -0, y: -0, z: -0, w: 1}
  m_LocalPosition: {x: 10.910004, y: 5.6, z: 75.956}
  m_LocalScale: {x: -28.721619, y: -28.72161, z: -28.72161}
  m_ConstrainProportionsScale: 0
  m_Children: []
  m_Father: {fileID: 1047608725197773222}
  m_RootOrder: 1
  m_LocalEulerAnglesHint: {x: 0, y: 0, z: 0}
--- !u!108 &1047608724278983889
Light:
  m_ObjectHideFlags: 0
  m_CorrespondingSourceObject: {fileID: 0}
  m_PrefabInstance: {fileID: 0}
  m_PrefabAsset: {fileID: 0}
  m_GameObject: {fileID: 1047608724278983893}
  m_Enabled: 1
  serializedVersion: 10
  m_Type: 2
  m_Shape: 0
  m_Color: {r: 1, g: 0.59999996, b: 0, a: 1}
  m_Intensity: 5
  m_Range: 10
  m_SpotAngle: 30
  m_InnerSpotAngle: 21.80208
  m_CookieSize: 10
  m_Shadows:
    m_Type: 0
    m_Resolution: -1
    m_CustomResolution: -1
    m_Strength: 0.75
    m_Bias: 0.05
    m_NormalBias: 0.4
    m_NearPlane: 0.2
    m_CullingMatrixOverride:
      e00: 1
      e01: 0
      e02: 0
      e03: 0
      e10: 0
      e11: 1
      e12: 0
      e13: 0
      e20: 0
      e21: 0
      e22: 1
      e23: 0
      e30: 0
      e31: 0
      e32: 0
      e33: 1
    m_UseCullingMatrixOverride: 0
  m_Cookie: {fileID: 0}
  m_DrawHalo: 0
  m_Flare: {fileID: 0}
  m_RenderMode: 0
  m_CullingMask:
    serializedVersion: 2
    m_Bits: 4294967295
  m_RenderingLayerMask: 1
  m_Lightmapping: 4
  m_LightShadowCasterMode: 0
  m_AreaSize: {x: 1, y: 1}
  m_BounceIntensity: 1
  m_ColorTemperature: 6570
  m_UseColorTemperature: 0
  m_BoundingSphereOverride: {x: 0, y: 0, z: 0, w: 0}
  m_UseBoundingSphereOverride: 0
  m_UseViewFrustumForShadowCasterCull: 1
  m_ShadowRadius: 0
  m_ShadowAngle: 0
--- !u!111 &1047608724278983890
Animation:
  m_ObjectHideFlags: 0
  m_CorrespondingSourceObject: {fileID: 0}
  m_PrefabInstance: {fileID: 0}
  m_PrefabAsset: {fileID: 0}
  m_GameObject: {fileID: 1047608724278983893}
  m_Enabled: 1
  serializedVersion: 3
  m_Animation: {fileID: 7400000, guid: bef94c75514300347a74498742c666af, type: 2}
  m_Animations:
  - {fileID: 7400000, guid: bef94c75514300347a74498742c666af, type: 2}
  m_WrapMode: 4
  m_PlayAutomatically: 1
  m_AnimatePhysics: 0
  m_CullingType: 0
--- !u!114 &1047608724278983891
MonoBehaviour:
  m_ObjectHideFlags: 0
  m_CorrespondingSourceObject: {fileID: 0}
  m_PrefabInstance: {fileID: 0}
  m_PrefabAsset: {fileID: 0}
  m_GameObject: {fileID: 1047608724278983893}
  m_Enabled: 1
  m_EditorHideFlags: 0
  m_Script: {fileID: 11500000, guid: 474bcb49853aa07438625e644c072ee6, type: 3}
  m_Name: 
  m_EditorClassIdentifier: 
  m_Version: 1
  m_UsePipelineSettings: 1
  m_AdditionalLightsShadowResolutionTier: 2
  m_LightLayerMask: 1
  m_CustomShadowLayers: 0
  m_ShadowLayerMask: 1
  m_LightCookieSize: {x: 1, y: 1}
  m_LightCookieOffset: {x: 0, y: 0}
--- !u!1 &1047608725197773223
GameObject:
  m_ObjectHideFlags: 0
  m_CorrespondingSourceObject: {fileID: 0}
  m_PrefabInstance: {fileID: 0}
  m_PrefabAsset: {fileID: 0}
  serializedVersion: 6
  m_Component:
  - component: {fileID: 1047608725197773222}
  m_Layer: 0
  m_Name: FloorLamp2
  m_TagString: Untagged
  m_Icon: {fileID: 0}
  m_NavMeshLayer: 0
  m_StaticEditorFlags: 0
  m_IsActive: 1
--- !u!4 &1047608725197773222
Transform:
  m_ObjectHideFlags: 0
  m_CorrespondingSourceObject: {fileID: 0}
  m_PrefabInstance: {fileID: 0}
  m_PrefabAsset: {fileID: 0}
  m_GameObject: {fileID: 1047608725197773223}
  m_LocalRotation: {x: -0, y: -0, z: -0, w: 1}
  m_LocalPosition: {x: 3.56, y: 0, z: 0}
  m_LocalScale: {x: 1, y: 1, z: 1}
  m_ConstrainProportionsScale: 0
  m_Children:
  - {fileID: 1047608724208645969}
  - {fileID: 1047608724278983892}
  m_Father: {fileID: 0}
  m_RootOrder: 0
  m_LocalEulerAnglesHint: {x: 0, y: 0, z: 0}
--- !u!1001 &1047608724208320385
PrefabInstance:
  m_ObjectHideFlags: 0
  serializedVersion: 2
  m_Modification:
    m_TransformParent: {fileID: 1047608725197773222}
    m_Modifications:
    - target: {fileID: 166584, guid: 184f44cf58e82434ab30e27aaaf9b05f, type: 3}
      propertyPath: m_Name
      value: SM_Prop_Brazier_08 (1)
      objectReference: {fileID: 0}
    - target: {fileID: 166584, guid: 184f44cf58e82434ab30e27aaaf9b05f, type: 3}
      propertyPath: m_IsActive
      value: 1
      objectReference: {fileID: 0}
    - target: {fileID: 461008, guid: 184f44cf58e82434ab30e27aaaf9b05f, type: 3}
      propertyPath: m_RootOrder
      value: 0
      objectReference: {fileID: 0}
    - target: {fileID: 461008, guid: 184f44cf58e82434ab30e27aaaf9b05f, type: 3}
      propertyPath: m_LocalPosition.x
      value: 10.910004
      objectReference: {fileID: 0}
    - target: {fileID: 461008, guid: 184f44cf58e82434ab30e27aaaf9b05f, type: 3}
      propertyPath: m_LocalPosition.y
      value: 5.08
      objectReference: {fileID: 0}
    - target: {fileID: 461008, guid: 184f44cf58e82434ab30e27aaaf9b05f, type: 3}
      propertyPath: m_LocalPosition.z
      value: 76.03
      objectReference: {fileID: 0}
    - target: {fileID: 461008, guid: 184f44cf58e82434ab30e27aaaf9b05f, type: 3}
      propertyPath: m_LocalRotation.w
      value: 0.9762313
      objectReference: {fileID: 0}
    - target: {fileID: 461008, guid: 184f44cf58e82434ab30e27aaaf9b05f, type: 3}
      propertyPath: m_LocalRotation.x
      value: -0
      objectReference: {fileID: 0}
    - target: {fileID: 461008, guid: 184f44cf58e82434ab30e27aaaf9b05f, type: 3}
      propertyPath: m_LocalRotation.y
      value: 0.21673155
      objectReference: {fileID: 0}
    - target: {fileID: 461008, guid: 184f44cf58e82434ab30e27aaaf9b05f, type: 3}
      propertyPath: m_LocalRotation.z
      value: -0
      objectReference: {fileID: 0}
    m_RemovedComponents: []
  m_SourcePrefab: {fileID: 100100000, guid: 184f44cf58e82434ab30e27aaaf9b05f, type: 3}
--- !u!4 &1047608724208645969 stripped
Transform:
  m_CorrespondingSourceObject: {fileID: 461008, guid: 184f44cf58e82434ab30e27aaaf9b05f,
    type: 3}
  m_PrefabInstance: {fileID: 1047608724208320385}
  m_PrefabAsset: {fileID: 0}
