﻿  HomeWork 16.5.cpp
D:\проекты\Проекты VisialStud\HomeWork 16.5\HomeWork 16.5.cpp(155,25): warning C4552: "!": результат выражения не используется
  HomeWork 16.5.vcxproj -> D:\проекты\Проекты VisialStud\HomeWork 16.5\Debug\HomeWork 16.5.exe
