^D:\ПРОЕКТЫ\ПРОЕКТЫ VISIALSTUD\HOMEWORK 18.5\DEBUG\HOMEWORK 18.5.OBJ
D:\проекты\Проекты VISIALSTUD\HOMEWORK 18.5\DEBUG\HOMEWORK 18.5.EXE
D:\проекты\Проекты VISIALSTUD\HOMEWORK 18.5\DEBUG\HOMEWORK 18.5.ILK
D:\ПРОЕКТЫ\ПРОЕКТЫ VISIALSTUD\HOMEWORK 18.5\DEBUG\HOMEWORK 18.5.PDB
