^D:\ПРОЕКТЫ\ПРОЕКТЫ VISIALSTUD\HOMEWORK 15.4\DEBUG\HOMEWORK 15.4.OBJ
D:\проекты\Проекты VISIALSTUD\HOMEWORK 15.4\DEBUG\HOMEWORK 15.4.EXE
D:\проекты\Проекты VISIALSTUD\HOMEWORK 15.4\DEBUG\HOMEWORK 15.4.ILK
D:\ПРОЕКТЫ\ПРОЕКТЫ VISIALSTUD\HOMEWORK 15.4\DEBUG\HOMEWORK 15.4.PDB
