<svg width="108" height="108" viewBox="0 0 108 108" fill="none" xmlns="http://www.w3.org/2000/svg">
<g filter="url(#filter0_d_673_3838)">
<circle cx="54" cy="54" r="40" fill="url(#paint0_linear_673_3838)" style="mix-blend-mode:multiply" shape-rendering="crispEdges"/>
</g>
<defs>
<filter id="filter0_d_673_3838" x="0" y="0" width="108" height="108" filterUnits="userSpaceOnUse" color-interpolation-filters="sRGB">
<feFlood flood-opacity="0" result="BackgroundImageFix"/>
<feColorMatrix in="SourceAlpha" type="matrix" values="0 0 0 0 0 0 0 0 0 0 0 0 0 0 0 0 0 0 127 0" result="hardAlpha"/>
<feOffset/>
<feGaussianBlur stdDeviation="7"/>
<feComposite in2="hardAlpha" operator="out"/>
<feColorMatrix type="matrix" values="0 0 0 0 0.298039 0 0 0 0 0.27451 0 0 0 0 0.447059 0 0 0 0.3 0"/>
<feBlend mode="normal" in2="BackgroundImageFix" result="effect1_dropShadow_673_3838"/>
<feBlend mode="normal" in="SourceGraphic" in2="effect1_dropShadow_673_3838" result="shape"/>
</filter>
<linearGradient id="paint0_linear_673_3838" x1="18.2623" y1="94.6154" x2="109.48" y2="58.4761" gradientUnits="userSpaceOnUse">
<stop stop-color="#C02660"/>
<stop offset="1" stop-color="#F9837D"/>
<stop offset="1" stop-color="#F9837D"/>
</linearGradient>
</defs>
</svg>
