[gd_scene load_steps=4 format=2]

[ext_resource path="res://Player.gd" type="Script" id=1]
[ext_resource path="res://icon.png" type="Texture" id=2]

[sub_resource type="ConvexPolygonShape2D" id=1]

custom_solver_bias = 0.0
points = PoolVector2Array( 0, -10, 8.66025, 5, -8.66025, 5 )

[node name="Main" type="Node2D" index="0"]

_sections_unfolded = [ "Material", "Pause", "Transform", "Visibility", "Z Index" ]

[node name="Player" type="Area2D" parent="." index="0"]

position = Vector2( 507.127, 551.881 )
input_pickable = true
gravity_vec = Vector2( 0, 1 )
gravity = 98.0
linear_damp = 0.1
angular_damp = 1.0
audio_bus_override = false
audio_bus_name = "Master"
script = ExtResource( 1 )
_sections_unfolded = [ "Material", "Pause", "Transform", "Visibility", "Z Index" ]
speed = 800

[node name="CollisionShape2D" type="CollisionShape2D" parent="Player" index="0"]

shape = SubResource( 1 )

[node name="Sprite" type="Sprite" parent="Player" index="1"]

texture = ExtResource( 2 )


