S0090000612E73726563BA
S113000018F09FE518F09FE518F09FE518F09FE5BC
S113001018F09FE5606FA0B814F09FE514F09FE519
S11300200C5E0000A45F0000A45F0000A45F000059
S10F0030A45F0000B03B0000AC3B0000EB
S1130044F04F2DE984D04DE20060A0E30040A0E12C
S11300540270A0E10350A0E108108DE52C608DE549
S1130064090000EA0110D7E408009DE50FE0A0E1CF
S113007414FF2FE108008DE5000050E33802000A64
S11300842C009DE5010080E22C008DE50000D7E5FD
S1130094000050E32C009D053202000A250050E3C1
S11300A4EFFFFF1A14608DE518608DE51C608DE583
S11300B420608DE524608DE528608DE50000A0E3D3
S11300C4000000EA010080E30110F7E5200051E399
S11300D4FBFFFF0A230051E30C00000A2B0051E349
S11300E40400000A2D0051E30600000A300051E325
S11300F40800000A090000EA020080E30008A0E105
S11301042008A0E1EFFFFFEA040080E3FAFFFFEA1E
S1130114080080E3F8FFFFEA100080E3F6FFFFEA3B
S11301242A0051E30D00001A001095E5001085E53E
S1130134042091E4001085E534208DE5000052E3A9
S11301440400005A040080E3001062E20008A0E105
S113015434108DE52008A0E1017087E20D0000EA67
S113016434608DE5070000EA34109DE58034E0E353
S1130174030051E1013181108310821030104112C7
S113018434108D15017087E20020D7E5301042E267
S11301940A0051E3F3FFFF3A0010D7E52E0051E3C0
S11301A40610E01130108D151700001A0110F7E540
S11301B42A0051E30600001A001095E5017087E255
S11301C4001085E5042091E4001085E530208DE5D8
S11301D40D0000EA30608DE5070000EA30109DE56B
S11301E48034E0E3030051E1013181108310821073
S11301F43010411230108D15017087E20020D7E5CC
S1130204301042E20A0051E3F3FFFF3AB803CDE1B0
S11302140010D7E5530D8FE2180080E23B0500EB94
S1130224000050E30100D7143A00CDE53A00DDE5BF
S1130234680050E30300001A0010D7E5680051E396
S11302446200A0030500000A6C0050E30500001AD4
S11302540000D7E56C0050E30200001A7100A0E32B
S11302643A00CDE5017087E244008DE210008DE58B
S11302740180D7E4250058E21E00000A1C0050E265
S1130284A100000A040040E2020050E39E00009A28
S1130294130050E2BD00000A090050E29A00000A6B
S11302A4020050E21201000A010050E2F200000AC6
S11302B4010040E2020050E39300009A040050E27B
S11302C4ED00000A050050E26600000A010050E255
S11302D4AE00000A010050E21E00000A030050E2CE
S11302E40800000A020050E2A800000A030050E2D9
S11302F4A600000A060100EA2500A0E34400CDE5B7
S11303040100A0E30A0100EA000095E5000085E588
S1130314048090E4000085E530909DE50C808DE533
S1130324000059E30300005A0800A0E1FF0400EBB5
S11303340090A0E1050000EA0920A0E10010A0E378
S11303440800A0E10E0500EB000050E30890401003
S113035418908DE5F70000EA001095E50D20A0E162
S1130364001085E5040091E4001085E50010A0E385
S1130374030082E810209DE544008DE20C008DE525
S113038403009DE83C30A0E3000051E30400001A9C
S1130394000050E30200001A30C09DE500005CE355
S11303A41100000A0FE000E230E08EE2FF800EE26A
S11303B43A0058E32002A0E101C043E227E08EA200
S11303C4010E80E10C30A0E102E0CCE72112B0E19F
S11303D40100001A000050E30300000A0CC09DE56C
S11303E402E083E00E005CE1EDFFFF3A021083E0DB
S11303F40C108DE530109DE53C0063E218008DE59A
S1130404010050E1070000AA000041E020008DE54E
S1130414B803DDE1EF10A0E3FF1C81E3000001E079
S1130424B803CDE1C30000EA000051E3C100005A5F
S11304343810DDE5141001E2100051E3BD00001A88
S113044434109DE514209DE5021041E020209DE533
S1130454021041E0003041E0010053E3B50000BA6A
S113046420308DE5B30000EA3A00DDE5620050E394
S11304741700000A680050E30600000A6A0050E30B
S11304840B00000A6C0050E31800000A710050E3EA
S11304940700000A150000EA000095E5000085E560
S11304A4041090E4000085E52C009DE5B000C1E152
S11304B4A00000EA000095E5000085E5042090E42E
S11304C4000085E52C009DE5C01FA0E1030082E83F
S11304D4980000EA000095E5000085E5041090E426
S11304E4000085E52C009DE50000C1E5910000EACB
S11304F4000095E5000085E5041090E4000085E51E
S11305042C009DE5000081E58A0000EA000095E5E1
S1130514070080E20720C0E3002085E50300B2E879
S1130524002085E50D20A0E1030082E8800411E3A6
S113053414009D152D10A0130800001AB803DDE162
S1130544020010E314009D152B10A0130300001ADD
S1130554010010E30500000A14009DE52010A0E347
S113056444208DE20210C0E7010080E214008DE50E
S113057414109DE544008DE2000081E00C008DE53B
S11305840810A0E10D00A0E1980100EB690000EA65
S11305943A00DDE56C0050E30A00000A710050E300
S11305A40100000A6A0050E30600001A000095E501
S11305B4070080E20720C0E3002085E50300B2E8D9
S11305C4002085E5040000EA001095E5001085E5A7
S11305D4040091E4001085E50010A0E30D20A0E1DF
S11305E4030082E83A00DDE5680050E30300920862
S11305F40008A0012008A0010800000A620050E3DA
S113060403009208FF0000020400000A740050E38F
S11306140100000A7A0050E30200001A030092E881
S11306240010A0E3030082E83800DDE5080010E3CD
S11306342700000A030092E8000051E30100001AB5
S1130644000050E32200000A200088E3780050E30D
S11306541F00001A14009DE53010A0E344208DE22D
S11306640210C0E7010080E2011080E214108DE55D
S113067444108DE20180C0E7150000EA3A00DDE58C
S11306840510A0E1B90000EB0D20A0E1030082E80D
S1130694000051E314009DB52D10A0B3080000BA66
S11306A4B803DDE1020010E314009D152B10A01320
S11306B40300001A010010E30500000A14009DE57C
S11306C42010A0E344208DE20210C0E7010080E280
S11306D414008DE514109DE544008DE2000081E0D2
S11306E40C008DE50810A0E10D00A0E1D10000EBA1
S11306F4100000EA0100A0E314008DE5000095E574
S1130704000085E5041090E4000085E54410CDE57F
S1130714080000EA2500A0E34400CDE50100A0E3BD
S113072414008DE5000058E30200000A4580CDE57D
S11307340200A0E314008DE534009DE514109DE54A
S1130744010040E020109DE5010040E018109DE503
S1130754010040E024109DE5010040E01C109DE5EB
S1130764010040E028109DE5018040E03800DDE50B
S1130774040010E30D00001A2000A0E34000CDE5BE
S11307840090A0E3070000EA0130A0E340208DE2DA
S11307940D10A0E10400A0E1BD0300EB000050E350
S11307A46F00001A019089E2080059E1F5FFFFBACD
S11307B414909DE544A08DE20A0000EA0110DAE4F5
S11307C408009DE50FE0A0E114FF2FE108008DE58A
S11307D4000050E36200000A2C009DE5019049E208
S11307E4010080E22C008DE5000059E3F2FFFF1ABA
S11307F420A09DE53090A0E34090CDE500B0A0E3B7
S1130804070000EA0130A0E340208DE20D10A0E1CE
S11308140400A0E19E0300EB000050E35000001A22
S113082401B08BE20A005BE1F5FFFFBA18A09DE575
S11308340CB09DE50A0000EA0110DBE408009DE524
S11308440FE0A0E114FF2FE108008DE5000050E360
S11308544300000A2C009DE501A04AE2010080E265
S11308642C008DE500005AE3F2FFFF1A24A09DE555
S11308744090CDE500B0A0E3070000EA0130A0E316
S113088440208DE20D10A0E10400A0E1800300EB00
S1130894000050E33200001A01B08BE20A005BE16D
S11308A4F5FFFFBA0C009DE518109DE51CA09DE51D
S11308B400B081E00A0000EA0110DBE408009DE5D1
S11308C40FE0A0E114FF2FE108008DE5000050E3E0
S11308D42300000A2C009DE501A04AE2010080E205
S11308E42C008DE500005AE3F2FFFF1A4090CDE599
S11308F428909DE5070000EA0130A0E340208DE242
S11309040D10A0E10400A0E1610300EB000050E33A
S11309141300001A01A08AE209005AE1F5FFFFBAA4
S11309243800DDE5040010E3D7FDFF0A2000A0E34E
S11309344000CDE50090A0E3000000EA019089E2C4
S1130944080059E1D0FDFFAA0130A0E340208DE264
S11309540D10A0E10400A0E14D0300EB000050E3FE
S1130964F5FFFF0A0600E0E184D08DE24F0200EABD
S1130974620050E32200000A680050E31900000AF0
S11309846A0050E30800000A6C0050E32300000AE4
S1130994710050E30400000A740050E31F00000ACD
S11309A47A0050E30900000A1C0000EA000091E503
S11309B4070080E20700C0E3000081E50C00B0E812
S11309C4000081E50200A0E10310A0E11EFF2FE175
S11309D4002091E5002081E5040092E4002081E5F3
S11309E40010A0E31EFF2FE1002091E5002081E523
S11309F4040092E4002081E50008A0E14008A0E19D
S1130A040A0000EA002091E5002081E5040092E454
S1130A14002081E5000CA0E1400CA0E1030000EA01
S1130A24002091E5002081E5040092E4002081E5A2
S1130A34C01FA0E11EFF2FE1F34C2DE90120A0E12A
S1130A440070A0E110A097E56F0052E30860A003D2
S1130A540300000A200081E3780050E30A60A01335
S1130A641060A003030097E83CB0A0E30040A0E1B9
S1130A740150A0E1640052E30100000A690052E35A
S1130A840300001A000051E3010000AA004074E2CC
S1130A940050E5E2000055E30D00001A000054E3A1
S1130AA40B00001A300097E5000050E30800001A18
S1130AB4080056E32D00001A3800D7E5080010E3B7
S1130AC42A00000A3000A0E33BB0A0E33B00CAE5DF
S1130AD4260000EA01104BE200108DE501B0A0E10C
S1130AE40400A0E10510A0E10620A0E1C63FA0E1B6
S1130AF4480300EB300082E2FF1000E23A0051E3C5
S1130B040410DDA50620A0E1C63FA0E1511041A2D6
S1130B14000081A00A00CBE70400A0E10510A0E1D5
S1130B243C0300EB0040A0E10150B0E10100001AD5
S1130B34000054E30300000A0C0097E50A108BE05C
S1130B44010050E1E2FFFF3A080056E30700001AEF
S1130B543800D7E5080010E30400000A0A00DBE7C4
S1130B64300050E301B04B123000A0130A00CB173D
S1130B740A108BE00C1087E5301097E53C006BE21B
S1130B84180087E5010050E1080000AA000041E0D4
S1130B94200087E5B803D7E1EF10A0E3FF1C81E34D
S1130BA4000001E0B803C7E1F34CBDE81EFF2FE1E8
S1130BB4000051E30B00005A3810D7E5141001E289
S1130BC4100051E30700001A341097E5142097E548
S1130BD4021041E0202097E5021041E000B041E01A
S1130BE401005BE320B087A5F34CBDE81EFF2FE1B1
S1130BF4F24F2DE90040A0E138D04DE2030094E81F
S1130C0408208DE2030082E83810DDE510A08DE2AF
S1130C14201081E300108DE5610051E30800000A0F
S1130C24300094E5000050E30600A0430300004AAA
S1130C340300001A670051E30100001A0100A0E355
S1130C44300084E5041094E5FF20A0E3702E82E3D1
S1130C54210A02E0020050E11C00001A0106A0E18E
S1130C642006B0E10C00001A000094E5000050E3F3
S1130C740900001A0300A0E3180084E53800DDE548
S1130C84610040E21A0050E3A71E8F22081081225B
S1130C94A61E8F320C108132080000EA0300A0E380
S1130CA4180084E53800DDE5610040E21A0050E3F1
S1130CB4A41E8F2208108122A31E8F320C108132AD
S1130CC40C0094E50320A0E3070300EB760100EA9B
S1130CD4010050E3120000AA0400A0E1370300EB72
S1130CE4010050E30E0000BA0090A0E30000A0E36A
S1130CF400109DE5610051E31900001A0C1094E5FD
S1130D043020A0E30120C1E4012081E20C2084E529
S1130D143820DDE5610052E37820A0035820A013B5
S1130D240B0000EA041094E57024E0E3FF26C2E318
S1130D34011002E0C025A0E3FE2682E3011082E153
S1130D44041084E5221AA0E1019040E00000E0E3ED
S1130D54E6FFFFEA0020C1E5141094E5021081E2E5
S1130D64141084E5000050E30050A0030060A003C5
S1130D744401000A00009DE5610050E37B00001A71
S1130D84300094E5C00094E8000050E308208DE2AC
S1130D942150A04301508052030092E805B8A0E119
S1130DA44BB8A0E10020A0E30030A0E301808BE273
S1130DB4210300EB0400002A0600A0E1801427E2CA
S1130DC408208DE2030082E8010000EA08008DE2B5
S1130DD4C00080E80070A0E3046049E21070CDE52F
S1130DE411A08DE2000000EA07A080E2010058E3AC
S1130DF4250000BA08208DE2030092E80020A0E355
S1130E040030A0E31A0300EB1F00002A1C10A0E327
S1130E1408008DE2240300EB08208DE2030092E82D
S1130E24078048E2980300EB0090A0E1010058E336
S1130E34070000BAAC0300EB0020A0E10130A0E1FC
S1130E4408C08DE203009CE8BF0300EB08208DE298
S1130E54030082E807008AE20710A0E3020000EA24
S1130E640F2009E2012060E54992A0E1010059E361
S1130E74010000BA011051E2F8FFFF5A011051E2D7
S1130E8401706055FCFFFF5AD6FFFFEA11008DE2A2
S1130E9400104AE00B0051E10150A0B10508A0E1A3
S1130EA411A08DE24008B0E12800004A010050E19D
S1130EB4040000AA10108DE2011080E00110D1E5B5
S1130EC4080051E30F70A0A310108DE2011080E01C
S1130ED4000000EA015045E2012051E4010040E22F
S1130EE4070052E1FAFFFF0A0F0057E30400001A57
S1130EF410108DE2011080E00120D1E5012082E28E
S1130F040120C1E5000050E3015085420508A0E139
S1130F1410A08D42046086424008A0E1010050E222
S1130F240A00004A0A1080E00020D1E5302082E261
S1130F34FF3002E23A0053E33830DDA53A3043A2ED
S1130F44022083A0012041E4010050E2F5FFFF5A8E
S1130F54300094E5000050E3CA00005A0508A0E1FB
S1130F644008A0E1010040E2300084E5C50000EA45
S1130F7408208DE2030092E80020A0E30030A0E3FF
S1130F84AD0200EB0500002A08008DE20C0090E895
S1130F940200A0E1801423E208208DE2030082E829
S1130FA40998A0E19700A0E34998A0E1750C80E3B7
S1130FB4900901E000029FE59120C0E0C066A0E131
S1130FC4A66F86E00658A0E14558A0E1077065E2E3
S1130FD4010057E31A0000BA08008DE2000390E808
S1130FE440B4A0E300A0A0E390B98BE3010017E3AD
S1130FF40600000A0A20A0E10B30A0E10800A0E1E9
S11310040910A0E1CC0300EB0080A0E10190A0E171
S11310140A00A0E10B10A0E10A20A0E10B30A0E13A
S1131024C770A0E1C40300EB00A0A0E101B0A0E1FB
S1131034000057E3ECFFFF1A08008DE2000380E888
S1131044200000EAC095A0E3FF9689E3007067E2FC
S11310540080A0E300A0A0E3D0B989E2100000EA74
S1131064010017E30600000A0A20A0E10B30A0E106
S11310740800A0E10910A0E1AF0300EB0080A0E1A7
S11310840190A0E10A00A0E10B10A0E10A20A0E174
S11310940B30A0E1A80300EBC770A0E100A0A0E11D
S11310A401B0A0E1000057E3ECFFFF1A08208DE231
S11310B4030092E80820A0E10930A0E11C0400EB3D
S11310C408208DE2030082E800009DE5301094E5D9
S11310D4660050E30A0085020600A013017080E054
S11310E4140057E33080A0E31370A0A31080CDE56F
S11310F411508DE2010057E3320000BA08208DE25A
S1131104030092E8D80400EB081085E20420A0E36D
S1131114A8C09FE5012052E29CE083E0A331A0E152
S11311240AE0A0E39E0303E00CE0A0E190EE8CE06F
S1131134033040E0AC01A0E180C09FE5303083E29D
S1131144013041E59CE083E0A331A0E10AE0A0E39F
S11311549E0303E00CE0A0E190EE8CE0033040E059
S1131164303083E2AC01A0E1023061E5E7FFFF1A0D
S1131174087047E2085081E2010057E3DCFFFFBA3C
S113118408208DE2030092E8B70400EBC50400EBE9
S11311940020A0E10130A0E108C08DE203009CE836
S11311A4E90200EB18309FE50020A0E3620300EBA2
S11311B408208DE2030082E8CFFFFFEA89B5F81422
S11311C4CDCCCCCC84D7974111008DE2000045E00E
S11311D411A08DE2020000EA010040E2016046E24F
S11311E401A08AE20010DAE5300051E3F9FFFF0AB6
S11311F400109DE5660051E30618A0014118A00102
S1131204011081020200000A650051E30110A003E9
S11312140010A013302094E5025081E00518A0E1E9
S1131224410850E10050A0B10518A0E14118B0E113
S11312341400004A000051E1020000AA0A00D1E7A8
S1131244350050E33980A0A30A0081E0010040E2A4
S1131254000000EA015045E2012050E4011041E29B
S1131264080052E1FAFFFF0A390058E30A00D107E3
S1131274010080020A00C107000051E301A04A42B0
S113128401508542016086423810DDE50668A0E11C
S11312944668A0E10538A0E100608DE54338A0E18B
S11312A40A20A0E10400A0E1020000EB3CD08DE29E
S11312B4F04FBDE81EFF2FE1F0432DE914D04DE2B9
S11312C4F043DDE10360A0E10190A0E10270A0E13C
S11312D4010056E30160A0B3427E8FB20C7087B262
S11312E40050A0E1308095E5200089E3660050E3D6
S11312F4014084020E00000A670050E36E00001AE5
S1131304040074E3700000BA080054E16E0000AAFB
S11313143800D5E5014084E2080010E30100001A16
S1131324080056E10680A0B10408A0E1408858E012
S11313340080A0430C0095E5181095E50498A0E1FD
S11313444998A0E1010059E3200000AA3030A0E349
S1131354012081E20030C1E7010058E3020000AA41
S11313643810D5E5080011E30200000A2E10A0E3AA
S11313740010C2E7012082E2001069E2010058E192
S1131384004068B20448A0E14448A0E1088084E035
S1131394060058E10860A0B1001064E20668A0E108
S11313A4182085E5183095E5241085E54668A0E104
S11313B41C6085E50620A0E10710A0E1000083E09D
S11313C4490100EB060048E0280085E59C0000EA9A
S11313D40448A0E14448A0E1000081E0040056E18F
S11313E4140000AA0620A0E10710A0E13E0100EBCE
S11313F4181095E5060049E0011086E0181085E50B
S1131404240085E5010058E3020000AA3800D5E56C
S1131414080010E30500000A0C2095E52E00A0E363
S11314240200C1E71C0095E5010080E21C0085E58B
S1131434288085E5820000EA0420A0E10710A0E1E9
S1131444290100EB180095E5046046E0000089E0FA
S1131454010058E3020000AA3810D5E5080011E39E
S11314640300000A0C2095E52E10A0E30210C0E747
S1131474010080E2180085E5183095E50608A0E12E
S1131484400858E10C0095E50860A0B10628A0E1E5
S11314944228A0E1071089E0000083E0120100EB78
S11314A4180095E50668A0E1460880E0180085E583
S11314B4460848E0240085E5610000EA610059E338
S11314C40C00001A7090A0E30C0000EA080056E136
S11314D4020000AA3810D5E5080011E30680A00133
S11314E4018058E20080A043670059E36590A0039B
S11314F44590A013010000EA410059E35090A00371
S11315040130D7E4181095E50C0095E5012081E23B
S11315140030C1E7010058E3030000AA3810D5E500
S1131524080011E3182085051400000A2E10A0E316
S11315340010C2E7013082E2183085E5010058E367
S11315440E0000BA016046E20618A0E1410858E121
S11315540860A0B10628A0E14228A0E10710A0E198
S1131564000083E0E00000EB180095E50668A0E1C4
S1131574460880E0180085E5460848E0240085E52F
S11315840C0095E5181095E50060A0E3001081E0D7
S11315940400B0E12B00A0532D20A0430090C1E52A
S11315A40100C155027081520120C145027081427B
S11315B40040644208808DE2060000EA0A20A0E3A9
S11315C40D00A0E1BB0300EB04009DE5016086E28D
S11315D40100C8E400409DE50418A0E14118A0E11D
S11315E4010051E3F4FFFFAA020056E3030000AA3A
S11315F4200089E3650050E33000A0030100C70420
S1131604000056E30700001A3000A0E30100C7E419
S1131614060000EA016046E208008DE20000D6E715
S1131624300080E20100C7E4010056E3F8FFFFAA9A
S11316340C0095E5181095E5000081E0000047E0F2
S11316441C0085E53800D5E5140000E2100050E3E1
S11316540C00001A140095E5181095E5000081E0CB
S1131664241095E5000081E01C1095E5000081E05C
S1131674281095E5000081E0341095E5010050E15F
S1131684000041B0200085B514D08DE2F043BDE8DC
S11316941EFF2FE1F8402DE90040A0E10150A0E134
S11316A40260A0E10370A0E10000A0E3040000EAEA
S11316B42C0095E5017047E2010080E22C0085E5E9
S11316C40000A0E3000057E30700000A0110D6E479
S11316D4080095E50FE0A0E114FF2FE1080085E57B
S11316E4000050E3F1FFFF1A0000E0E3F240BDE81C
S11316F41EFF2FE1686A6C747A4C00006E616E0000
S11317044E414E00696E6600494E460030000000AA
S11317140020D0E5FF1001E2010052E3020031E1B0
S11317240120F085FBFFFF8A0000A0131EFF2FE1B8
S1131734013080E2001FB0E10300000A0110D0E48C
S1131744000051E3FAFFFF1A0A0000EA002090E5C2
S113175428C09FE50C1052E00210D1E18C0311E182
S11317640420B005FAFFFF0A0110D0E4000051E39D
S11317740110D014FCFFFF1A030050E01EFF2FE1F8
S113178401010101FF1001E2030010E30500000A56
S1131794012052E21C00003A0130D0E4030031E19C
S11317A4F8FFFF1A160000EA082052E20E00003A7D
S11317B4042082E230002DE9011481E1011881E161
S11317C44CC09FE5043090E4042052E2013023200D
S11317D4AC4343200340C4210C001421F8FFFF0A46
S11317E43000BDE8FF1001E2040050E2082092E258
S11317F40130D0E4012052E203003121FBFFFF8ACF
S11318040100A013010050E21EFF2FE10000B0E329
S11318141EFF2FE18080808001C093E10C00001A38
S113182400502DE90210A0E13C0300EB0120A0E1EB
S11318340010A0E30030A0E30050BDE81EFF2FE138
S11318440130A0E10020A0E10010A0E30000A0E327
S11318541EFF2FE1020050E103C0D1E0F7FFFF3A7D
S113186403C092E19603000A30002DE900C0A0E30E
S1131874022092E00330B3E00300002A030051E1A4
S11318840200500101C08C22F8FFFF2A6330B0E14A
S11318946220A0E18054A0E320405CE23544A0210E
S11318A40050A023355CA0310040A033010000EABD
S11318B4A330B0E16220A0E1020050E103C0D1E012
S11318C4020040200C10A0210440B4E00550B5E00F
S11318D4F6FFFF3A0020A0E10130A0E10400A0E1FA
S11318E40510A0E13000BDE81EFF2FE1030011E361
S11318F40400000A012052E20130D1240130C02442
S1131904F9FFFF8A1EFF2FE1030010E31200001AFF
S1131914102052E20500003A30002DE93810B1E8F5
S1131924102052E23810A0E8FBFFFF2A3000BDE883
S1131934823EB0E10810B1280810A0280430914474
S113194404308044822FB0E1B220D1200130D1444C
S1131954B220C0200130C0441EFF2FE1042052E213
S11319641000003A010010E30600001A043091E468
S1131974042052E2B230C0E06338A0E1B230C0E0E7
S1131984F9FFFF2A070000EA043091E4042052E23C
S11319940130C0E46334A0E1B230C0E06338A0E1B4
S11319A40130C0E4F7FFFF2A04208232012052E20E
S11319B40130D1240130C024FBFFFF8A1EFF2FE134
S11319C410402DE9043090E5F0C4E0E3802403E200
S11319D4FFC6CCE303301CE00110A0E3043080E52F
S11319E40A00001A003090E5000053E30700001ACF
S11319F40B0000EA003090E5011041E2A34FA0E19E
S1131A048EE084E104E080E58330A0E1003080E5E9
S1131A1404E090E540091EE3F5FFFF0A0E300CE0F4
S1131A24043080E5043090E5032082E1042080E55D
S1131A341040BDE80100A0E11EFF2FE180C9A0E32E
S1131A4481007CE183007C911EFF2F8101C083E12E
S1131A548CC090E10CC092E10200002A030051E121
S1131A64020050011EFF2FE1010053110000520136
S1131A741EFF2FE180C9A0E381007CE183007C91F7
S1131A841EFF2F8103C081E18CC090E10CC092E160
S1131A940200002A010053E1000052011EFF2FE15D
S1131AA403005111020050011EFF2FE170402DE983
S1131AB40040A0E1040094E5FF60A0E3706E86E3B7
S1131AC4200A06E00150A0E1060050E10900001AD2
S1131AD4040094E50006A0E12006B0E10200001A27
S1131AE4000094E5000050E31400000A7040BDE8CF
S1131AF40200A0E31EFF2FE1000050E30300001ADC
S1131B040400A0E1ADFFFFEB010050E35B0000AA79
S1131B14010055E30C0000BA001046E0010055E151
S1131B240900003A040094E5800410E3F014A013BF
S1131B340000A0E3FF168113061AA001030084E841
S1131B447040BDE80100A0E31EFF2FE1001060E235
S1131B54050051E1041094E5060000AA7024E0E3B2
S1131B64FF26C2E3011002E0050080E0000A81E1DF
S1131B74040084E5380000EA042094E5010040E20E
S1131B840226A0E14039A0E3055080E0222683E147
S1131B94350085E2801401E2042084E5350050E335
S1131BA40020A0E304108425002084250000A02341
S1131BB42A00002A0000A0E31F0075E3040000AA21
S1131BC4043094E5000094E5003084E5205085E277
S1131BD4042084E5003075E20C00000A04E094E576
S1131BE4000050E3000094E50120A01320C063E248
S1131BF4100C82E1002094E51ECCA0E132238CE198
S1131C04002084E5042094E53223A0E1042084E543
S1131C14042094E5600350E3022081E1042084E578
S1131C240400002A800450E30E00001A0000D4E5E6
S1131C34010010E30B00000A000094E5010080E2B7
S1131C44000084E5000094E5000050E30500001A58
S1131C54040094E5010080E2040084E50000E0E36C
S1131C647040BDE81EFF2FE1040094E5010050E13B
S1131C74F9FFFF1A000094E5000050E3F6FFFF1A91
S1131C847040BDE80000A0E31EFF2FE181C0A0E185
S1131C94ACCAA0E140CE4CE201C09CE20C00004A74
S1131CA41FC07CE20C00004A8110B0E10115A0E1E0
S1131CB4801481E3A00A81E1300CA0E1000010E16A
S1131CC48004A043000060221EFF2F210100404233
S1131CD41EFF2FE10000A0E31EFF2FE1800411E3A7
S1131CE48004E0538004A0431EFF2FE10010B0E100
S1131CF41EFF2F0100006042C214A0434214A053EB
S1131D04400B50E30008A03140174132400750E330
S1131D140004A03180184132400550E30002A03190
S1131D2440184132400450E30001A031801941328B
S1131D34800450E38000A03140194132C01941E2CB
S1131D44A01581E0800AA0E11EFF2FE150002DE9D7
S1131D5403C031E0803423425A02004A024050E076
S1131D640360D1E00400002A806426E2040050E009
S1131D740610D1E0042092E00630B3E080C9A0E369
S1131D8481007CE18340DC308044A0E35500002AD8
S1131D9421CAA0E1236A4CE0360056E34F0000CA8E
S1131DA4010056E3280000CA0CCAA0E1833584E18B
S1131DB4A23A83E18225A0110225A001A330A00147
S1131DC4811584E1A01A81E1800572E00310D1E059
S1131DD41600004A0010A0010000A0030060A01334
S1131DE42060A003010011013C00000A0300004A22
S1131DF4016086E2000090E00110B1E0FBFFFF5AAD
S1131E04ECCFA0E186CA5CE00160DCE3ECC0A0E1B5
S1131E140600008A806976E2A66AA0E180C40CE226
S1131E243006A0E1710620E03116A0E1010020E0B3
S1131E34A005B0E1810A80E18014C1E3A040B0218F
S1131E440000B0E2A115ACE0240000EA833584E18B
S1131E54A335A0E1811584E1A115A0E1200056E396
S1131E64080000DA206056E20220B0117346A0E1B3
S1131E74334624E001408413004074E23306D0E086
S1131E840010C1E2080000EA7246A0E13226A0E193
S1131E94024024E0732622E03336A0E1032022E04A
S1131EA4004074E20200D0E00310C1E0400911E3F1
S1131EB40500001A01C04CE28C2AB0E10200000AB9
S1131EC48440B0E10000B0E00110A1E04019C1E396
S1131ED4A030B0E18034D4E20000B0E20C1AA1E0F6
S1131EE45000BDE81EFF2FE181007CE10F00002AB1
S1131EF48034C3E3836092E10900000A8CC0A0E14A
S1131F0481005CE10400008A21CAA0E101604CE282
S1131F14340056E3CEFFFFDAF0FFFFEA020050E09C
S1131F240310D1E0816090E10010A003EBFFFFEA0D
S1131F3483007C010010E023E8FFFFEAB0402DE9B0
S1131F44037021E0807407E2FF40A0E3704E84E351
S1131F5421CA14E0235A141004003C11040035115E
S1131F642500000A05C08CE0843AC3E1403983E3C8
S1131F748115A0E1801481E3A05A81E180E5A0E108
S1131F840210A0E19E0282E0000050E30000A0E3FE
S1131F949521A0E00010A0E3932EA1E00120821378
S1131FA4010090E00010A0E30110A1E09305A1E07A
S1131FB440CE4CE20156B0E10200002A8220B0E196
S1131FC40000B0E00110B1E001C0BCE23E0000DA60
S1131FD4A050B0E18024D2E20000B0E20C1AB1E0D7
S1131FE4401941E2071081E10C00005A041A8741A8
S1131FF40000A043B040BDE81EFF2FE1235A04E0D3
S113200404003CE1040035112300000A81E090E15E
S113201483E092110300001A0710A0E10000A0E37A
S1132024B040BDE81EFF2FE10C001CE105C08CE0AC
S11320341200001A050015E1F6FFFF0A0116B0E1CB
S11320440010A0010000A00314504502201A91E1DD
S11320540006A0E105C0A0E10300004A01C04CE26F
S11320648000B0E10110B1E0FBFFFF5A00E0A0E101
S11320740150A0E1843AC3E1403983E3BFFFFFEA9E
S113208401C04CE28220B0E10330A3E0400913E331
S1132094FAFFFF0A01C08CE2B4FFFFEA81E090E199
S11320A483E092110010E0038059A0E3830075E1FA
S11320B40310A08181007591D8FFFF8A041A87E177
S11320C40000A0E3B040BDE81EFF2FE101C07CE2A4
S11320D420505CE2080000AA20506CE2020012E1E5
S11320E4A220A0E101208213102592E1300CA0E18A
S11320F4110580E1311CA0E1080000EA35005CE32D
S1132104C4FFFFCA20C065E2802092E13025A0E12B
S1132114012082133105A0E1112C92E10010A0E307
S11321248024D2E20000B0E20710B1E0B040BDE880
S11321341EFF2FE1F0002DE9037021E0807407E213
S1132144FF40A0E3704E84E321CA14E0235A141020
S113215404003C1104003511A700000A05C04CE03A
S113216401C04CE2C064E0E3014506E0204B84E195
S11321740005A0E1033506E0223B83E10225B0E13A
S11321840210A0E31F00000A026050E00340D4E000
S1132194403483E30400002A01C04CE28660B0E1C9
S11321A40440A4E0026096E00340B4E08660B0E139
S11321B40440A4E0020056E10350D4E00260462047
S11321C40540A0210110B1E0F7FFFF3A800EA0E31F
S11321D48660B0E10440A4E0020056E10350D4E078
S11321E4026046200540A0210000B0E0F7FFFF3A5A
S11321F48660B0E10440A4E0026056E00350D4E0F9
S113220406001601300000EA034054E0403483E33E
S11322140200002A01C04CE28000B0E18440A3E043
S1132224003063E2000010E11100000A401E81E363
S1132234000090E08440B3E0034044300110A1E086
S1132244000090E08440B3E0034044300110A1E076
S1132254000090E08440B3E0034044300110A1E066
S1132264000090E08440B3E0034044300110B1E046
S1132274F2FFFF3A844093E0034044300110A1E0AC
S1132284844093E0034044300110A1E0844093E08F
S1132294034044300110B1E0F8FFFF3A800EA0E39C
S11322A4844093E0034044300000A0E0844093E081
S11322B4034044300000A0E0844093E003404430F1
S11322C40000B0E0F5FFFF3A844093E08044A0238B
S11322D40040A03340448413810A80E1A115A0E1A5
S11322E440CE9CE20D0000DAA020B0E18024D4E2C8
S11322F40000B0E20C1AB1E0400971E3071081E177
S11323040100004AF000BDE81EFF2FE1FF1687E339
S1132314701481E30000A0E3F000BDE81EFF2FE188
S1132324401981E301C07CE220505CE2080000AA69
S113233420506CE2040014E1A440A0E101408413A1
S1132344104594E1300CA0E1110580E1311CA0E1B9
S1132354080000EA34005CE30B0000CA20C065E214
S1132364804094E13045A0E1014084133105A0E1AB
S1132374114C94E10010A0E38044D4E20000B0E2E4
S11323840710B1E0F000BDE81EFF2FE10000A0E358
S11323940710A0E1F000BDE81EFF2FE10C001CE1D2
S11323A40700001A050015E10C00001A01C04CE2F4
S11323B48000B0E10110A1E0400911E3FAFFFF0A33
S11323C401C08CE201C08CE28220B0E10330A3E0BE
S11323D4400913E3FAFFFF0A02C04CE260FFFFEA7C
S11323E4015085E28000B0E10110A1E0400911E34D
S11323F4FAFFFF0A00C065E259FFFFEA235A04E02A
S113240404003CE1040035110B00000A816090E1F2
S113241483609211E0FFFF1A816090E10000A0E361
S11324240710A0E1041A8111F000BDE81EFF2F116A
S113243483C092E10010E0031EFF2FE18069A0E352
S11324440000A0E3810076E18300769181007601A7
S11324540010E0230200002A830076E10710A001A3
S1132464041A8711F000BDE81EFF2FE181C0B0E11A
S11324740A00002AACCAA0E140CE4CE201C09CE2AE
S11324840600004A1FC07CE28115A0E1801481E3A8
S1132494A00A81E1300CA0510000E0431EFF2FE1AB
S11324A40000A0E31EFF2FE10010B0E14214A013CA
S11324B412FEFF1A1EFF2FE1F0412DE90060A0E196
S11324C40170A0E10280A0E10700A0E10810A0E1EE
S11324D4060000EB900801E00040A0E1010047E0A1
S11324E40050A0E1300086E8F041BDE81EFF2FE172
S11324F4802411E200106142402032E00700000A07
S113250404402DE900006022040000EB8220B0E1C5
S113251400106142000060220440BDE81EFF2FE168
S1132524010050E1020051231800003A0030A0E3F6
S1132534200851E10118A09110308392200451E144
S11325440114A09108308392200251E10112A09158
S113255404308392200151E10111A091023083924D
S1132564A00051E18110A09101308392010050E058
S1132574A110A0E1001061E20130D3E24A0000DAC4
S1132584010090E00100403020C063E28CF18FE050
S1132594010011E19700000A010050E10010A0318C
S11325A40000A0330010A0231EFF2FE18000B1E03F
S11325B4010040308000B1E0010040308000B1E00F
S11325C4010040308000B1E0010040308000B1E0FF
S11325D4010040308000B1E0010040308000B1E0EF
S11325E4010040308000B1E0010040308000B1E0DF
S11325F4010040308000B1E0010040308000B1E0CF
S1132604010040308000B1E0010040308000B1E0BE
S1132614010040308000B1E0010040308000B1E0AE
S1132624010040308000B1E0010040308000B1E09E
S1132634010040308000B1E0010040308000B1E08E
S1132644010040308000B1E0010040308000B1E07E
S1132654010040308000B1E0010040308000B1E06E
S1132664010040308000B1E0010040308000B1E05E
S1132674010040308000B1E0010040308000B1E04E
S1132684010040308000B1E0010040308000B1E03E
S1132694010040303013A0E1110320E00000A0E069
S11326A402C0A0E31C0380E11EFF2FE1013093E28A
S11326B401009030010040300010A0E10300A3E0C9
S11326C41EFF2FE11EFF2FE1024050E00360D1E022
S11326D40300002A040050E00610D1E0042092E034
S11326E40630B3E080C9A0E381007CE18340DC30A0
S11326F48044A0E32B00002A21CAA0E1236A4CE011
S1132704350056E3370000CA833584E1A335A0E1DC
S1132714811584E1C115A0E1200056E3080000DA24
S1132724206056E20220B0117346A0E1334624E04F
S113273401408413330690E00010B1E20800002A3B
S11327440B0000EA7246A0E13226A0E1024024E034
S1132754732622E0332622E0020090E03316B1E02F
S11327640300003AA110B0E16000B0E16440B0E1BC
S113277401408423401981E2A020B0E18024D4E202
S11327840000B0E20C1AA1E05000BDE880C9A0E347
S113279481007CE11EFF2F310000A0E3211AA0E197
S11327A4011AA0E11EFF2FE181007CE10F00002A41
S11327B4836092E10B00000A81005CE10600008A58
S11327C421CAA0E10430C3E101604CE2340056E3C1
S11327D4CEFFFFDA5000BDE81EFF2FE18034C3E3CF
S11327E4020090E00310B1E05000BDE81EFF2FE1A9
S11327F45000BDE81EFF2FE11EFF2FE170432DE9B9
S113280410D04DE20090A0E10140A0E10250A0E10B
S1132814F86C9FE53800D6E5000050E3F00C9F0502
S1132824F00C9F15098280E0EC0C9FE5000090E514
S113283400008DE5300096E5000050E31E00000A18
S11328440100A0E35A0300EB0A0059E31200001A42
S1132854020055E32E00003AA550A0E10000D4E59F
S11328640110D4E5010480E1024084E2041096E5F9
S1132874801481E3002096E5000052E31400001A5A
S1132884FF20A0E3202202E0F03CA0E3000603E0E2
S1132894020080E1010080E1170000EA0000A0E3E7
S11328A4300086E5040096E5800410E30000000A85
S11328B4B00300EB0000A0E33D0300EB0000E0E301
S11328C4001098E5000051E11400001A0200A0E38E
S11328D4A40000EAFF28A0E3002802E0011082E13A
S11328E4F00E00E2010080E1040086E50310A0E399
S11328F4040086E2AC0300EB0000A0E3040086E5D8
S1132904000096E5010020E2000086E5015055E24E
S1132914D1FFFF1A0000A0E3250300EB900000EAB6
S11329243810D6E5000051E33500001A1B0059E3C2
S11329340200000A1D0059E30900000A570000EAD6
S11329440020A0E30410A0E12E00A0E3AAFFFFEB03
S11329540020A0E30010A0E32F00A0E3A6FFFFEBF8
S11329647F0000EA0000DDE57F0000E20010D4E50A
S1132974810380E10000CDE50000DDE5BF0000E255
S11329840010D4E54020A0E3811202E0000081E1BC
S11329940000CDE5DF0000E20010D4E52020A0E330
S11329A4811102E0000081E10000CDE5EF0000E2C6
S11329B40010D4E51020A0E3811002E0000081E1BE
S11329C40000CDE5F70000E20110D4E5011021E296
S11329D4011001E2810180E10000CDE50020A0E3C3
S11329E40D10A0E13000A0E383FFFFEB0300A0E39C
S11329F40800CDE50020A0E308108DE23100A0E337
S1132A04240000EA1C0059E30700000A1D0059E3EE
S1132A140C00000A1E0059E31700000A280059E3B9
S1132A240110D405341086051C0000EA0000A0E35C
S1132A340300C4E50020A0E30410A0E12500A0E302
S1132A446DFFFFEB460000EA0010D4E5F71001E245
S1132A540010C4E5FD2001E2021021E2021001E2AB
S1132A64021081E10010C4E50210D4E5F81001E27B
S1132A74021081E30210C4E5080000EA0000D4E572
S1132A84341096E5010480E104008DE50020A0E300
S1132A9404108DE22800A0E357FFFFEB310000EAA5
S1132AA40C1098E5000051E10150A0110100A0E3CD
S1132AB4BF0200EB000098E52E0300EB0A0059E383
S1132AC40900001A0000A0E3000086E5040086E57E
S1132AD40100A0E3300086E50520A0E10410A0E194
S1132AE40A00A0E344FFFFEB1E0000EA0400D8E55B
S1132AF4010050E30B00001A080098E5000050E3BD
S1132B040600000A000055E30400000AFF00A0E3E5
S1132B14FF0C80E3170300EB0100C4E4015045E219
S1132B240800A0E3A90200EB0400D8E5010050E387
S1132B340510A0E10400A0E10100001A350300EB34
S1132B44000000EA180300EB0000A0E3980200EB85
S1132B540400D8E5010050E30100001A0900A0E3D1
S1132B649A0200EB0000A0E310D08DE27043BDE8AC
S1132B741EFF2FE130402DE90CD04DE20040A0E1CE
S1132B840910A0E3F40AA0E3900F80E39E0200EB93
S1132B94750200EB0000A0E3650200EB5000A0E323
S1132BA4010000EA04009DE5010040E204008DE513
S1132BB404009DE5000050E3F9FFFF1A0100A0E3BF
S1132BC45B0200EB3200A0E32E0300EB3C599FE5CB
S1132BD40000A0E33800C5E50020A0E30D10A0E147
S1132BE42D00A0E304FFFFEB00009DE5FF10A0E32C
S1132BF4FF1881E3000001E04510A0E3C01B81E35A
S1132C04010050E10100A0133800C5150200001AA8
S1132C143800D5E5010050E31000001A4009A0E390
S1132C24480B80E300008DE50020A0E30D10A0E133
S1132C342600A0E3F0FEFFEB0020A0E30010A0E3D5
S1132C441F00A0E3ECFEFFEB2000A0E300008DE5F1
S1132C540020A0E30D10A0E12800A0E3040000EA92
S1132C643000A0E300008DE50020A0E30D10A0E1F6
S1132C741E00A0E3E0FEFFEB0020A0E30010A0E3AD
S1132C840200A0E3DCFEFFEB3800D5E5000050E3CE
S1132C940300001A0020A0E30010A0E33500A0E321
S1132CA4D5FEFFEB0020A0E30010A0E30500A0E3A1
S1132CB4D1FEFFEB0020A0E30010A0E30D00A0E38D
S1132CC4CDFEFFEB0000A0E300008DE50000DDE590
S1132CD4F20000E2020080E30000CDE50020A0E35E
S1132CE40D10A0E11D00A0E3C3FEFFEB830CA0E3E1
S1132CF400008DE50020A0E30D10A0E10900A0E38D
S1132D04BDFEFFEB0020A0E30D10A0E10800A0E34A
S1132D14B9FEFFEB000054E30D00001AFF0EA0E31C
S1132D2400008DE51040A0E3444C84E30220A0E3BA
S1132D340D10A0E10A00A0E3AFFEFFEB014054E252
S1132D44F9FFFF1A0020A0E30010A0E30000A0E3B1
S1132D54030000EA2020A0E3882C82E30410A0E10D
S1132D640A00A0E3A4FEFFEB3800D5E5010050E31C
S1132D740500001A1F00A0E300008DE50020A0E375
S1132D840D10A0E12700A0E39BFEFFEB4B0EA0E394
S1132D94BC0200EB0020A0E30010A0E30700A0E3C2
S1132DA495FEFFEB0000A0E30CD08DE23040BDE8BB
S1132DB41EFF2FE154379FE5080083E50C1083E5DB
S1132DC4102083E51EFF2FE1F8402DE90040A0E127
S1132DD40150A0E10260A0E10370A0E1840056E385
S1132DE40500003A9E20A0E3802F82E32C179FE580
S1132DF42C079FE5B40200EB0000A0E1840057E334
S1132E040500003A9F20A0E3802F82E30C179FE57E
S1132E1410079FE5AC0200EB0000A0E1060054E1BA
S1132E240400003AA82FA0E3F0169FE5F8069FE5F6
S1132E34A50200EB0000A0E1070055E10500003AFB
S1132E44A120A0E3802F82E3D0169FE5DC069FE552
S1132E549D0200EB0000A0E1B0069FE51C4080E564
S1132E64205080E5246080E5287080E5F140BDE8C9
S1132E741EFF2FE194269FE5140082E5181082E5D5
S1132E841EFF2FE1F04F2DE980769FE508C097E5FA
S1132E9424E09DE500409CE500408EE528409DE546
S1132EA404509CE5005084E5145097E51C6097E5B4
S1132EB400909CE5996528E0008080E5240097E56E
S1132EC4080050E10700003A188097E5209097E540
S1132ED404B09CE59B982AE000A082E5282097E5AD
S1132EE40A0052E10200002A0000A0E3F04FBDE80A
S1132EF41EFF2FE1015085E200709CE5976525E0F3
S1132F04015045E2005081E5050050E10400002A27
S1132F1400609EE5055046E0055080E000508EE5D3
S1132F24000081E5010088E204109CE5919020E012
S1132F34010040E2000083E5000052E10400002A9D
S1132F44001094E5000041E0000082E0000084E504
S1132F54002083E50100A0E3F04FBDE81EFF2FE14C
S1132F64F04F2DE92CD04DE20040A0E19C559FE5A3
S1132F74080095E5000050E30000E0036001000A46
S1132F84001090E5070011E30120A0130020A00322
S1132F94A17182E0071044E2060051E30B01008AA8
S1132FA48110A0E1B1209FE102F18FE050013600CD
S1132FB4660003000801DF000A000000180095E51C
S1132FC4010080E2180085E5480100EA140095E553
S1132FD4010080E2140085E50060A0E30C008DE2AA
S1132FE404008DE508008DE200008DE510308DE2CB
S1132FF414208DE218108DE21C008DE2A0FFFFEB7B
S1133004000050E3EF00000A1C009DE518109DE544
S1133014010480E100008DE50020A0E30D10A0E18F
S11330240800A0E3F4FDFFEB14009DE510109DE5FA
S1133034010480E100008DE50020A0E30D10A0E16F
S11330440900A0E3ECFDFFEB0070A0E3080000EA34
S11330540220A0E3101085E20A00A0E3E6FDFFEBE2
S1133064018088E208009DE5000058E1F7FFFF3A7B
S1133074017087E20C009DE5000057E1D2FFFF2AAE
S11330840080A0E3F6FFFFEA140095E5000050E396
S11330941601000A010040E2140085E50C008DE2EB
S11330A404008DE508008DE200008DE510308DE20A
S11330B414208DE218108DE21C008DE270FFFFEBEA
S11330C4000050E30901000A1C009DE518109DE569
S11330D4010480E100008DE50020A0E30D10A0E1CF
S11330E40800A0E3C4FDFFEB14009DE510109DE56A
S11330F4010480E100008DE50020A0E30D10A0E1AF
S11331040900A0E3BCFDFFEB0070A0E3080000EAA3
S11331140220A0E3101085E20A00A0E3B6FDFFEB51
S1133124018088E208009DE5000058E1F7FFFF3ABA
S1133134017087E20C009DE5000057E1EB00002AD2
S11331440080A0E3F6FFFFEA2C6095E5140095E502
S11331540610A0E1F1FCFFEB010046E028008DE538
S11331640060A0E320608DE5A4739FE5050000EAF8
S1133174140095E5010080E2140085E520009DE536
S1133184010080E220008DE520009DE528109DE5E6
S1133194010050E1D500002A1C009DE518109DE5AE
S11331A4010480E100008DE50020A0E30D10A0E1FE
S11331B40800A0E390FDFFEB14009DE510109DE5CD
S11331C4010480E100008DE50020A0E30D10A0E1DE
S11331D40900A0E388FDFFEB0C008DE204008DE5FB
S11331E408008DE200008DE510308DE214208DE29C
S11331F418108DE21C008DE221FFFFEB000050E368
S1133204BA00000A0080A0E3000000EA018088E21A
S11332140C009DE5000058E1D4FFFF2A0090A0E3D0
S1133224130000EA0600E0E100109AE5000051E111
S11332340E00000A0C109AE5000051E101B0A0113F
S11332440100A0E3DA0000EB00009AE5490100EB79
S1133254006085E5046085E50100A0E3300085E5B0
S11332640B20A0E1101085E20A00A0E362FDFFEB4D
S1133274019089E208009DE5000059E1E2FFFF2A7C
S113328402B0A0E33800D5E5000050E30700A00134
S113329480029F15A0A080E2300095E5000050E371
S11332A4DFFFFF0A0100A0E3C10000EB1000D5E535
S11332B41110D5E5011480E1040095E5800480E350
S11332C4002095E5000052E30600001AFF20A0E365
S11332D4212202E0F03CA0E3011603E0021081E1A4
S11332E4000081E1090000EAFF28A0E3012802E0CC
S11332F4000082E1F01E01E2000081E1040085E5A2
S11333040310A0E3040085E2270100EB0000A0E31E
S1133314040085E5000095E5010020E2000085E550
S11333240000A0E3A20000EBD0FFFFEA1C0095E537
S1133334241095E5002041E008208DE5282095E53A
S1133344203095E5032042E00C208DE5010480E162
S113335400008DE50020A0E30D10A0E10800A0E327
S113336425FDFFEB200095E5281095E5010480E197
S113337400008DE50020A0E30D10A0E10900A0E306
S11333841DFDFFEB0060A0E30070A0E3080000EA69
S11333940220A0E3101085E20A00A0E316FDFFEB6F
S11333A4018088E208009DE5080050E1F7FFFF2A48
S11333B4017087E20C009DE5070050E10080A02322
S11333C4F7FFFF2A186085E5146085E5470000EAE5
S11333D4081090E5010054E10300002A0C2090E554
S11333E4020054E10040A0230000002A014044E00C
S11333F4101090E5040090E5900702E0941228E090
S11334040C008DE204008DE508008DE200008DE5DA
S113341410308DE214208DE218108DE21C008DE230
S113342497FEFFEB000050E32D00000A1C009DE50D
S113343418109DE5010480E100008DE50020A0E35F
S11334440D10A0E10800A0E3EBFCFFEB14009DE5E4
S113345410109DE5010480E100008DE50020A0E347
S11334640D10A0E10900A0E3E3FCFFEB0090A0E34E
S1133474010000EA08808AE0019089E20C009DE5DD
S1133484000059E11600002A07A0A0E100B0A0E35F
S1133494090000EA24008DE50220A0E324108DE253
S11334A40A00A0E3D4FCFFEB07000BE2070050E39F
S11334B40180880201A04A0201B08BE208009DE564
S11334C400005BE1EAFFFF2A0000D8E507100BE2E5
S11334D40120A0E3300112E10C00951510009505BC
S11334E4EBFFFFEA140095E5010080E2140085E592
S11334F40020A0E30010A0E30000A0E3BEFCFFEB67
S11335040400A0E12CD08DE2F04FBDE81EFF2FE1B2
S113351440000040F050000050540000B057000038
S11335245850000038500000B0500000CC50000047
S1133534E05000007C12E0E3FE1DC1E38027A0E319
S1133544000050E300208115042081051EFF2FE1B3
S11335547C12E0E3FF1DC1E34026A0E3000050E336
S113356404208105002081151EFF2FE17F01E0E383
S1133574FF0DC0E3401090E5801781E3401080E51F
S11335848017A0E35C1080E5CE12A0E3B01B81E3B6
S1133594002091E5C029C2E3002081E5001090E5F4
S11335A4401681E3001080E54016A0E3181080E57E
S11335B41EFF2FE17C12E0E3FF1DC1E38029A0E399
S11335C4000050E304208115002081051EFF2FE133
S11335D4041040E20D0051E30100003A0000A0E3AE
S11335E41EFF2FE1E014A0E3681A81E3002091E5B3
S11335F42222A0E1010040E20F0000E2020280E185
S1133604000081E50100A0E31EFF2FE170402DE9D5
S113361408D04DE20050A0E10140A0E1CE02A0E3B5
S1133624B00B80E3001090E5C01F81E3001080E537
S1133634001090E5C01C81E3001080E5001090E5C3
S1133644C01B81E3001080E57F01E0E3FF0DC0E3CC
S1133654001090E5801981E3001080E58019A0E34F
S1133664181080E508019FE5001090E5801981E3B6
S1133674001080E5E064A0E3686A86E3040096E54C
S11336840200C0E3040086E5040096E50100C0E3FB
S1133694040086E5040096E50400C0E3040086E51E
S11336A4000096E53000C0E3000086E5000096E5DE
S11336B44000C0E3000086E5000096E58000C0E316
S11336C4000086E50000A0E3140086E5240086E5F6
S11336D4040096E5020080E3040086E5080096E50C
S11336E400008DE5080096E500008DE5080096E5E8
S11336F400008DE5080096E500008DE5080096E5D8
S113370400008DE5080096E500008DE5080096E5C7
S113371400008DE5080096E500008DE52A00A0E38D
S1133724B50000EB0210A0E38530A0E1000053E1F2
S11337340300002A021081E2853083E0FE0051E395
S1133744F9FFFF1A101086E5040044E20D0050E36B
S11337540500002A000096E52002A0E1011044E2DD
S11337640F1001E2000281E1000086E57340BDE828
S11337741EFF2FE1C4C01FE08E12A0E3681A81E388
S11337840130A0E3042091E5A20013E1FCFFFF0A49
S1133794000081E50120A0E3040091E5200212E188
S11337A4FCFFFF1A000091E51EFF2FE104D04DE257
S11337B48E22A0E3682A82E301C0A0E3000051E35F
S11337C40400001A080000EA0130D0E4403F83E317
S11337D4003082E5011041E2043092E5A3001CE1CB
S11337E4F5FFFF0A000051E3F6FFFF1A040092E517
S11337F40110A0E3200211E1FBFFFF1A040092E58B
S1133804200111E10000921500008D15FAFFFF1A42
S113381404D08DE21EFF2FE110402DE90020A0E327
S11338248E32A0E3683A83E3FFC0A0E3FFCC8CE3C9
S11338340140A0E301E092E10400001A1040BDE855
S11338441EFF2FE100C083E5011041E2012082E262
S113385404E093E5AE0014E10300000A080052E317
S11338640100002A000051E3F5FFFF1A04E093E588
S11338742E0114E100E0931501E0C014012042126A
S1133884F9FFFF1AEAFFFFEA08D04DE2070000EA55
S113389400009DE5010040E200008DE500009DE587
S11338A4000050E3F9FFFF1A04009DE5010040E223
S11338B404008DE504009DE5000050E3730FA0139C
S11338C4F4FFFF1A08D08DE21EFF2FE100402DE91A
S11338D40CD04DE200108DE504208DE508008DE543
S11338E41010A0E30D20A0E1841B81E31800A0E3E1
S11338F4563412EF000050E30000001AF70000EB06
S11339040CD08DE20040BDE81EFF2FE184029FE548
S1133914201190E51010C1E3201180E5201190E5F9
S1133924201081E3201180E5001090E50210C1E32A
S1133934001080E5AA10A0E30C1080E55520A0E354
S11339440C2080E5003090E50130C3E3003080E5CD
S11339540C1080E50C2080E501C0A0E3203190E543
S113396423031CE1FCFFFF0A8C3090E50330C3E31E
S1133974013083E38C3080E5043090E5A337A0E183
S113398413C0A0E383378CE1043080E5043090E570
S1133994FF38C3E3043080E50C1080E50C2080E597
S11339A4003090E5013083E3003080E50C1080E5BD
S11339B40C2080E50930A0E3883080E50730A0E3DB
S11339C4843080E501C0A0E3083090E5230D1CE1B8
S11339D4FCFFFF0A003090E5023083E3003080E509
S11339E40C1080E50C2080E55414A0E3281180E534
S11339F40010A0E32C1180E51EFF2FE130402DE9D7
S1133A0494119FE5200050E3484F8132494F8122AD
S1133A141F5000E20100A0E30120A0E3003091E57F
S1133A24A30C10E10600000A000091E58008A0E15F
S1133A34A00882E0002091E5FF30A0E3222803E0FF
S1133A44012082E2843091E5033013E20800000A85
S1133A54020053E30100000A0200003A070000EAEE
S1133A64803CA0E3060000EAB738A0E36C3D83E39E
S1133A74030000EAF439A0E3903E83E3000000EA83
S1133A840030A0E3900303E08300A0E17C1091E5FF
S1133A94013081E2930201E0A0FAFFEB001094E507
S1133AA40320A0E3311512E00300000A020051E3ED
S1133AB40400000A1200003A050000EA2001A0E113
S1133AC43040BDE81EFF2FE1A000A0E13040BDE876
S1133AD41EFF2FE11A0055E30300000A1C0055E3FE
S1133AE40100000A1E0055E30400001AAC209FE5FF
S1133AF4902281E02101A0E13040BDE81EFF2FE1C6
S1133B04A001A0E13040BDE81EFF2FE18E02A0E336
S1133B14A00B80E30010A0E3001080E5101080E502
S1133B24FF05A0E3FF0980E3001080E5201080E591
S1133B34401080E5601080E5801080E560209FE5FA
S1133B44003092E5013083E3003082E5101080E513
S1133B54301080E5501080E5701080E5901080E509
S1133B64E004A0E3B00B80E3001080E5041080E5DA
S1133B74081080E50C1080E5101080E5141080E531
S1133B84181080E51C1080E5201080E5241080E5E1
S1133B94281080E51EFF2FE180C01FE088C01FE0CD
S1133BA4ABAAAAAAA0C11FE0FEFFFFEA04E04EE20A
S1133BB41F502DE904D04DE2FF40E0E3000094E5FA
S1133BC4000050E30300000A000094E50FE0A0E1C4
S1133BD410FF2FE10000A0E3000084E504D08DE28F
S1133BE41F90FDE8F300E0E3F00EC0E30010A0E34F
S1133BF4001080E50120E0E1082080E5102080E544
S1133C04141080E5F41E80E57D2F80E2F40080E248
S1133C140830A0E3041080E4041082E4041080E477
S1133C24041082E4041080E4041082E4041080E4A8
S1133C34041082E4013053E2F5FFFF1A1EFF2FE162
S1133C440231A0E1000F03E50201A0E1001E00E53A
S1133C540100A0E31002A0E1F310E0E3F01EC1E3CD
S1133C64002091E50020C2E1002081E5042091E5D3
S1133C74020080E1040081E51EFF2FE100502DE9DC
S1133C84E004A0E37F0980E3001090E50310C1E39E
S1133C94001080E5041090E50710C1E3031081E3EC
S1133CA4041080E5001090E50310C1E3021081E3E1
S1133CB4001080E514FFFFEB93FFFFEBC8FFFFEB5D
S1133CC4080000EB190000EB300000EBAC0000EB43
S1133CD4C70000EBC80000EB0140BDE8DE0000EAC9
S1133CE40100A0E3990100EAFF05A0E3FF0980E3D2
S1133CF4001090E5801D81E3001080E5001090E53C
S1133D04401C81E3001080E5001090E5801981E3F4
S1133D14001080E5801DA0E3181080E5401CA0E39A
S1133D24181080E58019A0E3181080E51EFF2FE128
S1133D34FF05A0E3FF0980E3001090E58015C1E3CB
S1133D44001080E5001090E5401AC1E3001080E5FE
S1133D54201090E58016C1E3201080E5201090E542
S1133D644018C1E3201080E5201090E5401AC1E317
S1133D74201080E5201090E5801AC1E3201080E52E
S1133D84201090E58017C1E3201080E51EFF2FE189
S1133D94E004A0E3D00B80E30010A0E30C1080E562
S1133DA424109FE5002091E5402D82E3002081E565
S1133DB4E42091E5402782E3E42081E58019A0E32F
S1133DC4D01E81E3001080E51EFF2FE1C4C01FE074
S1133DD410402DE90040B0E11000000A010050E356
S1133DE40800000A050050E30600000A060050E338
S1133DF40400000A5A20A0E34D1F8FE2DC008FE286
S1133E04B1FEFFEB0000A0E1060054E31D00008AAC
S1133E140400DFE700F18FE001071B1B1B0F1600F2
S1133E24E004A0E3B00B80E3041090E5C01CC1E3FC
S1133E34401C81E3040000EAE004A0E3B00B80E347
S1133E44041090E5C01BC1E3401B81E3041080E52A
S1133E541040BDE81EFF2FE1E004A0E3B00B80E3B3
S1133E640C1090E5C01481E30C1080E51040BDE80B
S1133E741EFF2FE1E004A0E3B00B80E3001090E503
S1133E84C01781E3001080E51040BDE81EFF2FE158
S1133E94E014A0E3D01B81E3002091E5FF20C2E3FA
S1133EA4002081E5002091E50130A0E3132082E1A4
S1133EB4002081E5002091E5402782E3002081E58C
S1133EC4102081E3000192E7002091E57026C2E30B
S1133ED4002081E50008A0E1200BA0E11EFF2FE1F2
S1133EE4286368616E6E656C203D3D2041494E3007
S1133EF429207C7C20286368616E6E656C203D3DBE
S1133F042041494E3129207C7C20286368616E6EEF
S1133F14656C203D3D2041494E3529207C7C202878
S1133F246368616E6E656C203D3D2041494E3629BF
S1133F3400000000433A5C55736572735C737475D6
S1133F4464656E745C446F63756D656E74735C63F1
S1133F546D303630352D7265616C2D74696D652D47
S1133F647363686564756C696E675C776F726B7391
S1133F74706163655C6273705C7372635C616463D7
S1133F842E63000010402DE90100A0E38FFFFFEB36
S1133F940000A0E38DFFFFEB0600A0E38BFFFFEB23
S1133FA448409FE50100A0E3B8FFFFEB000084E56F
S1133FB40000A0E3B5FFFFEB040084E50600A0E3E2
S1133FC4B2FFFFEB080084E5001094E50C0084E2E2
S1133FD4E60000EB041094E59C0084E2E30000EBAB
S1133FE4081094E54B0F84E21040BDE8DF0000EABA
S1133FF4A80000400500A0E374FFFFEA00502DE987
S11340040000A0E3DAFAFFEB0100A0E34FFDFFEBAD
S11340148800A0E34C0D80E31AFEFFEBFF20A0E32D
S1134024F02E82E30010A0E324009FE560FBFFEB85
S11340348330A0E38320A0E30010A0E30000A0E306
S113404460FBFFEB04008FE20240BDE8E30000EAFA
S11340540C0000007C00004085FBFFEA88009FE51B
S1134064001090E5601C81E3001080E5E004A0E307
S1134074B00B80E3001090E50F20E0E3F02EC2E3E0
S1134084011002E0001080E5001090E5051081E3C2
S1134094A01E81E3001080E50200A0E3E014A0E385
S11340A4F01B81E3000081E5800C81E20110A0E3B0
S11340B4001080E5402C80E2001082E50010A0E3AB
S11340C4101080E5101082E5081080E5081082E5E0
S11340D43130A0E3903A83E3143080E5143082E570
S11340E4001080E5001082E51EFF2FE1C4C01FE02C
S11340F410402DE90040B0E10600000A010054E339
S11341040400000A5820A0E3751F8FE26D0F8FE2AC
S1134114EDFDFFEB0000A0E14E02A0E3400A80E3C2
S1134124000090E5081084E23001A0E1010000E2FF
S11341341040BDE81EFF2FE110402DE90140A0E12D
S1134144000050E30900000A010050E30400000ADF
S11341546020A0E3621F8FE2750F8FE2DAFDFFEBAC
S11341640000A0E10400A0E11040BDE8270000EA3B
S11341740400A0E11040BDE8200000EA10402DE94D
S11341840140A0E1000050E31900000A010050E3DB
S11341940400000A6F20A0E3511F8FE2490F8FE24D
S11341A4C9FDFFEB0000A0E14E02A0E3480A80E34E
S11341B4201090E5811AA0E1A11AA0E1001084E581
S11341C41C1090E50F20A0E3211802E0041084E5FC
S11341D4241090E5282090E5003090E5043083E332
S11341E4003080E50C2084E5081084E51040BDE827
S11341F41EFF2FE14E02A0E3440A80E3EBFFFFEA33
S11342040010A0E34E22A0E3442A82E3020000EA61
S11342140010A0E34E22A0E3482A82E3183092E57A
S1134224040013E30A00000A001090E5301082E54C
S1134234041090E50118A0E12C1082E5081090E523
S1134244341082E50C0090E5380082E52100A0E3F7
S1134254180000EA400E13E30A00000A001090E577
S1134264401082E5041090E50118A0E13C1082E5B9
S1134274081090E5441082E50C0090E5480082E5BE
S11342844100A0E30B0000EA400A13E30B00000A18
S1134294001090E5501082E5041090E50118A0E1A7
S11342A44C1082E5081090E5541082E50C0090E56A
S11342B4580082E58100A0E3000082E50110A0E338
S11342C40100A0E11EFF2FE128706F7274203D3DB0
S11342D4203029207C7C2028706F7274203D3D207E
S11342E431290000433A5C55736572735C737475C9
S11342F464656E745C446F63756D656E74735C633E
S11343046D303630352D7265616C2D74696D652D93
S11343147363686564756C696E675C776F726B73DD
S1134324706163655C6273705C7372635C63616E19
S11343342E63000028706F7274203D3D3029207C68
S11343447C2028706F7274203D3D203129000000C8
S113435400502DE90000A0E12630A0E3803B83E374
S11343640310A0E11800A0E3563412EFFBFFFFEAA8
S113437410402DE9281080E50A20A0E3882080E578
S11343840020A0E38C2080E50930A0E324C080E26F
S113439478E080E204100CE408308EE510408EE2EC
S11343A40C408EE5013043E204100CE400308EE549
S11343B408408EE204408EE5013043E210E04EE210
S11343C4000053E3F2FFFF5A2C2080E5302080E5FF
S11343D4381080E2341080E51040BDE81EFF2FE160
S11343E40E002DE900402DE908D04DE20C108DE2B9
S11343F400108DE50020A0E10D30A0E10110A0E340
S113440414009FE50F0080E0100080E20BEFFFEB47
S11344140640BDE80CD08DE21EFF2FE1381B0000DE
S11344245465726D696E616C203920283132783696
S1134434290000000000000000000000000000004B
S11344440E11111B11111B15110E00000E1F1F1547
S11344541F1F151B1F0E0000000A1B1F1F1F1F0E0A
S11344640E04040004040E0E1F1F1F0E0E04040089
S1134474040E0E0E041F1F0E040E000004040E0E80
S11344841F1F1F0E040E000000000000000606009B
S1134494000000001F1F1F1F1F19191F1F1F1F1FAC
S11344A4000000000E0A0A0E000000001F1F1F1F58
S11344B4111515111F1F1F1F00001C1814060909CC
S11344C409060000000609090906020207020000A1
S11344D40000040C0C040404070300000C0A0E0A74
S11344E40A0A0E0E0303000000000000150E110E4C
S11344F41500000000000103070F0703010000007A
S11345040000080C0E0F0E0C0800000000040E1529
S1134514040404150E04000000000A0A0A0A0A002E
S11345240A0A0000000E0B0B0B0B0A0A0A0A00000D
S11345340006090106090608090600000000000037
S1134544000000000F0F000000040E1504040415FD
S11345540E041F0000040E150404040404040000E3
S113456400000404040404150E0400000000000206
S1134574040F04020000000000000004020F0204FF
S113458400000000000000000001010F0000000012
S11345940000000A0A1F0A0A0000000000000004C8
S11345A4040E0E1F000000000000001F0E0E040481
S11345B400000000000000000000000000000000F3
S11345C40004040404040400040400000A0A0A0A9B
S11345D40000000000000000000A0A1F0A0A1F0A63
S11345E40A00000000020609010204080906040086
S11345F4000B0B04040202020D0D00000002050569
S113460405021509091600000C0C0804000000003A
S1134614000000000004020202020202020400007C
S11346240002040404040404040200000000041549
S11346340E0E15040000000000000004041F04040E
S11346440000000000000000000000000606040250
S113465400000000000F0000000000000000000043
S11346640000000006060000000808040402020218
S113467401010000000E09090909090909070000DC
S11346840004060504040404040F000000060909D8
S113469408040201010F00000006090808060808BE
S11346A40906000000080C0A0A090F08080800009B
S11346B4000F01010107080809060000000C0201AB
S11346C40709090909060000000F08080804040280
S11346D40202000000060909090609090906000086
S11346E40006090909090E0804030000000000007B
S11346F4060600000606000000000000060600008E
S11347040606040200000804020101020408000071
S113471400000000000F000F000000000000010270
S1134724040808040201000000060909080404003E
S11347340404000000060909090D0D01010E00001E
S113474400060909090F09090909000000070909F4
S11347540907090909070000000609090101010103
S113476409060000000709090909090909070000E5
S1134774000F0101010F0101010F0000000F0101ED
S1134784010F0101010100000006090901010D09DD
S11347940906000000090909090F090909090000AB
S11347A4000E040404040404040E0000000E0404B3
S11347B404040405050200000009090505030505B0
S11347C4090900000001010101010101010F0000B8
S11347D40009090F0F090909090900000009090B57
S11347E40B0D0D0909090000000609090909090945
S11347F40906000000070909090701010101000075
S11348040006090909090909090604080007090930
S11348140907030509090000000609090106080936
S113482409060000001F0404040404040404000032
S11348340009090909090909090600000009090907
S113484409090A0A04040000000909090909090FED
S113485409090000000909090606060909090000F6
S1134864001111110A0A040404040000000F0804CE
S113487404020201010F0000000602020202020205
S113488402060000000101020204040408080000F6
S113489400060404040404040406000000040A00DA
S11348A40000000000000000000000000000000000
S11348B40000001F060602040000000000000000BF
S11348C40000000006080E09090E000000010101A1
S11348D40709090909070000000000000E0101018D
S11348E4010E0000000808080E090909090E000059
S11348F4000000000609090F010E00000004020272
S11349040702020202020000000000000E09090965
S1134914090E080600010101070909090909000033
S11349240000040004040404040E00000000040055
S11349340404040404040502000101010905030339
S1134944050900000006040404040404040E000021
S113495400000000090F0909090900000000000013
S1134964050B0909090900000000000006090909EA
S113497409060000000000000709090909070101EC
S1134984000000000E090909090E080800000000CF
S11349940D0A0202020200000000000006090204DB
S11349A409060000000002020702020202060000D7
S11349B40000000009090909090E000000000000B4
S11349C409090A0A0404000000000000090909098D
S11349D40F09000000000000090906060909000087
S11349E40000000009090909090E08070000000075
S11349F40F080402010F0000000402020201020273
S1134A040204000004040404000404040404000074
S1134A14000204040408040404020000000A05005B
S1134A2400000000000000000004040A0A1111112F
S1134A34111F0000000E0909090F090909090000E2
S1134A44000F01010107090909070000000709090A
S1134A540907090909070000000F01010101010107
S1134A6401010000000C0A0A0A0A0A0A0A1F1100BA
S1134A74000F0101010F0101010F000000151515BC
S1134A84150E151515150000000609080806080872
S1134A9409060000000909090D0D0B0B09090000A2
S1134AA4060909090D0D0B0B090900000009090584
S1134AB40503050509090000000E09090909090986
S1134AC4090900000009090F0F090909090900006F
S1134AD400090909090F090909090000000609095F
S1134AE40909090909060000000F09090909090946
S1134AF4090900000007090909070101010100006F
S1134B04000609090101010109060000001F04044B
S1134B14040404040404000000090909090E080833
S1134B240906000000040E151515150E04040000F2
S1134B34000909090606060909090000000909090A
S1134B4409090909091F101000090909090E0808AF
S1134B54080800000015151515151515151F000076
S1134B640015151515151515151F1010000303024E
S1134B74020E1212120E000000090909090B0D0D90
S1134B840D0B0000000101010107090909070000D8
S1134B9400060908080E080809060000000915158E
S1134BA41517151515090000000E0909090E0C0A3C
S1134BB4090900000000000006080E09090E00009F
S1134BC400000806010709090906000000000000A6
S1134BD40709070909070000000000000F0101018B
S1134BE401010000000000000C0A0A0A0A1F110057
S1134BF4000000000609090F010E00000000000077
S1134C0415150E151515000000000000060904080A
S1134C14090600000000000009090D0B0909000041
S1134C240000040209090D0B09090000000000003A
S1134C340905030305090000000000000E09090921
S1134C440909000000000000090F0909090900000E
S1134C540000000009090F09090900000000000010
S1134C640609090909060000000000000F090909E2
S1134C740909000000001500000A00001500000ADC
S1134C84000A0015000A0015000A00150A150A1581
S1134C940A150A150A150A15040404040404040470
S1134CA404040404040404040407040404040404B9
S1134CB40404040407040704040404040A0A0A0A8E
S1134CC40A0B0A0A0A0A0A0A00000000000F0A0A68
S1134CD40A0A0A0A0000000007040704040404047E
S1134CE40A0A0A0A0B080B0A0A0A0A0A0A0A0A0A1C
S1134CF40A0A0A0A0A0A0A0A000000000F080B0A30
S1134D040A0A0A0A0A0A0A0A0B080F000000000029
S1134D140A0A0A0A0A0F000000000000040404043A
S1134D24070407000000000000000000000704045A
S1134D340404040404040404041C0000000000002B
S1134D4404040404041F0000000000000000000028
S1134D54001F04040404040404040404041C0404DC
S1134D640404040400000000001F0000000000000C
S1134D7404040404041F04040404040404040404D0
S1134D841C041C04040404040A0A0A0A0A1A0A0A6B
S1134D940A0A0A0A0A0A0A0A1A021E000000000081
S1134DA4000000001E021A0A0A0A0A0A0A0A0A0A67
S1134DB41B001F0000000000000000001F001B0A6D
S1134DC40A0A0A0A0A0A0A0A1A021A0A0A0A0A0A23
S1134DD4000000001F001F00000000000A0A0A0A65
S1134DE41B001B0A0A0A0A0A040404041F001F0005
S1134DF4000000000A0A0A0A0A1F0000000000005A
S1134E04000000001F001F04040404040000000048
S1134E14001F0A0A0A0A0A0A0A0A0A0A0A1E0000DF
S1134E2400000000040404041C041C00000000002E
S1134E34000000001C041C0404040404000000001A
S1134E44001E0A0A0A0A0A0A0A0A0A0A0A1B0A0A9F
S1134E540A0A0A0A040404041F001F0404040404C0
S1134E64040404040407000000000000000000001F
S1134E74001C0404040404041F1F1F1F1F1F1F1FFE
S1134E841F1F1F1F0000000000001F1F1F1F1F1FE4
S1134E940707070707070707070707071C1C1C1C46
S1134EA41C1C1C1C1C1C1C1C1F1F1F1F1F1F000060
S1134EB400000000000000000709090909070101B6
S1134EC4000000000E010101010E000000000000BA
S1134ED41F04040404040000000000000909090973
S1134EE4090E080700000000040E1515150E04042D
S1134EF4000000000909060609090000000000007A
S1134F0409090909091F1010000000000909090E04
S1134F14080800000000000015151515151F0000F1
S1134F240000000015151515151F101000000000D1
S1134F340302060A0A0600000000000009090B0D1A
S1134F440D0B00000000000001010709090700001F
S1134F540000000007080E08080700000000000015
S1134F640915171515090000000000000E09090EA3
S1134F7409090000090F0101010F0101010F0000DB
S1134F84000A0A000609090F010E000000060901BF
S1134F940107010109060000000000000E010701D9
S1134FA4010E00001104040404040404040E0000AB
S1134FB4000A0A0006040404040E00000609090990
S1134FC4090E080809060000000009060909090970
S1134FD4090E080706090906000000000000000085
S1134FE400000000040E04000000000000000000A3
S1134FF40004040000000000001C0404040405056B
S113500406040000001D1D05051F07050505000015
S11350140009060909090909060900000000000E2F
S11350240E0E0E0E00000000000000000000000040
S113503400000000585F5269676874203C20474CA4
S113504443445F484F52495A4F4E54414C5F53496D
S11350545A450000433A5C55736572735C73747506
S113506464656E745C446F63756D656E74735C63C0
S11350746D303630352D7265616C2D74696D652D16
S11350847363686564756C696E675C776F726B7360
S1135094706163655C6273705C7372635C6C63649B
S11350A45C6472765F676C63642E6300595F446F5B
S11350B4776E203C20474C43445F56455254494341
S11350C4414C5F53495A4500585F4C656674203C13
S11350D420585F526967687400000000595F557076
S11350E4203C20595F446F776E00000000000000EC
S11350F40000000000000000000000001000000098
S11351040000000000000000000000001100000086
S11351140000000000000000000000001300000074
S11351240000000000000000000000002000000057
S11351340000000000000000000000002100000046
S1135144000000000000000000000000280000002F
S1135154000000000000000000000000290000001E
S11351640000000000000000000000002A0000000D
S11351740000000000000000020000002B000000FA
S11351840000000000000000020000002C000000E9
S11351940000000000000000FFFFFFFF2D000000DE
S11351A400000000000000001400000037000000AC
S11351B400000000000000000100000038000000AE
S11351C4000000000000000000000000390000009E
S11351D4000000000000000000000000DA000000ED
S11351E4010000000000000001000000DB000000DA
S11351F4010000000000000001000000DC000000C9
S1135204010000000000000001000000B4000000E0
S1135214000000000000000004000000B5000000CD
S1135224000000000000000004000000B6000000BC
S1135234000000000000000004000000B8000000AA
S1135244000000000000000001000000B70000009E
S1135254010000000000000001000000D100000073
S1135264000000000000000000000000D000000066
S1135274000000000000000000000000D400000052
S1135284000000000000000001000000D500000040
S11352940100000000000000010000000000000004
S11352A400000000000000000000000033000000C3
S11352B400000000000000000300000000000000E3
S11352C400000000000000000000000025000000B1
S11352D4000000000000000001000000FFFFFFFFC9
S11352E4000000000000000000000000FFFFFFFFBA
S11352F4000000000000000000000000FFFFFFFFAA
S1135304000000000000000000000000FFFFFFFF99
S1135314000000000000000000000000FFFFFFFF89
S1135324000000000000000000000000FFFFFFFF79
S1135334000000000000000000000000FFFFFFFF69
S1135344000000000000000000000000FFFFFFFF59
S1135354000000000000000000000000FFFFFFFF49
S1135364000000000000000000000000FFFFFFFF39
S1135374000000000000000000000000B000000075
S1135384000000000000000000000000B100000064
S113539400000000000000000000000009000000FC
S11353A401000000010000000400000001000000EE
S11353B400000000000000000000000004000000E1
S11353C401000000010000000300000030000000A0
S11353D400000000000000000200000012000000B1
S11353E4000000000000000000000000360000007F
S11353F40000000000000000010000003A0000006A
S11354040000000000000000010000002200000071
S11354140000000000000000000000002300000061
S11354240000000000000000000000000200000072
S11354340000000000000000000000000300000061
S1135444000000000000000000000000250000002F
S113545400000000000000000000000095000000AF
S113546400000000000000000000000094000000A0
S1135474000000000000000000000000A90000007B
S1135484000000000000000000000000A60000006E
S1135494000000000000000000000000A70000005D
S11354A4000000000000000000000000AE00000046
S11354B4000000000000000000000000AF00000035
S11354C400000000000000000000000015000000BF
S11354D4000000000000000002000000750000004D
S11354E40000000000000000020000005C00000056
S11354F40000000000000000FFFFFFFFCE000000DA
S1135504000000000000000014000000AB000000D4
S1135514000000000000000001000000380000004A
S1135524000000000000000000000000390000003A
S1135534000000000000000000000000DA00000089
S1135544010000000000000001000000DB00000076
S1135554010000000000000001000000DC00000065
S1135564010000000000000001000000B40000007D
S1135574000000000000000004000000B50000006A
S1135584000000000000000004000000B600000059
S1135594000000000000000004000000B800000047
S11355A4000000000000000001000000B70000003B
S11355B4010000000000000001000000CD00000014
S11355C4000000000000000000000000CC00000007
S11355D40000000000000000000000007C00000047
S11355E40000000000000000010000007D00000035
S11355F4010000000000000001000000A8000000F9
S1135604000000000000000002000000AA000000E6
S1135614000000000000000004000000BC000000C2
S1135624000000000000000003000000000000006F
S1135634000000000000000001000000D100000090
S1135644000000000000000000000000D200000080
S1135654000000000000000000000000E000000062
S1135664000000000000000000000000EE00000044
S1135674000000000000000000000000D60000004C
S1135684000000000000000000000000D70000003B
S1135694000000000000000000000000AA00000058
S11356A4000000000000000004000000CA00000024
S11356B400000000000000000300000020000000BF
S11356C40000000000000000010000008100000050
S11356D4000000000000000002000000FFFFFFFFC4
S11356E4000000000000000000000000FFFFFFFFB6
S11356F4000000000000000000000000FFFFFFFFA6
S1135704010000000000000000000000FFFFFFFF94
S1135714000000000000000000000000FFFFFFFF85
S1135724000000000000000000000000FFFFFFFF75
S1135734000000000000000000000000FFFFFFFF65
S1135744000000000000000000000000FFFFFFFF55
S1135754000000000000000000000000FFFFFFFF45
S1135764000000000000000000000000FFFFFFFF35
S1135774000000000000000000000000FFFFFFFF25
S1135784000000000000000000000000FFFFFFFF15
S1135794000000000000000000000000FFFFFFFF05
S11357A400000000000000000000000000000000F1
S11357B40000A0E340139FE5000081E5040081E5B7
S11357C4080081E50C00C1E5100081E5140081E5C1
S11357D4180081E51C00C1E5200081E5240081E571
S11357E4280081E52C00C1E5300081E5340081E521
S11357F4380081E53C00C1E5FA2FA0E320108FE2D4
S1135804ED0000EA00502DE90000A0E3210100EBC3
S113581400000FE1C000C0E300F021E10140BDE855
S11358241EFF2FE1D0029FE5001090E5000051E334
S11358340B00000A041090E5000051E30600001A6E
S11358440C10D0E5011081E20C10C0E5081090E5BD
S1135854000051E30200000A000000EA011041E2E2
S1135864041080E5101090E5000051E30B00000AD9
S1135874141090E5000051E30600001A1C10D0E552
S1135884011081E21C10C0E5181090E5000051E3FA
S11358940200000A000000EA011041E2141080E54D
S11358A4201090E5000051E30B00000A241090E559
S11358B4000051E30600001A2C10D0E5011081E227
S11358C42C10C0E5281090E5000051E30200000A02
S11358D4000000EA011041E2241080E5301090E554
S11358E4000051E30B00000A341090E5000051E37A
S11358F40600001A3C10D0E5011081E23C10C0E51A
S1135904381090E5000051E30200000A000000EAA8
S1135914011041E2341080E51EFF2FE110402DE90F
S1135924D4419FE50C00D4E5000050E30900000ACB
S1135934000094E50FE0A0E110FF2FE10C00D4E592
S1135944010040E20C00C4E5080094E5000050E3C3
S11359540000001A520000EB1C00D4E5000050E3E0
S11359640A00000A100094E50FE0A0E110FF2FE103
S11359741C00D4E5010040E21C00C4E5180094E5D1
S1135984000050E30100001A0100A0E3440000EB0E
S11359942C00D4E5000050E30A00000A200094E53A
S11359A40FE0A0E110FF2FE12C00D4E5010040E258
S11359B42C00C4E5280094E5000050E30100001A1B
S11359C40200A0E3360000EB3C00D4E5000050E301
S11359D40A00000A300094E50FE0A0E110FF2FE173
S11359E43C00D4E5010040E23C00C4E5380094E501
S11359F4000050E30100001A0300A0E3280000EBB8
S1135A04F8009FE5001090E5011081E3001080E5A3
S1135A141040BDE81EFF2FE1F0412DE90060A0E134
S1135A240140A0E10250A0E10080A0E3C8709FE51A
S1135A34000097E5000050E31100000A0180A0E390
S1135A44100097E5000050E30D00000A0280A0E373
S1135A54200097E5000050E30900000A0380A0E356
S1135A64300097E5000050E30500000A0480A0E339
S1135A744520A0E3A0108FE284008FE292F7FFEBAD
S1135A840000A0E1086287E7080287E0044080E59B
S1135A94085080E50010A0E30C10C0E5F041BDE817
S1135AA41EFF2FE110402DE90040A0E1040054E35F
S1135AB4030000AA40009FE5040290E7000050E3BD
S1135AC40400001A4F20A0E34C108FE2A4008FE2DC
S1135AD47DF7FFEB0000A0E10000A0E318109FE5B0
S1135AE4040281E7041281E0040081E5080081E5F1
S1135AF40C00C1E51040BDE81EFF2FE16402004024
S1135B04C0C01FE069203C2054545F5343484544BB
S1135B145F4D41585F5441534B530000433A5C5525
S1135B24736572735C73747564656E745C446F63DB
S1135B34756D656E74735C636D303630352D7265C6
S1135B44616C2D74696D652D7363686564756C6926
S1135B546E675C776F726B73706163655C545453E6
S1135B64636865645C7372635C7363686564756CB1
S1135B7465722E6300000000286964203C2054549C
S1135B845F53434845445F4D41585F5441534B531D
S1135B942920262620287363685461736B735B6918
S1135BA4645D2E7461736B20213D202870566F69E7
S1135BB46446756E635F74293029000070402DE9D2
S1135BC40140A0E10250A0E1000050E31600001AD5
S1135BD4E064A0E3406C86E30200A0E3040086E5ED
S1135BE40000A0E30C0086E5700086E50200A0E353
S1135BF481F7FFEB0510A0E148F2FFEB180086E5FE
S1135C04FF00A0E3000086E50300A0E3140086E59A
S1135C14D0009FE5004080E50420A0E30010A0E349
S1135C249C008FE27040BDE804F8FFEA010050E3F1
S1135C341600001AE064A0E3806C86E30200A0E38B
S1135C44040086E50000A0E30C0086E5700086E508
S1135C540400A0E368F7FFEB0510A0E12FF2FFEBCB
S1135C64180086E5FF00A0E3000086E50300A0E336
S1135C74140086E56C009FE5044080E50520A0E35C
S1135C840010A0E360008FE27040BDE8EBF7FFEA88
S1135C947040BDE81EFF2FE1000050E30100A003A3
S1135CA44E12A003401C81030300000A010050E3C8
S1135CB40200001A4E12A0E3801C81E3000081E577
S1135CC41EFF2FE100502DE918009FE5000090E528
S1135CD40FE0A0E110FF2FE10100A0E3E014A0E332
S1135CE4401C81E30A0000EAB402004000502DE99C
S1135CF400009FE5000000EAB4020040040090E5BF
S1135D040FE0A0E110FF2FE10100A0E3E014A0E301
S1135D14801C81E3000081E50140BDE81EFF2FE102
S1135D2400502DE9D4F7FFEBA0FEFFEB7D2FA0E399
S1135D340010A0E31C008FE236FFFFEB1420A0E365
S1135D440110A0E338008FE232FFFFEBACFEFFEB5F
S1135D54F1FEFFEBFDFFFFEA10402DE988409FE5CB
S1135D640410A0E10000A0E3F2F8FFEB000050E30C
S1135D740100A01310008415080084151040BDE828
S1135D841EFF2FE110402DE90000A0E3D7F8FFEB3C
S1135D94000050E31200000A50409FE50410A0E103
S1135DA40000A0E3F4F8FFEB080094E5000050E3DE
S1135DB40B00000A0210A0E30200A0E3A5F8FFEB25
S1135DC42C008FE285F9FFEB0310A0E30200A0E3AB
S1135DD4A0F8FFEB081094E520008FE21040BDE822
S1135DE47EF9FFEA1040BDE81EFF2FE19400004055
S1135DF4A402004054454D50455241545552450067
S1135E04253033750000000000000FE11F00C0E3DB
S1135E14120080E300F021E134109FE507D0C1E3D0
S1135E241F00C0E3110080E300F021E124109FE58A
S1135E3407D0C1E31F00C0E31F0080E300F021E1A9
S1135E4414109FE507D0C1E30000A0E10000A0E125
S1135E54050000EAC007004000080040C0060040F6
S1135E6400C09FE51CFF2FE1A55E00000100A0E334
S1135E74080000EB000050E30000000AF7FFFFEB0A
S1135E840000A0E30000A0E1A4FFFFEB100000EB7E
S1135E942EF9FFEBFDFFFFEA0100A0E31EFF2FE153
S1135EA410B5094979442031084C7C441E3405E07A
S1135EB40A68081D891800F00BF80100A142F7D103
S1135EC410BC08BC1847C046B4000000D40000004D
S1135ED408470000FFFFFFEA0070B0E10700B0E1EB
S1135EE41AF9FFEBFDFFFFEA70B40121002313E06C
S1135EF40468001D0C4202D04D466D1E64192360D3
S1135F04241D121F042AFAD22500960701D52380E2
S1135F14AD1C0A4000D02B700268001D002AE7D192
S1135F2470BC704730B401210268001D002A0FD0F0
S1135F3403684468C31808300C4202D04D466D1EF1
S1135F4464191D681B1D2560241D121FECD0F8E77D
S1135F5430BC704738402DE90040A0E10150A0E175
S1135F640500A0E1FDF3FFEB050050E10040A013A0
S1135F740400A0E13240BDE81EFF2FE16DFFFFFFE6
S1135F8414020000A80000400000000099FFFFFF75
S1135F9468000000140000004000004000000000FD
S1135FA4FEFFFFEA0EF0B0E1000000000000000074
S1135FB400000000000000000000000000000000D9
S1135FC40000000000000000000000008400000045
S1135FD48400000004000000000000000000000031
S1135FE400000000060000000C0000000000000097
S1135FF4FF00000038440000244400002300000093
S11360040400000000000000000000000000000084
S9035E0C92
