 _______    ______    ______  ________   ______    ______   _______   ________
|       \  /      \  /      \|        \ /      \  /      \ |       \ |        \
| $$$$$$$\|  $$$$$$\|  $$$$$$\\$$$$$$$$|  $$$$$$\|  $$$$$$\| $$$$$$$\| $$$$$$$$
| $$__/ $$| $$  | $$| $$___\$$  | $$   | $$   \$$| $$  | $$| $$  | $$| $$__
| $$    $$| $$  | $$ \$$    \   | $$   | $$      | $$  | $$| $$  | $$| $$  \
| $$$$$$$ | $$  | $$ _\$$$$$$\  | $$   | $$   __ | $$  | $$| $$  | $$| $$$$$
| $$      | $$__/ $$|  \__| $$  | $$   | $$__/  \| $$__/ $$| $$__/ $$| $$_____
| $$       \$$    $$ \$$    $$  | $$    \$$    $$ \$$    $$| $$    $$| $$     \
 \$$        \$$$$$$   \$$$$$$    \$$     \$$$$$$   \$$$$$$  \$$$$$$$  \$$$$$$$$
  ______   ________  _______   __     __  ______   ______   ________
 /      \ |        \|       \ |  \   |  \|      \ /      \ |        \
|  $$$$$$\| $$$$$$$$| $$$$$$$\| $$   | $$ \$$$$$$|  $$$$$$\| $$$$$$$$
| $$___\$$| $$__    | $$__| $$| $$   | $$  | $$  | $$   \$$| $$__
 \$$    \ | $$  \   | $$    $$ \$$\ /  $$  | $$  | $$      | $$  \
 _\$$$$$$\| $$$$$   | $$$$$$$\  \$$\  $$   | $$  | $$   __ | $$$$$
|  \__| $$| $$_____ | $$  | $$   \$$ $$   _| $$_ | $$__/  \| $$_____
 \$$    $$| $$     \| $$  | $$    \$$$   |   $$ \ \$$    $$| $$     \
  \$$$$$$  \$$$$$$$$ \$$   \$$     \$     \$$$$$$  \$$$$$$  \$$$$$$$$
