{
	"fileVersion": 1,
	"versions": {
		"ddb": "~master",
		"diet-ng": "1.2.1",
		"libasync": "0.8.3",
		"libevent": "2.0.2+2.0.16",
		"memutils": "0.4.9",
		"openssl": "1.1.5+1.0.1g",
		"vibe-d": "0.7.31"
	}
}
