%YAML 1.1
%TAG !u! tag:unity3d.com,2011:
--- !u!1001 &1521240361789667174
PrefabInstance:
  m_ObjectHideFlags: 0
  serializedVersion: 2
  m_Modification:
    m_TransformParent: {fileID: 0}
    m_Modifications:
    - target: {fileID: -8679921383154817045, guid: f38e609788737f84f81d9b50777c7766,
        type: 3}
      propertyPath: m_LocalPosition.x
      value: 0
      objectReference: {fileID: 0}
    - target: {fileID: -8679921383154817045, guid: f38e609788737f84f81d9b50777c7766,
        type: 3}
      propertyPath: m_LocalPosition.y
      value: 0
      objectReference: {fileID: 0}
    - target: {fileID: -8679921383154817045, guid: f38e609788737f84f81d9b50777c7766,
        type: 3}
      propertyPath: m_LocalPosition.z
      value: 0
      objectReference: {fileID: 0}
    - target: {fileID: -8679921383154817045, guid: f38e609788737f84f81d9b50777c7766,
        type: 3}
      propertyPath: m_RootOrder
      value: 0
      objectReference: {fileID: 0}
    - target: {fileID: -8679921383154817045, guid: f38e609788737f84f81d9b50777c7766,
        type: 3}
      propertyPath: m_LocalEulerAnglesHint.x
      value: 0
      objectReference: {fileID: 0}
    - target: {fileID: -8679921383154817045, guid: f38e609788737f84f81d9b50777c7766,
        type: 3}
      propertyPath: m_LocalEulerAnglesHint.y
      value: -179.99998
      objectReference: {fileID: 0}
    - target: {fileID: -8679921383154817045, guid: f38e609788737f84f81d9b50777c7766,
        type: 3}
      propertyPath: m_LocalEulerAnglesHint.z
      value: 0
      objectReference: {fileID: 0}
    - target: {fileID: -8679921383154817045, guid: f38e609788737f84f81d9b50777c7766,
        type: 3}
      propertyPath: m_LocalRotation.x
      value: -0
      objectReference: {fileID: 0}
    - target: {fileID: -8679921383154817045, guid: f38e609788737f84f81d9b50777c7766,
        type: 3}
      propertyPath: m_LocalRotation.y
      value: -1
      objectReference: {fileID: 0}
    - target: {fileID: -8679921383154817045, guid: f38e609788737f84f81d9b50777c7766,
        type: 3}
      propertyPath: m_LocalRotation.z
      value: -0
      objectReference: {fileID: 0}
    - target: {fileID: -8679921383154817045, guid: f38e609788737f84f81d9b50777c7766,
        type: 3}
      propertyPath: m_LocalRotation.w
      value: -0.00000032782552
      objectReference: {fileID: 0}
    - target: {fileID: 919132149155446097, guid: f38e609788737f84f81d9b50777c7766,
        type: 3}
      propertyPath: m_Name
      value: Pulsoximeter
      objectReference: {fileID: 0}
    - target: {fileID: 5866666021909216657, guid: f38e609788737f84f81d9b50777c7766,
        type: 3}
      propertyPath: m_Controller
      value: 
      objectReference: {fileID: 0}
    - target: {fileID: 6005487454972756394, guid: f38e609788737f84f81d9b50777c7766,
        type: 3}
      propertyPath: m_Materials.Array.data[0]
      value: 
      objectReference: {fileID: 2100000, guid: a608b5e20b218bd4d906f128117fb689, type: 2}
    m_RemovedComponents: []
  m_SourcePrefab: {fileID: 100100000, guid: f38e609788737f84f81d9b50777c7766, type: 3}
