%YAML 1.1
%TAG !u! tag:unity3d.com,2011:
--- !u!114 &11400000
MonoBehaviour:
  m_ObjectHideFlags: 0
  m_CorrespondingSourceObject: {fileID: 0}
  m_PrefabInstance: {fileID: 0}
  m_PrefabAsset: {fileID: 0}
  m_GameObject: {fileID: 0}
  m_Enabled: 1
  m_EditorHideFlags: 0
  m_Script: {fileID: 11500000, guid: e9620f8c34305754d8cc9a7e49e852d9, type: 3}
  m_Name: UISzenarioOne_en
  m_EditorClassIdentifier: 
  m_LocaleId:
    m_Code: en
  m_SharedData: {fileID: 11400000, guid: 0f046f770c4f7024a9942826b4f09206, type: 2}
  m_Metadata:
    m_Items: []
  m_TableData:
  - m_Id: 1011136978944
    m_Localized: Loading...
    m_Metadata:
      m_Items: []
  - m_Id: 1217140219904
    m_Localized: Yes
    m_Metadata:
      m_Items: []
  - m_Id: 1329690173440
    m_Localized: No
    m_Metadata:
      m_Items: []
  - m_Id: 1739444314112
    m_Localized: Result
    m_Metadata:
      m_Items: []
  - m_Id: 26498949120
    m_Localized: Move the smartphone over the working area to detect the planes.
    m_Metadata:
      m_Items: []
  - m_Id: 340224499712
    m_Localized: Tap on the screen of the smartphone to place the training at the
      shown place.
    m_Metadata:
      m_Items: []
  - m_Id: 443492458496
    m_Localized: Grab
    m_Metadata:
      m_Items: []
  - m_Id: 496151945216
    m_Localized: Use
    m_Metadata:
      m_Items: []
  - m_Id: 657708146688
    m_Localized: Combine
    m_Metadata:
      m_Items: []
  - m_Id: 1432568061952
    m_Localized: Are you sure that you want to <b> leave the scenario</b>? All progress
      is lost.
    m_Metadata:
      m_Items: []
  - m_Id: 1846600392704
    m_Localized: Congratulation you successfully prepared the emergecytokolyse.
    m_Metadata:
      m_Items: []
  - m_Id: 5743607872348160
    m_Localized: 'The workspace

      is disinfected!'
    m_Metadata:
      m_Items: []
  - m_Id: 5750063967363072
    m_Localized: 'Your hands

      are disinfected!'
    m_Metadata:
      m_Items: []
  - m_Id: 5750295052541952
    m_Localized: 'You are wearing

      gloves now!'
    m_Metadata:
      m_Items: []
  - m_Id: 5750607133925376
    m_Localized: 'Pay attention that the scale is stil visible

      after applying
      the label!'
    m_Metadata:
      m_Items: []
  - m_Id: 5753908055367680
    m_Localized: End Szenario
    m_Metadata:
      m_Items: []
  - m_Id: 5754047876685824
    m_Localized: 'Technical information:'
    m_Metadata:
      m_Items: []
  - m_Id: 6726840063746048
    m_Localized: Help
    m_Metadata:
      m_Items: []
  - m_Id: 6726842748100608
    m_Localized: Menu
    m_Metadata:
      m_Items: []
  - m_Id: 6726844337741824
    m_Localized: Replace the setup
    m_Metadata:
      m_Items: []
  references:
    version: 1
