%YAML 1.1
%TAG !u! tag:unity3d.com,2011:
--- !u!1 &2107427368125773461
GameObject:
  m_ObjectHideFlags: 0
  m_CorrespondingSourceObject: {fileID: 0}
  m_PrefabInstance: {fileID: 0}
  m_PrefabAsset: {fileID: 0}
  serializedVersion: 6
  m_Component:
  - component: {fileID: 6974345048664657604}
  - component: {fileID: 6629286674236572568}
  - component: {fileID: 1037348774160947229}
  - component: {fileID: 2877196626799589134}
  m_Layer: 0
  m_Name: "Arbeitsfl\xE4che"
  m_TagString: Untagged
  m_Icon: {fileID: 0}
  m_NavMeshLayer: 0
  m_StaticEditorFlags: 0
  m_IsActive: 1
--- !u!4 &6974345048664657604
Transform:
  m_ObjectHideFlags: 0
  m_CorrespondingSourceObject: {fileID: 0}
  m_PrefabInstance: {fileID: 0}
  m_PrefabAsset: {fileID: 0}
  m_GameObject: {fileID: 2107427368125773461}
  m_LocalRotation: {x: 0, y: 0, z: 0, w: 1}
  m_LocalPosition: {x: -0.036292497, y: 0.05254841, z: -0.0037552118}
  m_LocalScale: {x: 0.7174156, y: 1, z: 0.67191}
  m_Children: []
  m_Father: {fileID: 0}
  m_RootOrder: 0
  m_LocalEulerAnglesHint: {x: 0, y: 0, z: 0}
--- !u!114 &6629286674236572568
MonoBehaviour:
  m_ObjectHideFlags: 0
  m_CorrespondingSourceObject: {fileID: 0}
  m_PrefabInstance: {fileID: 0}
  m_PrefabAsset: {fileID: 0}
  m_GameObject: {fileID: 2107427368125773461}
  m_Enabled: 1
  m_EditorHideFlags: 0
  m_Script: {fileID: 11500000, guid: ef47e728b6db49448b176bfcfa9afaae, type: 3}
  m_Name: 
  m_EditorClassIdentifier: 
  stateForPlacement: 1
  combinedWithName: "Arbeitsfl\xE4che"
--- !u!65 &1037348774160947229
BoxCollider:
  m_ObjectHideFlags: 0
  m_CorrespondingSourceObject: {fileID: 0}
  m_PrefabInstance: {fileID: 0}
  m_PrefabAsset: {fileID: 0}
  m_GameObject: {fileID: 2107427368125773461}
  m_Material: {fileID: 0}
  m_IsTrigger: 0
  m_Enabled: 1
  serializedVersion: 2
  m_Size: {x: 0.49881756, y: 0.75014687, z: 0.5531532}
  m_Center: {x: 0.0003682375, y: -0.12492657, z: 0.029834092}
--- !u!65 &2877196626799589134
BoxCollider:
  m_ObjectHideFlags: 0
  m_CorrespondingSourceObject: {fileID: 0}
  m_PrefabInstance: {fileID: 0}
  m_PrefabAsset: {fileID: 0}
  m_GameObject: {fileID: 2107427368125773461}
  m_Material: {fileID: 0}
  m_IsTrigger: 0
  m_Enabled: 1
  serializedVersion: 2
  m_Size: {x: 1.6259968, y: 0.7508693, z: 0.6470927}
  m_Center: {x: 0.0018861294, y: -0.12456536, z: 0.57408386}
