%YAML 1.1
%TAG !u! tag:unity3d.com,2011:
--- !u!114 &11400000
MonoBehaviour:
  m_ObjectHideFlags: 0
  m_CorrespondingSourceObject: {fileID: 0}
  m_PrefabInstance: {fileID: 0}
  m_PrefabAsset: {fileID: 0}
  m_GameObject: {fileID: 0}
  m_Enabled: 1
  m_EditorHideFlags: 0
  m_Script: {fileID: 11500000, guid: bbb281ee3bf0b054c82ac2347e9e782c, type: 3}
  m_Name: Localization-Assets-Shared
  m_EditorClassIdentifier: 
  m_GroupName: Localization-Assets-Shared
  m_Data:
    m_SerializedData: []
  m_GUID: 37d3acc2f5a4c3847b2ca777b8085e96
  m_SerializeEntries:
  - m_GUID: e145b3178b150a749b889238cdd1755e
    m_Address: New StringTableCollection Shared Data
    m_ReadOnly: 0
    m_SerializedLabels: []
    m_MainAsset: {fileID: 0}
    m_TargetAsset: {fileID: 0}
  - m_GUID: 1d714a519711a2749845ae57c922c52c
    m_Address: UITutorialSzenarioOne Shared Data
    m_ReadOnly: 0
    m_SerializedLabels: []
    m_MainAsset: {fileID: 0}
    m_TargetAsset: {fileID: 0}
  - m_GUID: 0f046f770c4f7024a9942826b4f09206
    m_Address: UISzenarioOne Shared Data
    m_ReadOnly: 0
    m_SerializedLabels: []
    m_MainAsset: {fileID: 0}
    m_TargetAsset: {fileID: 0}
  m_ReadOnly: 1
  m_Settings: {fileID: 11400000, guid: 0db3a3aedb3ed5c45ab384fe6143b6b3, type: 2}
  m_SchemaSet:
    m_Schemas:
    - {fileID: 11400000, guid: ba1078868c2a36844a1a01cc3d780a8a, type: 2}
    - {fileID: 11400000, guid: a32bf37397c21b24aa1c3ce14e9ff450, type: 2}
