%YAML 1.1
%TAG !u! tag:unity3d.com,2011:
--- !u!1001 &395193841309421021
PrefabInstance:
  m_ObjectHideFlags: 0
  serializedVersion: 2
  m_Modification:
    m_TransformParent: {fileID: 0}
    m_Modifications:
    - target: {fileID: 1049263442467251037, guid: 45ae1eabd003eb448a54e72ec0842ee9,
        type: 3}
      propertyPath: m_Name
      value: Head_Absaugung Variant
      objectReference: {fileID: 0}
    - target: {fileID: 6116909383242894215, guid: 45ae1eabd003eb448a54e72ec0842ee9,
        type: 3}
      propertyPath: m_LocalPosition.x
      value: 0
      objectReference: {fileID: 0}
    - target: {fileID: 6116909383242894215, guid: 45ae1eabd003eb448a54e72ec0842ee9,
        type: 3}
      propertyPath: m_LocalPosition.y
      value: 0
      objectReference: {fileID: 0}
    - target: {fileID: 6116909383242894215, guid: 45ae1eabd003eb448a54e72ec0842ee9,
        type: 3}
      propertyPath: m_LocalPosition.z
      value: 0
      objectReference: {fileID: 0}
    - target: {fileID: 6116909383242894215, guid: 45ae1eabd003eb448a54e72ec0842ee9,
        type: 3}
      propertyPath: m_LocalRotation.x
      value: -0
      objectReference: {fileID: 0}
    - target: {fileID: 6116909383242894215, guid: 45ae1eabd003eb448a54e72ec0842ee9,
        type: 3}
      propertyPath: m_LocalRotation.y
      value: -0
      objectReference: {fileID: 0}
    - target: {fileID: 6116909383242894215, guid: 45ae1eabd003eb448a54e72ec0842ee9,
        type: 3}
      propertyPath: m_LocalRotation.z
      value: -0
      objectReference: {fileID: 0}
    - target: {fileID: 6116909383242894215, guid: 45ae1eabd003eb448a54e72ec0842ee9,
        type: 3}
      propertyPath: m_LocalRotation.w
      value: 1
      objectReference: {fileID: 0}
    - target: {fileID: 6116909383242894215, guid: 45ae1eabd003eb448a54e72ec0842ee9,
        type: 3}
      propertyPath: m_RootOrder
      value: 0
      objectReference: {fileID: 0}
    - target: {fileID: 6116909383242894215, guid: 45ae1eabd003eb448a54e72ec0842ee9,
        type: 3}
      propertyPath: m_LocalEulerAnglesHint.x
      value: 0
      objectReference: {fileID: 0}
    - target: {fileID: 6116909383242894215, guid: 45ae1eabd003eb448a54e72ec0842ee9,
        type: 3}
      propertyPath: m_LocalEulerAnglesHint.y
      value: 0
      objectReference: {fileID: 0}
    - target: {fileID: 6116909383242894215, guid: 45ae1eabd003eb448a54e72ec0842ee9,
        type: 3}
      propertyPath: m_LocalEulerAnglesHint.z
      value: 0
      objectReference: {fileID: 0}
    - target: {fileID: 6116909383242894215, guid: 45ae1eabd003eb448a54e72ec0842ee9,
        type: 3}
      propertyPath: m_AnchoredPosition.x
      value: -348
      objectReference: {fileID: 0}
    - target: {fileID: 6116909383242894215, guid: 45ae1eabd003eb448a54e72ec0842ee9,
        type: 3}
      propertyPath: m_AnchoredPosition.y
      value: 136
      objectReference: {fileID: 0}
    - target: {fileID: 6116909383242894215, guid: 45ae1eabd003eb448a54e72ec0842ee9,
        type: 3}
      propertyPath: m_SizeDelta.x
      value: 200
      objectReference: {fileID: 0}
    - target: {fileID: 6116909383242894215, guid: 45ae1eabd003eb448a54e72ec0842ee9,
        type: 3}
      propertyPath: m_SizeDelta.y
      value: 50
      objectReference: {fileID: 0}
    - target: {fileID: 6116909383242894215, guid: 45ae1eabd003eb448a54e72ec0842ee9,
        type: 3}
      propertyPath: m_AnchorMin.x
      value: 0.5
      objectReference: {fileID: 0}
    - target: {fileID: 6116909383242894215, guid: 45ae1eabd003eb448a54e72ec0842ee9,
        type: 3}
      propertyPath: m_AnchorMin.y
      value: 0.5
      objectReference: {fileID: 0}
    - target: {fileID: 6116909383242894215, guid: 45ae1eabd003eb448a54e72ec0842ee9,
        type: 3}
      propertyPath: m_AnchorMax.x
      value: 0.5
      objectReference: {fileID: 0}
    - target: {fileID: 6116909383242894215, guid: 45ae1eabd003eb448a54e72ec0842ee9,
        type: 3}
      propertyPath: m_AnchorMax.y
      value: 0.5
      objectReference: {fileID: 0}
    - target: {fileID: 6116909383242894215, guid: 45ae1eabd003eb448a54e72ec0842ee9,
        type: 3}
      propertyPath: m_Pivot.x
      value: 0.5
      objectReference: {fileID: 0}
    - target: {fileID: 6116909383242894215, guid: 45ae1eabd003eb448a54e72ec0842ee9,
        type: 3}
      propertyPath: m_Pivot.y
      value: 0.5
      objectReference: {fileID: 0}
    - target: {fileID: 9007061223203348201, guid: 45ae1eabd003eb448a54e72ec0842ee9,
        type: 3}
      propertyPath: m_text
      value: Absaugung
      objectReference: {fileID: 0}
    - target: {fileID: 9007061223203348201, guid: 45ae1eabd003eb448a54e72ec0842ee9,
        type: 3}
      propertyPath: m_textInfo.characterCount
      value: 9
      objectReference: {fileID: 0}
    - target: {fileID: 9007061223203348201, guid: 45ae1eabd003eb448a54e72ec0842ee9,
        type: 3}
      propertyPath: m_textInfo.wordCount
      value: 1
      objectReference: {fileID: 0}
    - target: {fileID: 9007061223203348201, guid: 45ae1eabd003eb448a54e72ec0842ee9,
        type: 3}
      propertyPath: m_textInfo.lineCount
      value: 1
      objectReference: {fileID: 0}
    - target: {fileID: 9007061223203348201, guid: 45ae1eabd003eb448a54e72ec0842ee9,
        type: 3}
      propertyPath: m_textInfo.pageCount
      value: 1
      objectReference: {fileID: 0}
    - target: {fileID: 9007061223203348201, guid: 45ae1eabd003eb448a54e72ec0842ee9,
        type: 3}
      propertyPath: m_textInfo.spaceCount
      value: 0
      objectReference: {fileID: 0}
    - target: {fileID: 9007061223203348201, guid: 45ae1eabd003eb448a54e72ec0842ee9,
        type: 3}
      propertyPath: m_fontSize
      value: 18
      objectReference: {fileID: 0}
    - target: {fileID: 9007061223203348201, guid: 45ae1eabd003eb448a54e72ec0842ee9,
        type: 3}
      propertyPath: m_fontSizeBase
      value: 18
      objectReference: {fileID: 0}
    - target: {fileID: 9007061223203348201, guid: 45ae1eabd003eb448a54e72ec0842ee9,
        type: 3}
      propertyPath: m_fontStyle
      value: 1
      objectReference: {fileID: 0}
    m_RemovedComponents: []
  m_SourcePrefab: {fileID: 100100000, guid: 45ae1eabd003eb448a54e72ec0842ee9, type: 3}
