%YAML 1.1
%TAG !u! tag:unity3d.com,2011:
--- !u!1001 &2889374304735465440
PrefabInstance:
  m_ObjectHideFlags: 0
  serializedVersion: 2
  m_Modification:
    m_TransformParent: {fileID: 1321513893818707728}
    m_Modifications:
    - target: {fileID: 627446531281716635, guid: 269501f58219f46df95575c5bbaaff5e,
        type: 3}
      propertyPath: m_Name
      value: Liquid
      objectReference: {fileID: 0}
    - target: {fileID: 4782679790298095073, guid: 269501f58219f46df95575c5bbaaff5e,
        type: 3}
      propertyPath: _level
      value: 0.4
      objectReference: {fileID: 0}
    - target: {fileID: 4782679790298095073, guid: 269501f58219f46df95575c5bbaaff5e,
        type: 3}
      propertyPath: _deepObscurance
      value: 0.5
      objectReference: {fileID: 0}
    - target: {fileID: 4976775264239646079, guid: 269501f58219f46df95575c5bbaaff5e,
        type: 3}
      propertyPath: m_Materials.Array.data[0]
      value: 
      objectReference: {fileID: 0}
    - target: {fileID: 6882256019707206519, guid: 269501f58219f46df95575c5bbaaff5e,
        type: 3}
      propertyPath: m_RootOrder
      value: 3
      objectReference: {fileID: 0}
    - target: {fileID: 6882256019707206519, guid: 269501f58219f46df95575c5bbaaff5e,
        type: 3}
      propertyPath: m_LocalPosition.x
      value: 0
      objectReference: {fileID: 0}
    - target: {fileID: 6882256019707206519, guid: 269501f58219f46df95575c5bbaaff5e,
        type: 3}
      propertyPath: m_LocalPosition.y
      value: 0
      objectReference: {fileID: 0}
    - target: {fileID: 6882256019707206519, guid: 269501f58219f46df95575c5bbaaff5e,
        type: 3}
      propertyPath: m_LocalPosition.z
      value: 0
      objectReference: {fileID: 0}
    - target: {fileID: 6882256019707206519, guid: 269501f58219f46df95575c5bbaaff5e,
        type: 3}
      propertyPath: m_LocalRotation.w
      value: 0.7071068
      objectReference: {fileID: 0}
    - target: {fileID: 6882256019707206519, guid: 269501f58219f46df95575c5bbaaff5e,
        type: 3}
      propertyPath: m_LocalRotation.x
      value: -0.7071068
      objectReference: {fileID: 0}
    - target: {fileID: 6882256019707206519, guid: 269501f58219f46df95575c5bbaaff5e,
        type: 3}
      propertyPath: m_LocalRotation.y
      value: 0
      objectReference: {fileID: 0}
    - target: {fileID: 6882256019707206519, guid: 269501f58219f46df95575c5bbaaff5e,
        type: 3}
      propertyPath: m_LocalRotation.z
      value: 0
      objectReference: {fileID: 0}
    - target: {fileID: 6882256019707206519, guid: 269501f58219f46df95575c5bbaaff5e,
        type: 3}
      propertyPath: m_LocalEulerAnglesHint.x
      value: -90
      objectReference: {fileID: 0}
    - target: {fileID: 6882256019707206519, guid: 269501f58219f46df95575c5bbaaff5e,
        type: 3}
      propertyPath: m_LocalEulerAnglesHint.y
      value: 0
      objectReference: {fileID: 0}
    - target: {fileID: 6882256019707206519, guid: 269501f58219f46df95575c5bbaaff5e,
        type: 3}
      propertyPath: m_LocalEulerAnglesHint.z
      value: 0
      objectReference: {fileID: 0}
    m_RemovedComponents: []
  m_SourcePrefab: {fileID: 100100000, guid: 269501f58219f46df95575c5bbaaff5e, type: 3}
--- !u!1001 &5007801479449129449
PrefabInstance:
  m_ObjectHideFlags: 0
  serializedVersion: 2
  m_Modification:
    m_TransformParent: {fileID: 0}
    m_Modifications:
    - target: {fileID: 463692883922903618, guid: 7cec0d469695e47d395a969c3d35c1fe,
        type: 3}
      propertyPath: InteractableName
      value: TitrantPouring
      objectReference: {fileID: 0}
    - target: {fileID: 5451183492081939897, guid: 7cec0d469695e47d395a969c3d35c1fe,
        type: 3}
      propertyPath: m_Name
      value: Titrant 1 Variant
      objectReference: {fileID: 0}
    - target: {fileID: 5451183492081939897, guid: 7cec0d469695e47d395a969c3d35c1fe,
        type: 3}
      propertyPath: m_IsActive
      value: 1
      objectReference: {fileID: 0}
    - target: {fileID: 5616670332668357662, guid: 7cec0d469695e47d395a969c3d35c1fe,
        type: 3}
      propertyPath: m_RootOrder
      value: 0
      objectReference: {fileID: 0}
    - target: {fileID: 5616670332668357662, guid: 7cec0d469695e47d395a969c3d35c1fe,
        type: 3}
      propertyPath: m_LocalPosition.x
      value: 0.191
      objectReference: {fileID: 0}
    - target: {fileID: 5616670332668357662, guid: 7cec0d469695e47d395a969c3d35c1fe,
        type: 3}
      propertyPath: m_LocalPosition.y
      value: 0.005
      objectReference: {fileID: 0}
    - target: {fileID: 5616670332668357662, guid: 7cec0d469695e47d395a969c3d35c1fe,
        type: 3}
      propertyPath: m_LocalPosition.z
      value: -0.321
      objectReference: {fileID: 0}
    - target: {fileID: 5616670332668357662, guid: 7cec0d469695e47d395a969c3d35c1fe,
        type: 3}
      propertyPath: m_LocalRotation.w
      value: 1
      objectReference: {fileID: 0}
    - target: {fileID: 5616670332668357662, guid: 7cec0d469695e47d395a969c3d35c1fe,
        type: 3}
      propertyPath: m_LocalRotation.x
      value: 0
      objectReference: {fileID: 0}
    - target: {fileID: 5616670332668357662, guid: 7cec0d469695e47d395a969c3d35c1fe,
        type: 3}
      propertyPath: m_LocalRotation.y
      value: 0
      objectReference: {fileID: 0}
    - target: {fileID: 5616670332668357662, guid: 7cec0d469695e47d395a969c3d35c1fe,
        type: 3}
      propertyPath: m_LocalRotation.z
      value: 0
      objectReference: {fileID: 0}
    - target: {fileID: 5616670332668357662, guid: 7cec0d469695e47d395a969c3d35c1fe,
        type: 3}
      propertyPath: m_LocalEulerAnglesHint.x
      value: 0
      objectReference: {fileID: 0}
    - target: {fileID: 5616670332668357662, guid: 7cec0d469695e47d395a969c3d35c1fe,
        type: 3}
      propertyPath: m_LocalEulerAnglesHint.y
      value: 0
      objectReference: {fileID: 0}
    - target: {fileID: 5616670332668357662, guid: 7cec0d469695e47d395a969c3d35c1fe,
        type: 3}
      propertyPath: m_LocalEulerAnglesHint.z
      value: 0
      objectReference: {fileID: 0}
    - target: {fileID: 6299833690915655399, guid: 7cec0d469695e47d395a969c3d35c1fe,
        type: 3}
      propertyPath: m_Materials.Array.data[0]
      value: 
      objectReference: {fileID: 2100000, guid: 2eb27566445de9942b1a8ff9d6cc0a5a, type: 2}
    - target: {fileID: 8810526707351095575, guid: 7cec0d469695e47d395a969c3d35c1fe,
        type: 3}
      propertyPath: combineString
      value: 1
      objectReference: {fileID: 0}
    - target: {fileID: 8810526707351095575, guid: 7cec0d469695e47d395a969c3d35c1fe,
        type: 3}
      propertyPath: interactString
      value: 0
      objectReference: {fileID: 0}
    m_RemovedComponents:
    - {fileID: 5211170624857504995, guid: 7cec0d469695e47d395a969c3d35c1fe, type: 3}
  m_SourcePrefab: {fileID: 100100000, guid: 7cec0d469695e47d395a969c3d35c1fe, type: 3}
--- !u!4 &1321513893818707728 stripped
Transform:
  m_CorrespondingSourceObject: {fileID: 6280759013490761465, guid: 7cec0d469695e47d395a969c3d35c1fe,
    type: 3}
  m_PrefabInstance: {fileID: 5007801479449129449}
  m_PrefabAsset: {fileID: 0}
--- !u!1001 &5559377727375215284
PrefabInstance:
  m_ObjectHideFlags: 0
  serializedVersion: 2
  m_Modification:
    m_TransformParent: {fileID: 1321513893818707728}
    m_Modifications:
    - target: {fileID: 362946756232100448, guid: 5873e80057297425aa8c15b1c324fd5f,
        type: 3}
      propertyPath: CollisionModule.collidesWith.m_Bits
      value: 1024
      objectReference: {fileID: 0}
    - target: {fileID: 362946756232100451, guid: 5873e80057297425aa8c15b1c324fd5f,
        type: 3}
      propertyPath: m_RootOrder
      value: 2
      objectReference: {fileID: 0}
    - target: {fileID: 362946756232100451, guid: 5873e80057297425aa8c15b1c324fd5f,
        type: 3}
      propertyPath: m_LocalPosition.x
      value: -0.015
      objectReference: {fileID: 0}
    - target: {fileID: 362946756232100451, guid: 5873e80057297425aa8c15b1c324fd5f,
        type: 3}
      propertyPath: m_LocalPosition.y
      value: 0.264
      objectReference: {fileID: 0}
    - target: {fileID: 362946756232100451, guid: 5873e80057297425aa8c15b1c324fd5f,
        type: 3}
      propertyPath: m_LocalPosition.z
      value: -0
      objectReference: {fileID: 0}
    - target: {fileID: 362946756232100451, guid: 5873e80057297425aa8c15b1c324fd5f,
        type: 3}
      propertyPath: m_LocalRotation.w
      value: 0.44968417
      objectReference: {fileID: 0}
    - target: {fileID: 362946756232100451, guid: 5873e80057297425aa8c15b1c324fd5f,
        type: 3}
      propertyPath: m_LocalRotation.x
      value: -0.44968417
      objectReference: {fileID: 0}
    - target: {fileID: 362946756232100451, guid: 5873e80057297425aa8c15b1c324fd5f,
        type: 3}
      propertyPath: m_LocalRotation.y
      value: -0.545696
      objectReference: {fileID: 0}
    - target: {fileID: 362946756232100451, guid: 5873e80057297425aa8c15b1c324fd5f,
        type: 3}
      propertyPath: m_LocalRotation.z
      value: 0.5456961
      objectReference: {fileID: 0}
    - target: {fileID: 362946756232100451, guid: 5873e80057297425aa8c15b1c324fd5f,
        type: 3}
      propertyPath: m_LocalEulerAnglesHint.x
      value: 90.00001
      objectReference: {fileID: 0}
    - target: {fileID: 362946756232100451, guid: 5873e80057297425aa8c15b1c324fd5f,
        type: 3}
      propertyPath: m_LocalEulerAnglesHint.y
      value: 0
      objectReference: {fileID: 0}
    - target: {fileID: 362946756232100451, guid: 5873e80057297425aa8c15b1c324fd5f,
        type: 3}
      propertyPath: m_LocalEulerAnglesHint.z
      value: -90
      objectReference: {fileID: 0}
    - target: {fileID: 362946756232100462, guid: 5873e80057297425aa8c15b1c324fd5f,
        type: 3}
      propertyPath: m_Name
      value: Particle System Variant
      objectReference: {fileID: 0}
    - target: {fileID: 362946756232100462, guid: 5873e80057297425aa8c15b1c324fd5f,
        type: 3}
      propertyPath: m_IsActive
      value: 1
      objectReference: {fileID: 0}
    m_RemovedComponents: []
  m_SourcePrefab: {fileID: 100100000, guid: 5873e80057297425aa8c15b1c324fd5f, type: 3}
