%YAML 1.1
%TAG !u! tag:unity3d.com,2011:
--- !u!1 &5969126637836759997
GameObject:
  m_ObjectHideFlags: 0
  m_CorrespondingSourceObject: {fileID: 0}
  m_PrefabInstance: {fileID: 0}
  m_PrefabAsset: {fileID: 0}
  serializedVersion: 6
  m_Component:
  - component: {fileID: 5969126637836759999}
  - component: {fileID: 5969126637836759993}
  - component: {fileID: 5969126637836759998}
  m_Layer: 0
  m_Name: TitrationManager
  m_TagString: Untagged
  m_Icon: {fileID: 0}
  m_NavMeshLayer: 0
  m_StaticEditorFlags: 0
  m_IsActive: 1
--- !u!4 &5969126637836759999
Transform:
  m_ObjectHideFlags: 0
  m_CorrespondingSourceObject: {fileID: 0}
  m_PrefabInstance: {fileID: 0}
  m_PrefabAsset: {fileID: 0}
  m_GameObject: {fileID: 5969126637836759997}
  m_LocalRotation: {x: 0, y: 0, z: 0, w: 1}
  m_LocalPosition: {x: -0.08054894, y: 0.6643682, z: -0.24281025}
  m_LocalScale: {x: 1, y: 1, z: 1}
  m_Children: []
  m_Father: {fileID: 0}
  m_RootOrder: 0
  m_LocalEulerAnglesHint: {x: 0, y: 0, z: 0}
--- !u!114 &5969126637836759993
MonoBehaviour:
  m_ObjectHideFlags: 0
  m_CorrespondingSourceObject: {fileID: 0}
  m_PrefabInstance: {fileID: 0}
  m_PrefabAsset: {fileID: 0}
  m_GameObject: {fileID: 5969126637836759997}
  m_Enabled: 1
  m_EditorHideFlags: 0
  m_Script: {fileID: 11500000, guid: 1a897b6e72ec2416f8fbceb7082b9686, type: 3}
  m_Name: 
  m_EditorClassIdentifier: 
  cAcid: 0
  cBase: 0
  constant_Ka: 0
  constant_Kw: 0
  constant_Kb: 0
  vAcid: 0
  vBase: 0
  volumeTotal: 0
  CbVb: 0
  CaVa: 0
  mProton: 0
  logmProton: 0
  mHydroxide: 0
  logmHydroxide: 0
  mAlphaHA: 0
  logmHA: 0
  mAlphaA: 0
  logmA: 0
  VbVa: 0
  pH: 0
  pOH: 0
  phi: 0
--- !u!114 &5969126637836759998
MonoBehaviour:
  m_ObjectHideFlags: 0
  m_CorrespondingSourceObject: {fileID: 0}
  m_PrefabInstance: {fileID: 0}
  m_PrefabAsset: {fileID: 0}
  m_GameObject: {fileID: 5969126637836759997}
  m_Enabled: 1
  m_EditorHideFlags: 0
  m_Script: {fileID: 11500000, guid: c00b969cc6094499d8356e01a3e6bb92, type: 3}
  m_Name: 
  m_EditorClassIdentifier: 
  cAcid: 0
  cBase: 0
  constant_Ka: 0
  vAcid: 0
  vBase: 0
  mProton: 0
  logmProton: 0
  mHydroxide: 0
  logmHydroxide: 0
  mAlphaHA: 0
  logmHA: 0
  mAlphaA: 0
  logmA: 0
  VbVa: 0
