%YAML 1.1
%TAG !u! tag:unity3d.com,2011:
--- !u!114 &11400000
MonoBehaviour:
  m_ObjectHideFlags: 0
  m_CorrespondingSourceObject: {fileID: 0}
  m_PrefabInstance: {fileID: 0}
  m_PrefabAsset: {fileID: 0}
  m_GameObject: {fileID: 0}
  m_Enabled: 1
  m_EditorHideFlags: 0
  m_Script: {fileID: 11500000, guid: 468a46d0ae32c3544b7d98094e6448a9, type: 3}
  m_Name: AddressableAssetSettings
  m_EditorClassIdentifier: 
  m_DefaultGroup: 80976a101913fd746a63db7db84d3e9c
  m_OptimizeCatalogSize: 0
  m_BuildRemoteCatalog: 0
  m_BundleLocalCatalog: 0
  m_DisableCatalogUpdateOnStart: 0
  m_UniqueBundleIds: 0
  m_maxConcurrentWebRequests: 500
  m_ContiguousBundles: 0
  m_RemoteCatalogBuildPath:
    m_Id: 
  m_RemoteCatalogLoadPath:
    m_Id: 
  m_overridePlayerVersion: 
  m_GroupAssets:
  - {fileID: 11400000, guid: 4b1babcb2f29dbd4dbcac92f8dccc4fd, type: 2}
  - {fileID: 11400000, guid: 3a06c2c27fa1f20419b9fa17b102a4d8, type: 2}
  - {fileID: 11400000, guid: dc91e9419cde80b46a3d4240424c9b71, type: 2}
  - {fileID: 11400000, guid: db78943411b835f42b40b39df9ab98cb, type: 2}
  - {fileID: 11400000, guid: 8e55ebce2b71bd24eaa8afc9d00df0b5, type: 2}
  m_BuildSettings:
    m_CompileScriptsInVirtualMode: 0
    m_CleanupStreamingAssetsAfterBuilds: 1
    m_LogResourceManagerExceptions: 1
    m_BundleBuildPath: Temp/com.unity.addressables/AssetBundles
  m_ProfileSettings:
    m_Profiles:
    - m_InheritedParent: 
      m_Id: 1b0135ea412ba9a488bac3cdbe191709
      m_ProfileName: Default
      m_Values:
      - m_Id: 68ab547ea8f3cad468c6472a54853e2f
        m_Value: '[UnityEditor.EditorUserBuildSettings.activeBuildTarget]'
      - m_Id: 8493653c0feebce4791884d1403354de
        m_Value: '[UnityEngine.AddressableAssets.Addressables.BuildPath]/[BuildTarget]'
      - m_Id: 4534875a533fd0244a5987d7b471403e
        m_Value: '{UnityEngine.AddressableAssets.Addressables.RuntimePath}/[BuildTarget]'
      - m_Id: 6ce4f424e968ae745aca0f5698580658
        m_Value: ServerData/[BuildTarget]
      - m_Id: 89746720ba9e65740b53c1860bb5e6d2
        m_Value: http://localhost/[BuildTarget]
    m_ProfileEntryNames:
    - m_Id: 68ab547ea8f3cad468c6472a54853e2f
      m_Name: BuildTarget
      m_InlineUsage: 0
    - m_Id: 8493653c0feebce4791884d1403354de
      m_Name: LocalBuildPath
      m_InlineUsage: 0
    - m_Id: 4534875a533fd0244a5987d7b471403e
      m_Name: LocalLoadPath
      m_InlineUsage: 0
    - m_Id: 6ce4f424e968ae745aca0f5698580658
      m_Name: RemoteBuildPath
      m_InlineUsage: 0
    - m_Id: 89746720ba9e65740b53c1860bb5e6d2
      m_Name: RemoteLoadPath
      m_InlineUsage: 0
    m_ProfileVersion: 1
  m_LabelTable:
    m_LabelNames:
    - default
    - Locale
    - Locale-en
    - Locale-de
    - Preload
  m_SchemaTemplates: []
  m_GroupTemplateObjects:
  - {fileID: 11400000, guid: c16525b4019d2dd488814e84c61fb83d, type: 2}
  m_InitializationObjects: []
  m_CertificateHandlerType:
    m_AssemblyName: 
    m_ClassName: 
  m_ActivePlayerDataBuilderIndex: 3
  m_DataBuilders:
  - {fileID: 11400000, guid: a52099402d7b3fe4c8db76437f9db507, type: 2}
  - {fileID: 11400000, guid: bcb5eb0343530d249ae472776d406c98, type: 2}
  - {fileID: 11400000, guid: fc96ccfa0885d264790ba39422088f3f, type: 2}
  - {fileID: 11400000, guid: b1f74dcfe75393940b27e0fa14d9e777, type: 2}
  m_ActiveProfileId: 1b0135ea412ba9a488bac3cdbe191709
  m_HostingServicesManager:
    m_HostingServiceInfos: []
    m_Settings: {fileID: 11400000}
    m_NextInstanceId: 0
    m_RegisteredServiceTypeRefs: []
