{
    "name": "The counter",
    "description": "Count down to freedom",
    "url": "https://gitlab.com/stefan.zlatinov/the-counter",
    "uuid": "the-counter@stefan.zlatinov.gitlab.com",
    "shell-version": ["3.22"],
    "version": 1
}
