1549481004, 3.5, 4.3
1549481005, 3.6, 4.3
1549481006, 3.5, 4.1
1549481007, 3.5, 4.0
1549481008, 3.5, 3.9
1549481009, 3.4, 4.0
1549481010, 3.5, 4.0
1549481011, 3.5, 3.9
1549481012, 3.4, 3.8
1549481013, 3.4, 3.8
1549481014, 3.5, 3.9
1549481015, 3.5, 3.9
1549481016, 3.5, 3.9
1549481017, 3.5, 3.9
1549481018, 3.5, 3.9
1549481019, 3.5, 3.9
1549481020, 3.6, 4.0
1549481021, 3.5, 3.9
1549481022, 3.6, 4.0
1549481023, 3.6, 3.9
1549481024, 3.6, 3.9
1549481025, 3.6, 3.9
1549481026, 3.6, 3.9
1549481027, 3.5, 3.8
1549481028, 3.5, 3.8
1549481029, 3.4, 3.7
1549481030, 3.4, 3.7
1549481031, 3.4, 3.7
1549481032, 3.4, 3.7
1549481033, 3.4, 3.7
1549481034, 3.4, 3.7
1549481035, 3.4, 4.0
1549481036, 3.4, 4.0
1549481037, 3.4, 4.0
1549481038, 3.4, 4.0
1549481039, 3.4, 4.1
1549481040, 3.4, 4.1
1549481209, 3.6, 4.0
1549481210, 3.6, 4.0
1549481211, 3.6, 4.0
1549481212, 3.6, 4.0
1549481213, 3.6, 4.0
1549481214, 3.6, 4.0
1549481215, 3.6, 4.0
1549481216, 3.7, 4.1
1549481217, 3.7, 4.1
1549481218, 3.7, 4.1
1549481219, 3.8, 4.2
1549481220, 3.8, 4.2
1549481221, 3.7, 4.1
1549481222, 3.7, 4.1
1549481223, 3.7, 4.1
1549481224, 3.7, 4.1
1549481225, 3.7, 4.1
1549481226, 3.7, 4.1
1549481227, 3.7, 4.1
1549481228, 3.7, 4.1
1549481229, 3.7, 4.1
1549481230, 3.6, 4.0
1549481231, 3.6, 4.0
1549481232, 3.6, 4.0
1549481233, 3.6, 4.0
1549481234, 3.6, 4.0
1549481235, 3.6, 4.0
1549481291, 3.6, 4.1
1549481292, 3.6, 4.1
1549481293, 3.6, 4.1
1549481294, 3.6, 4.1
1549481295, 3.6, 4.1
1549481296, 3.6, 4.1
1549481297, 3.6, 4.2
1549481298, 3.5, 4.2
1549481299, 3.6, 4.2
1549481300, 3.6, 4.2
1549481301, 3.5, 4.2
1549481302, 3.6, 4.2
1549481303, 3.6, 4.1
1549481304, 3.6, 4.0
1549481305, 3.6, 4.0
1549481306, 3.6, 4.0
1549481307, 3.5, 3.9
1549481308, 3.6, 4.0
1549481309, 3.6, 4.0
1549481310, 3.6, 4.0
1549481311, 3.6, 4.0
1549481312, 3.6, 4.0
1549481313, 3.6, 4.4
1549481314, 3.6, 4.3
1549481315, 3.6, 4.4
1549481316, 3.6, 4.4
1549481317, 3.6, 4.3
1549481318, 3.7, 4.4
1549481319, 3.7, 4.4
1549481320, 3.6, 4.4
1549481321, 3.6, 4.4
1549481322, 3.6, 4.4
1549481323, 3.7, 4.4
1549481324, 3.7, 4.4
1549481325, 3.7, 4.5
1549481326, 3.6, 4.5
1549481327, 3.6, 4.5
1549481328, 3.6, 4.3
1549481329, 3.6, 4.4
1549481330, 3.6, 4.5
1549481331, 3.6, 4.4
1549481332, 3.6, 4.5
1549481333, 3.6, 4.6
1549481334, 3.6, 4.6
1549481335, 3.6, 4.6
1549481336, 3.5, 4.5
1549481337, 3.5, 4.6
1549481338, 3.4, 4.5
1549481339, 3.5, 4.5
1549481340, 3.5, 4.5
1549481341, 3.4, 4.5
1549481342, 3.4, 4.5
1549481343, 3.3, 3.7
1549481344, 3.4, 3.8
1549481345, 3.3, 3.8
1549481346, 3.3, 3.8
1549481347, 3.3, 3.7
1549481348, 3.2, 3.6
1549481349, 3.2, 3.6
1549481350, 3.2, 3.6
1549481351, 3.2, 3.6
1549481352, 3.2, 3.6
1549481353, 3.2, 3.7
1549481354, 3.3, 3.9
1549481355, 3.2, 3.9
1549481356, 3.3, 3.8
1549481357, 3.3, 3.9
1549481358, 3.3, 3.9
1549481359, 3.3, 3.9
1549481360, 3.3, 4.0
1549481361, 3.4, 4.0
1549481362, 3.3, 3.9
1549481363, 3.3, 3.9
1549481364, 3.2, 3.8
1549481365, 3.2, 3.8
1549481366, 3.3, 3.8
1549481367, 3.2, 3.7
1549481368, 3.3, 3.8
1549481369, 3.2, 3.7
1549481370, 3.3, 3.8
1549481371, 3.3, 3.8
1549481372, 3.3, 3.8
1549481373, 3.3, 3.9
1549481374, 3.2, 3.8
1549481375, 3.2, 3.6
1549481376, 3.2, 3.6
1549481377, 3.3, 3.7
1549481378, 3.4, 3.8
1549481379, 3.4, 4.0
1549481380, 3.4, 4.0
1549481381, 3.4, 4.0
1549481382, 3.4, 4.1
1549481383, 3.3, 4.0
1549481384, 3.3, 3.9
1549481385, 3.4, 3.8
1549481386, 3.3, 3.8
1549481387, 3.3, 3.7
1549481388, 3.3, 3.8
1549481389, 3.3, 3.8
1549481390, 3.3, 3.7
1549481391, 3.3, 3.7
1549481392, 3.3, 3.7
1549481393, 3.4, 3.8
1549481394, 3.4, 3.8
1549481395, 3.4, 3.8
1549481396, 3.4, 3.8
1549481397, 3.5, 3.9
1549481398, 3.4, 3.9
1549481399, 3.5, 3.9
1549481400, 3.4, 3.8
1549481401, 3.4, 3.8
1549481402, 3.5, 3.9
1549481403, 3.5, 3.9
1549481404, 3.5, 3.9
1549481405, 3.6, 4.0
1549481406, 3.6, 4.1
1549481407, 3.6, 4.5
1549481408, 3.5, 4.4
1549481409, 3.5, 4.3
1549481410, 3.5, 4.3
1549481411, 3.6, 4.3
1549481412, 3.5, 4.1
1549481413, 3.6, 4.1
1549481414, 3.6, 4.1
1549481415, 3.6, 4.2
1549481416, 3.7, 4.3
1549481417, 3.6, 4.2
1549481418, 3.6, 4.2
1549481419, 3.6, 4.2
1549481420, 3.6, 4.2
1549481421, 3.6, 4.2
1549481422, 3.6, 4.3
1549481423, 3.6, 4.3
1549481424, 3.5, 4.3
1549481425, 3.5, 4.3
1549481426, 3.6, 4.2
1549481427, 3.5, 4.0
1549481428, 3.6, 4.1
1549481429, 3.6, 4.2
1549481430, 3.6, 4.2
1549481431, 3.6, 4.3
1549481432, 3.6, 4.2
1549481433, 3.6, 4.2
1549481434, 3.6, 4.3
1549481435, 3.5, 4.0
1549481436, 3.5, 4.1
1549481437, 3.5, 3.9
1549481438, 3.5, 3.9
1549481439, 3.5, 3.9
1549481440, 3.5, 3.9
1549481441, 3.4, 3.9
1549481442, 3.5, 4.0
1549481443, 3.4, 4.0
1549481444, 3.4, 4.0
1549481445, 3.4, 4.0
1549481446, 3.4, 4.0
1549481447, 3.4, 4.0
1549481448, 3.4, 4.0
1549481449, 3.5, 4.0
1549481450, 3.5, 4.1
1549481451, 3.5, 4.2
1549481452, 3.5, 4.0
1549481453, 3.5, 4.0
1549481454, 3.5, 4.0
1549481455, 3.5, 4.0
1549481456, 3.5, 4.0
1549481457, 3.6, 4.1
1549481458, 3.5, 4.0
1549481459, 3.5, 4.0
1549481460, 3.6, 4.0
1549481461, 3.5, 3.9
1549481462, 3.5, 3.9
1549481463, 3.5, 3.9
1549481464, 3.5, 3.9
1549481465, 3.5, 4.0
1549481466, 3.6, 4.0
1549481467, 3.6, 4.0
1549481468, 3.5, 3.9
1549481469, 3.6, 4.0
1549481470, 3.6, 4.0
1549481471, 3.6, 4.0
1549481472, 3.6, 4.0
1549481473, 3.6, 4.0
1549481474, 3.7, 4.1
1549481475, 3.7, 4.1
1549481476, 3.7, 4.1
1549481477, 3.7, 4.1
1549481478, 3.6, 4.0
1549481479, 3.6, 4.0
1549481480, 3.6, 4.0
1549481481, 3.5, 3.8
1549481482, 3.6, 3.9
1549481483, 3.6, 4.0
1549481484, 3.6, 4.0
1549481485, 3.6, 4.0
1549481486, 3.6, 4.0
1549481487, 3.6, 4.0
1549481488, 3.6, 4.0
1549481489, 3.6, 4.0
1549481490, 3.6, 4.0
1549481491, 3.6, 4.0
1549481492, 3.6, 4.0
1549481493, 3.5, 3.9
1549481494, 3.5, 3.9
1549481495, 3.5, 3.9
1549481496, 3.4, 3.7
1549481497, 3.4, 3.8
1549481498, 3.4, 3.8
1549481499, 3.4, 3.8
1549481500, 3.3, 3.7
1549481501, 3.3, 3.7
1549481502, 3.4, 3.8
1549481503, 3.4, 3.8
1549481504, 3.4, 3.8
1549481505, 3.3, 3.7
1549481506, 3.3, 3.7
1549481507, 3.3, 3.8
1549481508, 3.3, 3.9
1549481509, 3.3, 3.8
1549481510, 3.3, 3.8
1549481511, 3.3, 3.8
1549481512, 3.3, 3.8
1549481513, 3.3, 3.7
1549481514, 3.2, 3.7
1549481515, 3.2, 3.7
1549481516, 3.2, 3.6
1549481517, 3.2, 3.6
1549481518, 3.2, 3.6
1549481519, 3.2, 3.5
1549481520, 3.1, 3.4
1549481521, 3.2, 3.5
1549481522, 3.2, 3.5
1549481523, 3.2, 3.6
1549481524, 3.3, 3.7
1549481525, 3.2, 3.6
1549481526, 3.3, 3.7
1549481527, 3.4, 3.8
1549481528, 3.4, 3.7
1549481529, 3.4, 3.7
1549481530, 3.4, 3.8
1549481531, 3.4, 3.7
1549481532, 3.4, 4.3
1549481533, 3.4, 4.2
1549481534, 3.4, 4.2
1549481535, 3.4, 4.2
1549481536, 3.4, 4.0
1549481537, 3.4, 4.0
1549481538, 3.4, 4.0
1549481539, 3.5, 4.1
1549481540, 3.5, 4.1
1549481541, 3.5, 4.0
1549481542, 3.5, 4.1
1549481543, 3.5, 4.0
1549481544, 3.5, 4.1
1549481545, 3.6, 4.1
1549481546, 3.6, 4.1
1549481547, 3.6, 4.1
1549481548, 3.6, 4.2
1549481549, 3.6, 4.1
1549481550, 3.6, 4.3
1549481551, 3.6, 4.3
1549481552, 3.6, 4.4
1549481553, 3.6, 4.5
1549481554, 3.6, 4.5
1549481555, 3.6, 4.5
1549481556, 3.6, 4.4
1549481557, 3.5, 4.5
1549481558, 3.5, 4.4
1549481559, 3.5, 4.4
1549481560, 3.4, 4.3
1549481561, 3.5, 4.3
1549481562, 3.5, 3.8
1549481563, 3.4, 3.8
1549481564, 3.5, 3.9
1549481565, 3.5, 3.9
1549481566, 3.5, 3.9
1549481567, 3.5, 3.9
1549481568, 3.4, 3.8
1549481569, 3.4, 3.8
1549481570, 3.4, 3.8
1549481571, 3.3, 3.7
1549481572, 3.3, 3.6
1549481573, 3.3, 3.7
1549481574, 3.3, 3.8
1549481575, 3.4, 3.8
1549481576, 3.3, 3.8
1549481577, 3.3, 4.0
1549481578, 3.3, 3.9
1549481579, 3.3, 4.0
1549481580, 3.3, 3.8
1549481581, 3.3, 3.9
1549481582, 3.3, 3.8
1549481583, 3.3, 3.7
1549481584, 3.3, 3.7
1549481585, 3.3, 3.7
1549481586, 3.3, 3.7
1549481587, 3.3, 3.7
1549481588, 3.3, 3.7
1549481589, 3.4, 3.8
1549481590, 3.4, 3.8
1549481591, 3.4, 3.8
1549481592, 3.4, 3.8
1549481593, 3.4, 3.8
1549481594, 3.4, 3.8
1549481595, 3.3, 3.7
1549481596, 3.3, 3.7
1549481597, 3.3, 3.8
1549481598, 3.3, 3.9
1549481599, 3.3, 3.8
1549481600, 3.3, 3.9
1549481601, 3.4, 4.0
1549481602, 3.4, 4.0
1549481603, 3.4, 4.0
1549481604, 3.4, 3.9
1549481605, 3.3, 3.9
1549481606, 3.3, 3.8
1549481607, 3.3, 3.7
1549481608, 3.4, 3.8
1549481609, 3.3, 3.8
1549481610, 3.4, 3.9
1549481611, 3.4, 3.8
1549481612, 3.4, 3.8
1549481613, 3.5, 3.9
1549481614, 3.5, 3.9
1549481615, 3.4, 3.9
1549481616, 3.4, 4.0
1549481617, 3.5, 4.0
1549481618, 3.5, 4.0
1549481619, 3.5, 4.0
1549481620, 3.5, 4.1
1549481621, 3.5, 4.1
1549481622, 3.4, 4.1
1549481623, 3.4, 4.0
1549481624, 3.4, 4.0
1549481625, 3.4, 4.0
1549481626, 3.4, 4.0
1550343255, 10.4, 13.0
1550343257, 10.3, 13.1
1550343258, 10.4, 12.2
1550343259, 10.4, 12.3
1550343260, 10.4, 12.3
1550343261, 10.3, 12.4
1550343262, 10.3, 12.4
1550343263, 10.5, 12.7
1550343264, 10.5, 13.0
1550343265, 10.5, 12.9
1550343266, 10.6, 13.3
1550343267, 10.5, 13.1
1550343268, 10.5, 13.0
1550343269, 10.4, 13.0
1550343270, 10.5, 13.0
1550343271, 10.4, 13.3
1550343272, 10.4, 14.3
1550343273, 10.4, 14.4
1550343274, 10.4, 14.3
1550343275, 10.5, 14.5
1550343276, 10.5, 14.9
1550343277, 10.6, 14.8
1550343278, 10.5, 14.7
1550343279, 10.5, 14.7
1550343280, 10.4, 14.6
1550343281, 10.5, 14.8
1550343282, 10.5, 14.9
1550343283, 10.5, 15.0
1550343284, 10.4, 14.7
1550343285, 10.4, 14.7
1550343286, 10.4, 14.6
1550343287, 10.4, 14.5
1550343288, 10.4, 14.6
1550343289, 10.4, 14.7
1550343290, 10.5, 14.9
1550343291, 10.5, 14.8
1550343292, 10.6, 15.1
1550343293, 10.5, 14.9
1550343294, 10.6, 14.8
1550343295, 10.6, 15.0
1550343296, 10.5, 14.5
1550343297, 10.6, 14.7
1550343298, 10.6, 14.9
1550343299, 10.7, 14.9
1550343300, 10.7, 15.0
1550343301, 10.7, 15.0
1550343302, 10.7, 14.1
1550343303, 10.8, 14.1
1550343304, 10.8, 14.1
1550343305, 10.8, 14.0
1550343306, 10.9, 13.7
1550343307, 10.8, 13.8
1550343308, 10.8, 14.0
1550343309, 10.9, 14.1
1550343310, 10.9, 14.2
1550343311, 10.9, 14.2
1550343312, 10.9, 14.0
1550343313, 10.9, 13.9
1550343314, 11.1, 14.2
1550343315, 11.1, 14.0
1550343316, 11.1, 14.1
1550343317, 11.1, 14.1
1550343318, 11.2, 14.1
1550343319, 11.2, 14.0
1550343320, 11.2, 13.9
1550343321, 11.2, 14.2
1550343322, 11.2, 14.0
1550343323, 11.1, 13.9
1550343324, 11.1, 13.7
1550343325, 11.1, 13.6
1550343326, 11.2, 13.7
1550343327, 11.2, 13.6
1550343328, 11.2, 13.5
1550343329, 11.2, 13.4
1550343330, 11.1, 13.3
1550343331, 11.1, 13.0
1550343332, 11.1, 12.9
1550343333, 11.1, 13.1
1550343334, 11.0, 13.1
1550343335, 11.1, 13.1
1550343336, 11.0, 13.2
1550343337, 11.2, 13.1
1550343338, 11.1, 12.9
1550343339, 11.1, 13.3
1550343340, 11.1, 13.3
1550343341, 11.1, 14.3
1550343342, 11.1, 14.2
1550343343, 11.0, 14.2
1550343344, 10.9, 14.3
1550343345, 10.9, 14.2
1550343346, 10.9, 14.3
1550343347, 11.0, 14.4
1550343348, 11.0, 14.3
1550343349, 10.9, 14.2
1550343350, 10.9, 14.1
1550343351, 10.9, 14.1
1550343352, 10.8, 14.0
1550343353, 11.0, 14.2
1550343354, 10.9, 14.2
1550343355, 10.9, 14.4
1550343356, 10.8, 14.2
1550343357, 10.9, 14.2
1550343358, 10.8, 14.1
1550343359, 10.8, 14.2
1550343360, 10.7, 14.4
1550343361, 10.7, 14.4
1550343362, 10.7, 14.5
1550343363, 10.7, 14.3
1550343364, 10.8, 14.4
1550343365, 10.7, 14.7
1550343366, 10.6, 14.4
1550343367, 10.6, 14.5
1550343368, 10.6, 14.5
1550343369, 10.7, 14.2
1550343370, 10.6, 14.1
1550343371, 10.6, 13.1
1550343372, 10.6, 13.2
1550343373, 10.7, 13.4
1550343374, 10.8, 13.2
1550343375, 10.8, 13.3
1550343376, 10.7, 13.3
1550343377, 10.6, 13.2
1550343378, 10.5, 13.1
1550343379, 10.5, 13.0
1550343380, 10.4, 13.1
1550343381, 10.5, 13.0
1550343382, 10.6, 14.6
1550343383, 10.5, 14.5
1550343384, 10.7, 14.7
1550343385, 10.7, 15.8
1550343386, 10.7, 16.8
1550343387, 10.8, 17.1
1550343388, 10.8, 18.9
1550343389, 10.9, 19.3
1550343390, 10.9, 18.9
1550343391, 11.0, 18.9
1550343392, 10.9, 18.9
1550343393, 10.9, 18.9
1550343394, 10.9, 18.8
1550343395, 10.9, 18.6
1550343396, 11.0, 18.7
1550343397, 10.9, 18.7
1550343398, 10.9, 18.7
1550343399, 10.8, 18.8
1550343400, 10.9, 19.3
1550343401, 10.8, 19.2
1550343402, 10.9, 19.2
1550343403, 10.7, 19.0
1550343404, 10.7, 19.0
1550343405, 10.6, 19.0
1550343406, 10.7, 19.2
1550343407, 10.7, 19.1
1550343408, 10.8, 19.3
1550343409, 10.8, 19.5
1550343410, 10.8, 19.5
1550343411, 10.7, 20.0
1550343412, 10.7, 18.5
1550343413, 10.7, 18.4
1550343414, 10.7, 18.2
1550343415, 10.6, 17.0
1550343416, 10.6, 15.9
1550343417, 10.5, 15.6
1550343418, 10.5, 13.9
1550343419, 10.5, 13.5
1550343420, 10.5, 13.5
1550343421, 10.5, 13.5
1550343422, 10.6, 13.5
1550343423, 10.5, 13.4
1550343424, 10.5, 13.6
1550343425, 10.6, 14.0
1550343426, 10.5, 13.7
1550343427, 10.5, 13.8
1550343428, 10.5, 13.8
1550343429, 10.4, 13.5
1550343430, 10.4, 13.1
1550343431, 10.5, 13.0
1550343432, 10.4, 12.9
1550343433, 10.5, 13.2
1550343434, 10.4, 13.0
1550343435, 10.4, 13.0
1550343436, 10.4, 12.8
1550343437, 10.4, 13.0
1550343438, 10.3, 12.8
1550343439, 10.3, 12.7
1550343440, 10.4, 12.8
1550343441, 10.4, 12.4
1550343442, 10.4, 12.6
1550343443, 10.4, 12.6
1550343444, 10.3, 12.6
1550343445, 10.4, 12.7
1550343446, 10.3, 12.7
1550343447, 10.3, 12.8
1550343448, 10.3, 12.8
1550343449, 10.3, 12.8
1550343450, 10.2, 12.8
1550343451, 10.2, 12.8
1550343452, 10.2, 12.7
1550343453, 10.1, 12.6
1550343454, 10.2, 12.6
1550343455, 10.2, 12.3
1550343456, 10.3, 12.5
1550343457, 10.3, 12.3
1550343458, 10.3, 12.2
1550343459, 10.4, 12.2
1550343460, 10.4, 12.1
1550343461, 10.5, 12.4
1550343462, 10.5, 12.4
1550343463, 10.5, 12.3
1550343464, 10.7, 12.7
1550343465, 10.8, 12.8
1550343466, 10.9, 13.0
1550343467, 11.0, 12.9
1550343468, 11.1, 13.4
1550343469, 11.0, 13.2
1550343470, 11.1, 13.3
1550343471, 11.1, 13.4
1550343472, 11.0, 13.4
1550343473, 11.1, 13.6
1550343474, 11.1, 13.6
1550343475, 11.2, 13.8
1550343478, 11.2, 13.8
1550343479, 11.3, 13.9
1550343480, 11.3, 14.0
1550343481, 11.4, 14.0
1550343482, 11.5, 14.1
1550343483, 11.5, 14.1
1550343484, 11.4, 14.3
1550343485, 11.6, 14.6
1550343486, 11.6, 14.8
1550343487, 11.5, 14.8
1550343488, 11.5, 15.0
1550343489, 11.5, 15.0
1550343490, 11.5, 15.1
1550343491, 11.5, 15.1
1550343492, 11.5, 15.6
1550343493, 11.5, 15.5
1550343494, 11.5, 15.7
1550343495, 11.5, 15.6
1550343496, 11.3, 15.8
1550343497, 11.2, 15.6
1550343498, 11.1, 15.4
1550343499, 11.1, 15.6
1550343500, 11.1, 15.4
1550343501, 11.2, 15.8
1550343502, 11.1, 15.6
1550343503, 11.0, 15.4
1550343504, 11.0, 15.3
1550343505, 11.1, 15.3
1550343506, 11.1, 16.0
1550343507, 11.0, 17.1
1550343508, 11.0, 17.9
1550343509, 10.9, 17.8
1550343510, 10.9, 17.8
1550343511, 10.8, 17.7
1550343512, 10.9, 17.7
1550343513, 10.8, 17.6
1550343514, 11.0, 17.8
1550343515, 10.9, 17.8
1550343516, 10.8, 17.9
1550343517, 10.7, 17.8
1550343518, 10.7, 17.4
1550343519, 10.7, 17.4
1550343520, 10.7, 17.3
1550343521, 10.6, 17.5
1550343522, 10.6, 17.1
1550343523, 10.6, 16.9
1550343524, 10.6, 17.5
1550343525, 10.6, 17.9
1550343526, 10.6, 17.4
1550343527, 10.6, 17.3
1550343528, 10.6, 17.3
1550343529, 10.6, 17.0
1550343530, 10.5, 17.1
1550343531, 10.5, 16.9
1550343532, 10.6, 18.2
1550343533, 10.6, 18.4
1550343534, 10.5, 18.3
1550343535, 10.4, 18.2
1550343536, 10.5, 17.4
1550343537, 10.5, 16.1
1550343538, 10.5, 15.4
1550343539, 10.7, 15.6
1550343540, 10.7, 15.6
1550343541, 10.7, 15.6
1550343542, 10.7, 15.5
1550343543, 10.7, 15.6
1550343544, 10.5, 15.2
1550343545, 10.5, 15.2
1550343546, 10.5, 14.9
1550343547, 10.6, 14.9
1550343548, 10.6, 15.1
1550343549, 10.6, 15.1
1550343550, 10.6, 15.2
1550343551, 10.7, 15.4
1550343552, 10.7, 15.6
1550343553, 10.8, 15.8
1550343554, 10.8, 15.4
1550343555, 10.9, 15.7
1550343556, 10.8, 16.5
1550343557, 10.8, 16.7
1550343558, 10.8, 16.7
1550343559, 10.9, 16.7
1550343560, 10.8, 16.7
1550343561, 10.8, 16.7
1550343562, 10.7, 16.1
1550343563, 10.8, 15.7
1550343564, 10.8, 16.6
1550343565, 10.7, 16.7
1550343566, 10.8, 16.8
1550343567, 10.8, 16.9
1550343568, 10.8, 16.8
1550343569, 10.7, 16.7
1550343572, 10.7, 17.1
1550343573, 10.8, 17.1
1550343574, 10.8, 17.1
1550343575, 10.7, 17.0
1550343576, 10.8, 17.2
1550343577, 10.8, 17.5
1550343578, 10.8, 17.3
1550343579, 10.9, 17.4
1550343580, 11.0, 17.4
1550343581, 11.0, 17.3
1550343582, 10.8, 17.2
1550343583, 10.8, 17.3
1550343584, 10.9, 17.1
1550343585, 10.8, 17.0
1550343586, 10.7, 16.7
1550343587, 10.6, 15.9
1550343588, 10.7, 15.2
1550343589, 10.7, 15.1
1550343590, 10.8, 16.2
1550343591, 10.7, 16.5
1550343592, 10.8, 16.5
1550343593, 10.9, 16.5
1550343596, 10.8, 16.2
1550343597, 11.0, 16.5
1550343598, 11.0, 15.6
1550343599, 11.0, 15.6
1550343600, 11.0, 15.4
1550343601, 11.1, 15.5
1550343602, 11.2, 15.5
1550343603, 11.1, 15.3
1550343604, 11.0, 15.1
1550343605, 11.0, 15.0
1550343606, 11.1, 15.2
1550343607, 11.1, 16.0
1550343608, 11.1, 15.7
1550343609, 11.1, 15.4
1550343610, 11.1, 15.4
1550343611, 11.1, 15.6
1550343612, 11.0, 15.6
1550343613, 11.0, 15.6
1550343614, 11.0, 15.7
1550343615, 11.1, 15.4
1550343616, 11.1, 16.4
1550343617, 11.1, 16.3
1550343618, 11.1, 16.2
1550343619, 11.2, 16.4
1550343620, 11.2, 16.5
1550343621, 11.2, 16.6
1550343622, 11.2, 15.8
1550343623, 11.2, 15.6
1550343624, 11.1, 15.3
1550343625, 11.2, 15.4
1550343626, 11.1, 15.1
1550343628, 11.0, 14.9
1550343629, 11.0, 15.6
1550343630, 11.0, 15.5
1550343631, 10.9, 15.6
1550343632, 10.9, 15.8
1550343633, 10.8, 15.6
1550343634, 10.8, 16.7
1550343635, 10.8, 16.5
1550343636, 10.9, 17.0
1550343637, 10.8, 16.8
1550343638, 10.9, 16.4
1550343639, 10.9, 16.6
1550343640, 10.9, 16.5
1550343641, 10.9, 16.6
1550343642, 10.9, 16.7
1550343643, 10.9, 16.8
1550343644, 11.0, 17.0
1550343645, 11.0, 16.8
1550343646, 11.0, 17.0
1550343647, 10.9, 15.9
1550343648, 10.8, 16.0
1550343649, 10.8, 16.1
1550343650, 10.8, 15.9
1550343651, 10.7, 15.9
1550343652, 10.8, 15.8
1550343653, 10.8, 15.7
1550343654, 10.7, 15.6
1550343655, 10.8, 15.8
1550343656, 10.7, 15.6
1550343657, 10.7, 15.4
1550343658, 10.9, 15.6
1550343659, 10.8, 14.9
1550343660, 10.7, 14.7
1550343661, 10.8, 14.8
1550343662, 10.7, 14.5
1550343663, 10.7, 15.8
1550343664, 10.8, 15.1
1550343665, 10.8, 15.4
1550343666, 10.8, 15.0
1550343667, 10.8, 15.1
1550343668, 10.8, 14.8
1550343669, 10.8, 14.8
1550343670, 10.8, 14.7
1550343671, 11.0, 15.1
1550343672, 11.0, 14.7
1550343673, 11.0, 14.5
1550343674, 10.9, 14.3
1550343675, 10.9, 14.4
1550343676, 10.8, 14.2
1550343677, 10.8, 14.2
1550343678, 10.9, 14.1
1550343679, 10.9, 14.1
1550343680, 11.0, 14.4
1550343681, 11.1, 14.4
1550343682, 11.0, 14.3
1550343683, 11.0, 14.2
1550343684, 11.0, 14.3
1550343685, 11.0, 14.2
1550343686, 11.0, 14.3
1550343687, 11.2, 14.6
1550343688, 11.0, 14.5
1550343689, 11.2, 14.9
1550343690, 11.3, 15.9
1550343691, 11.3, 15.8
1550343692, 11.3, 15.8
1550343693, 11.4, 15.1
1550343694, 11.3, 14.6
1550343695, 11.3, 14.5
1550343696, 11.2, 14.5
1550343697, 11.3, 14.8
1550343698, 11.2, 14.8
1550343699, 11.2, 14.8
1550343700, 11.3, 15.1
1550343701, 11.1, 14.7
1550343702, 11.1, 14.6
1550343703, 11.2, 15.5
1550343704, 11.2, 16.3
1550343705, 11.3, 16.2
1550485104, 36.4, 54.4
1550485105, 36.3, 53.7
1550485106, 36.5, 53.8
1550485107, 36.5, 53.6
1550485108, 36.6, 53.7
1550485109, 36.6, 54.6
1550485110, 36.5, 54.1
1550485111, 36.5, 54.0
1550485112, 36.6, 54.2
1550485113, 36.4, 54.0
1550485114, 36.4, 53.8
1550485115, 36.4, 52.7
1550485116, 36.2, 52.6
1550485117, 36.1, 51.7
1550485118, 35.9, 49.9
1550485119, 35.7, 49.6
1550485120, 35.7, 48.9
1550485121, 35.5, 49.5
1550485122, 35.6, 49.2
1550485123, 35.9, 49.7
1550485124, 35.9, 50.2
1550485125, 35.7, 50.0
1550485126, 35.8, 50.4
1550485127, 35.6, 49.9
1550485128, 35.6, 49.9
1550485129, 35.4, 49.1
1550485130, 35.4, 49.1
1550485131, 35.3, 48.2
1550485132, 35.5, 47.2
1550485133, 35.3, 47.7
1550485134, 35.5, 47.9
1550485135, 35.6, 48.6
1550485136, 35.6, 49.0
1550485137, 35.3, 48.7
1550485138, 35.3, 48.9
1550485139, 36.4, 69.3
1550485140, 37.6, 94.1
1550485141, 37.9, 99.0
1550485142, 37.7, 98.7
1550485143, 37.9, 99.2
1550485144, 38.1, 100.0
1550485145, 38.2, 100.1
1550485146, 38.5, 100.2
1550485147, 38.5, 100.0
1550485148, 38.6, 100.7
1550485149, 38.7, 101.0
1550485150, 38.5, 101.2
1550485151, 38.7, 100.8
1550485152, 38.8, 101.8
1550485153, 38.5, 101.3
1550485154, 38.5, 101.6
1550485155, 38.6, 102.3
1550485156, 38.8, 102.3
1550485157, 39.0, 102.5
1550485158, 39.1, 103.9
1550485159, 39.1, 104.4
1550485160, 39.0, 105.7
1550485161, 39.3, 106.4
1550485162, 39.1, 106.1
1550485163, 39.4, 105.8
1550485164, 39.4, 106.2
1550485165, 39.3, 105.7
1550485166, 39.3, 105.5
1550485167, 39.4, 105.9
1550485168, 39.6, 105.8
1550485169, 38.5, 85.1
1550485170, 37.2, 60.3
1550485171, 36.8, 55.7
1550485172, 36.9, 55.7
1550485173, 36.8, 55.4
1550485174, 36.6, 55.9
1550485175, 36.4, 56.2
1550485176, 36.2, 55.9
1550485177, 36.2, 56.1
1550485178, 36.1, 55.5
1550485179, 36.2, 55.7
1550485180, 36.1, 55.2
1550485181, 36.0, 55.6
1550485182, 35.9, 54.6
1550485183, 36.0, 55.0
1550485184, 35.8, 54.0
1550485185, 36.0, 53.7
1550485186, 35.9, 53.9
1550485187, 35.7, 54.0
1550485188, 35.7, 52.8
1550485189, 35.8, 52.8
1550485190, 35.9, 51.6
1550485191, 35.8, 51.4
1550485192, 35.7, 51.1
1550485193, 35.4, 50.7
1550485194, 35.6, 50.5
1550485195, 35.7, 50.8
1550485196, 35.8, 51.0
1550485197, 35.8, 51.2
1550485198, 35.6, 51.3
1550485199, 35.5, 50.8
1550485200, 35.7, 51.2
1550485201, 35.7, 50.5
1550485202, 35.8, 51.0
1550485203, 35.9, 50.8
1550485204, 35.9, 49.7
1550485205, 35.9, 49.5
1550485206, 36.0, 49.9
1550485207, 35.8, 49.6
1550485208, 36.0, 50.5
1550485209, 35.9, 50.2
1550485210, 36.0, 50.4
1550485211, 36.0, 50.0
1550485212, 36.3, 50.1
1550485213, 36.2, 49.9
1550485214, 36.2, 50.1
1550485215, 36.1, 50.2
1550485216, 36.1, 50.1
1550485217, 36.0, 50.2
1550485218, 36.0, 50.2
1550485219, 35.7, 49.7
1550485220, 35.6, 49.6
1550485221, 35.4, 49.5
1550485222, 35.6, 50.1
1550485223, 35.6, 50.2
1550485224, 35.3, 50.0
1550485225, 35.0, 49.5
1550485226, 34.9, 49.0
1550485227, 34.8, 48.6
1550485228, 34.8, 48.3
1550485229, 34.7, 48.4
1550485230, 34.6, 47.6
1550485231, 34.5, 48.5
1550485232, 34.4, 48.3
1550485233, 34.2, 48.5
1550485234, 34.6, 49.1
1550485236, 34.6, 48.9
1550485237, 34.8, 48.5
1550485238, 34.9, 49.3
1550485239, 34.9, 48.4
1550485240, 34.9, 48.4
1550485241, 35.0, 48.6
1550485242, 35.1, 48.4
1550485243, 34.9, 48.3
1550485244, 35.0, 48.4
1550485245, 35.2, 48.7
1550485246, 35.1, 49.3
1550485247, 35.0, 48.9
1550485248, 35.1, 48.6
1550485249, 35.0, 49.5
1550485250, 35.1, 49.6
1550485251, 35.2, 50.0
1550485252, 35.3, 50.2
1550485253, 35.2, 50.0
1550485254, 35.2, 49.8
1550485255, 35.2, 49.5
1550485256, 35.4, 49.4
1550485257, 35.4, 49.5
1550485258, 35.6, 51.2
1550485259, 35.7, 51.0
1550485260, 36.0, 51.0
1550485261, 36.3, 51.3
1550485262, 36.3, 50.5
1550485263, 36.4, 50.4
1550485264, 36.2, 50.6
1550485265, 36.1, 50.2
1550485266, 36.1, 50.4
1550485267, 36.1, 50.2
1550485268, 36.1, 49.8
1550485269, 36.2, 50.5
1550485270, 36.4, 51.2
1550485271, 36.4, 51.6
1550485272, 36.3, 51.7
1550485273, 36.4, 51.8
1550485274, 36.3, 51.5
1550485275, 36.2, 51.6
1550485276, 36.3, 51.2
1550485277, 36.3, 51.1
1550485278, 36.2, 51.4
1550485279, 36.4, 50.9
1550485280, 36.5, 51.0
1550485281, 36.5, 51.1
1550485282, 36.5, 50.9
1550485283, 36.5, 50.6
1550485284, 36.7, 51.3
1550485285, 36.7, 51.2
1550485286, 36.6, 52.6
1550485287, 36.8, 53.0
1550485288, 36.6, 51.3
1550485289, 36.4, 51.2
1550485290, 36.6, 51.6
1550485291, 36.3, 51.8
1550485292, 36.3, 52.1
1550485293, 36.2, 52.1
1550485294, 36.2, 51.5
1550485295, 36.2, 51.3
1550485296, 36.1, 51.4
1550485297, 36.0, 51.4
1550485298, 36.0, 51.2
1550485299, 35.9, 50.6
1550485300, 35.7, 49.8
1550485301, 35.6, 49.4
1550485302, 35.7, 51.8
1550485303, 35.8, 52.3
1550485304, 35.8, 52.2
1550485305, 35.8, 51.8
1550485306, 35.8, 52.3
1550485307, 35.9, 53.1
1550485308, 36.0, 52.9
1550485309, 35.9, 52.6
1550485310, 36.0, 52.7
1550485311, 36.2, 52.7
1550485312, 36.0, 52.7
1550485313, 36.0, 53.6
1550485314, 36.0, 53.1
1550485315, 36.0, 53.4
1550485316, 36.0, 52.5
1550485317, 35.9, 52.2
1550485318, 35.9, 52.1
1550485319, 36.0, 52.7
1550485320, 35.9, 52.6
1550485321, 36.2, 52.6
1550485322, 36.2, 52.3
1550485323, 36.3, 52.2
1550485324, 36.3, 52.2
1550485325, 36.2, 52.3
1550485326, 36.3, 52.3
1550485327, 36.4, 53.0
1550485328, 36.4, 53.3
1550485329, 36.4, 53.4
1550485330, 36.3, 53.6
1550485331, 36.4, 54.0
1550485332, 36.2, 51.3
1550485333, 36.1, 50.9
1550485334, 35.8, 51.5
1550485335, 35.8, 51.4
1550485336, 35.7, 50.3
1550485337, 35.6, 49.6
1550485338, 35.5, 50.1
1550485339, 35.5, 50.9
1550485340, 35.2, 50.2
1550485341, 35.1, 50.7
1550485342, 35.1, 50.9
1550485343, 35.3, 50.5
1550485344, 35.3, 50.7
1550485345, 35.1, 50.6
1550485346, 35.0, 50.7
1550485347, 35.0, 50.4
1550485348, 35.1, 50.8
1550485349, 35.1, 50.9
1550485350, 34.9, 50.4
1550485351, 34.8, 51.4
1550485352, 34.8, 51.8
1550485353, 34.8, 52.1
1550485354, 35.0, 52.2
1550485355, 35.1, 52.4
1550485356, 35.2, 52.2
1550485357, 34.9, 51.6
1550485358, 34.9, 51.2
1550485359, 35.0, 51.1
1550485360, 35.1, 51.1
1550485361, 35.0, 51.1
1550485362, 35.1, 51.1
1550485363, 35.2, 51.1
1550485364, 35.2, 50.8
1550485365, 35.4, 50.9
1550485366, 35.4, 51.4
1550485367, 35.3, 51.3
1550485368, 35.4, 50.7
1550485369, 35.3, 49.3
1550485370, 35.4, 51.3
1550485371, 35.3, 50.3
1550485372, 35.3, 50.0
1550485373, 35.2, 49.5
1550485374, 35.2, 49.4
1550485375, 35.5, 49.7
1550485376, 35.6, 49.5
1550485377, 35.6, 50.0
1550485378, 35.6, 50.0
1550485379, 35.5, 49.2
1550485380, 35.5, 49.9
1550485381, 35.6, 49.0
1550485382, 35.5, 48.5
1550485383, 35.4, 48.3
1550485384, 35.3, 48.1
1550485385, 35.1, 48.5
1550485386, 34.9, 49.0
1550485387, 35.0, 49.4
1550485388, 35.1, 50.5
1550485389, 34.8, 50.1
1550485390, 34.7, 49.7
1550485391, 34.8, 49.6
1550485392, 34.8, 49.6
1550485393, 35.0, 49.8
1550485394, 35.2, 50.0
1550485395, 34.9, 49.9
1550485396, 34.9, 49.5
1550485397, 34.9, 49.7
1550485398, 34.9, 50.3
1550485399, 35.0, 50.8
1550485400, 35.0, 48.9
1550485401, 35.2, 49.0
1550485402, 35.2, 49.1
1550485403, 35.1, 49.0
1550485404, 34.9, 48.7
1550485405, 34.7, 48.1
1550485406, 34.7, 47.7
1550485407, 34.8, 47.5
1550485408, 34.7, 47.4
1550485409, 34.9, 47.7
1550485410, 34.9, 47.6
1550485411, 34.9, 47.9
1550485412, 34.9, 48.8
1550485413, 34.9, 48.6
1550485414, 34.9, 49.2
1550485415, 34.9, 48.5
1550485416, 35.0, 48.0
1550485417, 35.4, 47.8
1550485418, 35.4, 47.3
1550485419, 35.5, 47.6
1550485420, 35.6, 47.6
1550485421, 35.7, 47.7
1550485422, 35.7, 47.5
1550485423, 35.4, 47.4
1550485424, 35.2, 47.0
1550485425, 35.4, 48.2
1550485426, 35.5, 48.3
1550485427, 35.6, 48.1
1550485428, 35.5, 47.9
1550485429, 35.5, 47.7
1550485430, 35.4, 48.1
1550485431, 35.5, 48.6
1550485432, 35.5, 48.5
1550485433, 35.6, 48.6
1550485434, 35.7, 49.0
1550485435, 35.7, 49.0
1550485436, 35.7, 49.2
1550485437, 35.6, 49.0
1550485438, 35.6, 49.0
1550485439, 35.7, 49.9
1550485441, 35.9, 50.5
1550485442, 35.8, 50.2
1550485443, 35.8, 49.3
1550485444, 35.7, 49.5
1550485445, 35.9, 49.0
1550485446, 35.8, 49.0
1550485447, 35.9, 49.7
1550485448, 35.6, 49.2
1550485449, 35.4, 48.7
1550485450, 35.3, 48.4
1550485451, 35.4, 49.1
1550485452, 35.5, 49.1
1550485453, 35.6, 49.6
1550485454, 35.8, 50.1
1550485455, 36.0, 50.4
1550485456, 36.1, 49.6
1550485457, 36.1, 49.7
1550485458, 36.3, 49.7
1550485459, 36.4, 49.3
1550485460, 36.5, 49.3
1550485461, 36.8, 49.1
1550485462, 36.5, 49.6
1550485463, 36.5, 49.9
1550485464, 36.6, 50.2
1550485465, 36.6, 50.8
1550485466, 36.6, 51.2
1550485467, 36.7, 50.9
1550485468, 36.7, 51.8
1550485469, 36.5, 51.8
1550485470, 36.6, 51.7
1550485471, 36.4, 50.9
1550485472, 36.6, 52.0
1550485473, 36.7, 51.9
1550485474, 36.7, 52.0
1550485475, 36.5, 51.7
1550485476, 36.4, 51.7
1550485477, 36.3, 51.1
1550485478, 36.2, 51.7
1550485479, 36.3, 52.5
1550485480, 36.5, 52.8
1550485481, 36.2, 51.9
1550485482, 36.0, 51.6
1550485483, 35.8, 51.5
1550485484, 35.6, 51.5
1550485485, 35.5, 51.2
1550485486, 35.5, 51.2
1550485487, 35.3, 51.7
1550485488, 35.2, 51.7
1550485489, 35.1, 51.7
1550485490, 35.1, 51.9
1550485491, 34.8, 51.6
1550485492, 34.9, 50.5
1550485493, 34.9, 50.1
1550485494, 34.8, 49.8
1550485495, 34.9, 49.4
1550485496, 35.1, 49.0
1550485497, 35.0, 48.9
1550485498, 35.1, 48.5
1550485499, 35.1, 48.4
1550485500, 34.9, 47.4
1550485501, 34.8, 47.4
1550485502, 34.6, 47.4
1550485503, 34.6, 47.8
1550485504, 34.5, 47.7
1550485505, 34.7, 47.7
1550485506, 34.7, 47.8
1550485507, 34.6, 47.8
1550485508, 34.9, 47.7
1550485509, 35.0, 47.4
1550485510, 34.9, 47.7
1550485511, 35.0, 48.3
1550485512, 35.1, 49.1
1550485513, 35.1, 48.6
1550485514, 35.2, 49.1
1550485515, 35.2, 50.0
1550485516, 35.1, 50.0
1550485517, 35.1, 48.9
1550485518, 35.0, 48.6
1550485519, 34.9, 48.5
1550485520, 34.8, 48.1
1550485521, 34.8, 48.5
1550485522, 34.9, 49.0
1550485523, 35.1, 49.5
1550485524, 35.1, 50.0
1550485525, 35.0, 49.8
1550485526, 35.1, 50.9
1550485527, 35.1, 51.0
1550485528, 35.1, 50.9
1550485529, 35.3, 51.6
1550485530, 35.5, 52.1
1550485531, 35.7, 51.9
1550485532, 35.7, 50.7
1550485533, 35.6, 50.6
1550485534, 35.8, 51.0
1550485535, 35.9, 51.5
1550485536, 35.9, 51.6
1550485537, 36.0, 51.6
1550485538, 36.0, 51.1
1550485539, 35.7, 50.6
1550485540, 35.7, 50.8
1550485541, 35.6, 50.5
1550485542, 35.6, 49.6
1550485543, 35.7, 49.8
1550485544, 35.8, 49.8
1550485545, 35.8, 49.2
1550485546, 35.8, 49.0
1550485547, 35.9, 49.8
1550485548, 36.1, 50.4
1550485549, 36.1, 50.2
1550485550, 36.2, 50.5
1550485551, 36.4, 50.3
1550485552, 36.2, 50.1
1550485553, 36.1, 49.7
1550485554, 36.1, 50.3
1550485555, 36.1, 50.3
1550485556, 35.8, 49.8
1550485557, 35.9, 50.1
1550485558, 35.8, 49.7
1550485559, 35.6, 48.9
1550485560, 35.5, 48.6
1550485561, 35.4, 48.7
1550485562, 35.4, 48.8
1550485563, 35.6, 49.2
1550485564, 35.4, 49.7
1550485565, 35.5, 49.7
1550485566, 35.6, 50.2
1550485567, 35.6, 50.3
1550485568, 35.6, 50.7
1550485569, 35.7, 50.6
1550485570, 35.6, 50.2
1550485571, 35.7, 51.9
1550485572, 35.6, 51.8
1550485573, 35.7, 52.0
1550485574, 35.5, 51.0
1550485575, 35.7, 51.2
1550485576, 35.6, 51.9
1550485577, 35.4, 51.1
1550485578, 35.3, 50.8
1550485579, 35.3, 50.8
1550485580, 35.5, 50.9
1550485581, 35.3, 50.8
1550485582, 35.2, 50.5
1550485583, 35.2, 51.1
1550485584, 35.2, 50.2
1550485585, 35.0, 49.9
1550485586, 35.2, 49.7
1550485587, 35.1, 49.5
1550485588, 35.2, 49.7
1550485589, 35.4, 52.1
1550485590, 35.4, 52.0
1550485591, 35.4, 52.0
1550485592, 35.4, 51.8
1550485593, 35.0, 51.6
1550485594, 35.1, 50.5
1550485595, 34.8, 51.0
1550485596, 34.6, 50.4
1550485597, 34.6, 50.2
1550485598, 34.6, 49.8
1550485599, 34.5, 49.8
1550485600, 34.5, 50.1
1550485601, 34.5, 48.6
1550485602, 34.6, 48.8
1550485603, 34.6, 48.8
1550485604, 34.5, 49.1
1550485605, 34.2, 48.6
1550485606, 34.1, 47.8
1550485607, 34.3, 49.0
1550485608, 34.3, 49.1
1550485609, 34.4, 50.2
1550485610, 34.0, 49.6
1550485611, 34.0, 49.6
1550485612, 34.1, 49.8
1550485613, 33.9, 49.7
1550485614, 34.0, 49.9
1550485615, 34.2, 50.2
1550485616, 34.2, 50.2
1550485617, 34.2, 50.4
1550485618, 34.1, 50.5
1550485619, 34.0, 48.2
1550485620, 34.2, 48.4
1550485621, 34.2, 48.5
1550485622, 34.3, 48.8
1550485623, 34.5, 49.1
1550485624, 34.6, 49.3
1550485625, 34.8, 48.6
1550485626, 35.0, 49.5
1550485627, 34.9, 49.3
1550485628, 34.8, 49.2
1550485629, 34.9, 50.3
1550485630, 34.9, 50.0
1550485632, 34.9, 50.5
1550485633, 34.6, 50.0
1550485634, 34.5, 50.5
1550485635, 34.7, 50.1
1550485636, 34.6, 50.1
1550485637, 34.6, 50.6
1550485638, 34.6, 49.8
1550485639, 34.7, 50.3
1550485640, 34.6, 49.3
1550485641, 34.8, 49.6
1550485642, 34.7, 49.4
1550485643, 34.7, 49.2
1550485644, 34.6, 48.6
1550485645, 34.4, 49.3
1550485646, 34.4, 49.1
1550485647, 34.2, 48.8
1550485648, 34.4, 48.9
1550485649, 34.4, 48.6
1550485650, 34.4, 48.6
1550485651, 34.2, 48.2
1550485652, 34.2, 48.4
1550485653, 34.0, 48.0
1550485654, 33.9, 47.4
1550485655, 34.0, 47.8
1550485656, 33.9, 47.8
1550485657, 33.6, 46.9
1550485658, 33.8, 47.5
1550485659, 33.8, 47.3
1550485660, 33.6, 46.2
1550485661, 33.5, 45.9
1550485662, 33.6, 45.3
1550485663, 33.8, 45.4
1550485664, 33.6, 44.2
1550485665, 33.5, 44.2
1550485666, 33.7, 44.5
1550485667, 33.7, 44.8
1550485668, 33.7, 45.6
1550485669, 33.6, 45.2
1550485670, 33.7, 45.6
1550485671, 33.6, 45.4
1550485672, 33.8, 45.6
1550485673, 33.8, 46.7
1550485674, 33.9, 46.7
1550485675, 34.1, 45.9
1550485676, 34.1, 46.2
1550485677, 34.0, 45.9
1550485678, 33.8, 46.3
1550485679, 33.9, 46.5
1550485680, 33.9, 47.2
1550485681, 33.8, 48.3
1550485682, 33.9, 48.2
1550485683, 34.0, 48.5
1550485684, 33.8, 48.7
1550485685, 33.7, 48.2
1550485686, 33.6, 47.9
1550485687, 33.6, 47.7
1550485688, 33.4, 47.1
1550485689, 33.6, 47.2
1550485690, 33.9, 47.9
1550485691, 33.9, 48.2
1550485692, 33.7, 47.9
1550485693, 33.8, 48.0
1550485694, 33.8, 48.0
1550485695, 33.8, 47.9
1550485696, 33.7, 47.4
1550485697, 33.8, 46.8
1550485698, 33.8, 46.4
1550485699, 33.7, 46.8
1550485700, 33.8, 46.7
1550485701, 33.8, 47.0
1550485702, 33.7, 47.0
1550485703, 33.7, 46.8
1550485704, 34.0, 47.4
1550485705, 34.0, 47.2
1550485706, 33.9, 46.8
1550485707, 34.0, 47.9
1550485708, 34.0, 47.6
1550485709, 33.9, 47.5
1550485710, 33.7, 46.9
1550485711, 33.7, 45.9
1550485712, 33.8, 46.0
1550485713, 33.8, 46.1
1550485714, 33.8, 45.5
1550485715, 33.9, 45.9
1550485716, 34.1, 46.6
1550485717, 34.2, 46.8
1550485718, 34.4, 47.3
1550485719, 34.4, 47.8
1550485720, 34.3, 47.5
1550485721, 34.2, 47.3
1550485722, 34.2, 47.3
1550485723, 34.3, 47.5
1550485724, 34.4, 47.6
1550485725, 34.2, 47.2
1550485726, 34.3, 47.4
1550485727, 34.1, 47.2
1550485728, 33.9, 46.4
1550485729, 34.1, 45.8
1550485730, 33.9, 45.8
1550485731, 34.2, 46.1
1550485732, 34.0, 45.6
1550485733, 34.1, 45.9
1550485734, 33.7, 45.3
1550485735, 33.6, 45.8
1550485736, 33.5, 45.7
1550485737, 33.6, 44.8
1550485738, 33.7, 44.3
1550485739, 33.6, 44.1
1550485740, 33.8, 44.0
1550485741, 33.8, 43.9
1550485742, 33.7, 43.5
1550485743, 33.8, 43.5
1550485744, 33.9, 44.1
1550485745, 33.9, 43.8
1550485746, 33.8, 43.4
1550485747, 33.6, 43.2
1550485748, 33.4, 42.9
1550485749, 33.4, 43.7
1550485750, 33.3, 43.8
1550485751, 33.5, 44.0
1550485752, 33.6, 44.3
1550485753, 33.4, 44.2
1550485754, 33.4, 44.3
1550485755, 33.6, 44.7
1550485756, 33.4, 44.4
1550485757, 33.5, 44.5
1550485758, 33.6, 44.7
1550485759, 33.5, 44.4
1550485760, 33.5, 44.4
1550485761, 33.4, 44.1
1550485762, 33.7, 44.5
1550485763, 33.8, 43.8
1550485764, 33.9, 44.1
1550485765, 34.0, 43.7
1550485766, 34.3, 44.2
1550485767, 34.2, 44.4
1550485768, 34.2, 44.4
1550485769, 34.4, 44.5
1550485770, 34.4, 44.5
1550485771, 34.6, 45.6
1550485772, 34.4, 45.4
1550485773, 34.4, 46.0
1550485774, 34.4, 45.6
1550485775, 34.4, 45.6
1550485776, 34.4, 45.8
1550485777, 34.5, 46.0
1550485778, 34.7, 46.5
1550485779, 34.6, 45.3
1550485780, 34.6, 45.3
1550485781, 34.5, 46.2
1550485782, 34.6, 46.4
1550485783, 34.7, 46.5
1550485784, 34.7, 46.8
1550485785, 34.9, 46.8
1550485786, 34.9, 46.8
1550485787, 35.1, 47.0
1550485788, 34.9, 46.9
1550485789, 35.1, 47.4
1550485790, 35.0, 47.2
1550485791, 35.0, 47.2
1550485792, 34.9, 47.4
1550485793, 34.7, 47.3
1550485794, 34.8, 47.1
1550485795, 34.7, 46.8
1550485796, 34.5, 46.6
1550485797, 34.5, 47.2
1550485798, 34.5, 47.2
1550485799, 34.3, 46.9
1550485800, 34.2, 46.8
1550485801, 34.2, 45.8
1550485802, 34.3, 46.7
1550485803, 34.3, 46.5
1550485804, 34.2, 46.7
1550485805, 34.0, 46.6
1550485806, 34.0, 46.7
1550485807, 33.9, 46.3
1550485808, 33.8, 45.9
1550485809, 33.8, 45.9
1550485810, 33.8, 45.4
1550485811, 33.9, 44.6
1550485812, 33.9, 44.5
1550485813, 33.9, 44.8
1550485814, 33.9, 44.9
1550485815, 33.8, 44.7
1550485816, 33.7, 44.8
1550485817, 33.7, 44.9
1550485819, 33.7, 45.0
1550485820, 33.7, 44.9
1550485821, 33.8, 44.9
1550485822, 33.8, 45.0
1550485823, 33.8, 45.4
1550485824, 34.0, 46.0
1550485825, 33.8, 45.9
1550485826, 33.8, 46.4
1550485827, 33.7, 47.1
1550485828, 33.7, 46.3
1550485829, 33.6, 46.3
1550485830, 33.6, 47.2
1550485831, 33.5, 47.2
1550485832, 33.6, 47.6
1550485833, 33.6, 47.1
1550485834, 33.4, 47.2
1550485835, 33.2, 46.8
1550485836, 33.3, 46.8
1550485837, 33.4, 46.6
1550485838, 33.5, 47.2
1550485839, 33.7, 47.2
1550485840, 33.6, 47.0
1550485841, 33.5, 47.1
1550485842, 33.5, 47.1
1550485843, 33.5, 47.0
1550485844, 33.5, 47.6
1550485845, 33.6, 47.7
1550485846, 33.6, 48.2
1550485847, 33.7, 48.3
1550485848, 33.5, 48.1
1550485849, 33.6, 47.9
1550485850, 33.5, 47.9
1550485851, 33.5, 48.5
1550485852, 33.6, 48.4
1550485853, 33.6, 47.8
1550485854, 33.4, 47.3
1550485855, 33.5, 47.1
1550485856, 33.5, 46.9
1550485857, 33.8, 46.6
1550485858, 33.7, 46.6
1550485859, 33.6, 46.8
1550485860, 33.8, 46.4
1550485861, 33.9, 46.3
1550485862, 34.0, 46.6
1550485863, 33.8, 46.4
1550485864, 34.0, 45.8
1550485865, 34.1, 46.1
1550485866, 34.2, 46.2
1550485867, 34.0, 46.0
1550485868, 34.0, 45.4
1550485869, 33.9, 45.7
1550485870, 33.9, 45.9
1550485871, 34.1, 46.2
1550485872, 34.0, 46.1
1550485873, 34.1, 46.3
1550485874, 34.2, 45.6
1550485875, 34.0, 45.2
1550485876, 33.9, 44.8
1550485877, 34.0, 45.1
1550485878, 34.2, 46.0
1550485879, 34.3, 46.0
1550485880, 34.2, 45.7
1550485881, 34.4, 45.6
1550485882, 34.1, 45.2
1550485883, 34.1, 45.0
1550485884, 34.1, 45.6
1550485885, 34.2, 45.9
1550485886, 34.3, 45.5
1550485887, 34.0, 44.9
1550485888, 34.1, 45.1
1550485889, 34.1, 44.9
1550485890, 34.1, 44.9
1550485891, 34.0, 45.2
1550485892, 34.0, 44.9
1550485893, 34.0, 44.5
1550485894, 34.1, 46.3
1550485895, 34.3, 46.7
1550485896, 34.2, 46.5
1550485897, 34.3, 47.2
1550485898, 34.3, 47.4
1550485899, 34.3, 47.9
1550485900, 34.5, 48.0
1550485901, 34.4, 47.9
1550485902, 34.5, 48.3
1550485903, 34.3, 48.4
1550485904, 34.1, 48.0
1550485905, 34.1, 48.0
1550485906, 34.2, 47.7
1550485907, 34.0, 47.6
1550485908, 33.9, 47.2
1550485909, 33.7, 47.9
1550485910, 33.7, 47.8
1550485911, 33.5, 47.4
1550485912, 33.6, 48.0
1550485913, 33.8, 48.5
1550485914, 33.7, 47.5
1550485915, 33.4, 47.2
1550485916, 33.5, 47.8
1550485917, 33.7, 48.3
1550485918, 33.5, 47.8
1550485919, 33.6, 48.7
1550485920, 33.4, 48.7
1550485921, 33.4, 48.5
1550485922, 33.2, 48.4
1550485923, 33.3, 48.6
1550485924, 33.1, 47.2
1550485925, 33.0, 47.4
1550485926, 33.2, 47.2
1550485927, 33.2, 47.3
1550485928, 33.1, 47.0
1550485929, 33.1, 46.2
1550485930, 33.0, 45.9
1550485931, 33.0, 45.9
1550485932, 33.0, 45.7
1550485933, 33.0, 45.2
1550485934, 33.3, 45.9
1550485935, 33.3, 46.7
1550485936, 33.2, 46.6
1550485937, 33.4, 46.4
1550485938, 33.3, 46.2
1550485939, 33.4, 45.5
1550485940, 33.5, 45.9
1550485941, 33.5, 46.4
1550485942, 33.4, 46.1
1550485943, 33.4, 46.4
1550485944, 33.7, 47.3
1550485945, 33.8, 47.4
