Name,Team,Height,Pounds,Acceleration,Speed,Shot_power
E. HazardAS AT,Chelsea2012 ~ 2020,"5'8""",168lbs,94,88,82
K. De BruyneCOC CC,Manchester City2015 ~ 2023,"5'11""",154lbs,78,76,91
De GeaPOR,Manchester United2011 ~ 2020,"6'4""",168lbs,57,58,31
David SilvaCOC CC,Manchester City2010 ~ 2020,"5'8""",148lbs,70,64,72
H. KaneATT,Tottenham Hotspur2010 ~ 2024,"6'2""",196lbs,68,72,88
N. KantéCDC CC,Chelsea2016 ~ 2023,"5'6""",159lbs,82,78,71
M. SalahAD ATT,Liverpool2017 ~ 2023,"5'9""",157lbs,94,91,80
S. AgüeroATT,Manchester City2011 ~ 2021,"5'8""",154lbs,88,80,88
P. AubameyangATT ES,Arsenal2018 ~ 2021,"6'2""",176lbs,93,95,82
V. van DijkDC,Liverpool2018 ~ 2023,"6'4""",203lbs,74,77,81
P. PogbaCC COC,Manchester United2016 ~ 2021,"6'3""",185lbs,71,79,90
H. LlorisPOR,Tottenham Hotspur2012 ~ 2022,"6'2""",181lbs,65,62,23
C. EriksenCOC ED CC,Tottenham Hotspur2013 ~ 2020,"5'11""",168lbs,76,73,84
G. Higuaín LATT,Chelsea,"6'1""",196lbs,70,72,86
AlissonPOR,Liverpool2018 ~ 2024,"6'3""",201lbs,54,45,21
FernandinhoCDC,Manchester City2013 ~ 2020,"5'10""",148lbs,68,67,83
R. SterlingAD AS,Manchester City2015 ~ 2023,"5'7""",152lbs,95,92,76
J. VertonghenDC,Tottenham Hotspur2012 ~ 2020,"6'2""",190lbs,61,65,80
T. AlderweireldDC,Tottenham Hotspur2015 ~ 2020,"6'1""",179lbs,61,67,78
AzpilicuetaTD DC,Chelsea2012 ~ 2022,"5'10""",168lbs,76,76,68
Roberto FirminoAT ATT COC,Liverpool2015 ~ 2023,"5'11""",168lbs,78,77,81
S. ManéAS AD ES,Liverpool2016 ~ 2023,"5'9""",152lbs,95,93,82
EdersonPOR,Manchester City2017 ~ 2025,"6'2""",190lbs,64,63,42
Bernardo SilvaCOC CC AD ED,Manchester City2017 ~ 2022,"5'8""",141lbs,86,77,70
L. SanéAS,Manchester City2016 ~ 2021,"6'0""",165lbs,93,96,87
R. LukakuATT,Manchester United2017 ~ 2022,"6'3""",207lbs,76,89,88
H. SonES AT,Tottenham Hotspur2015 ~ 2023,"6'0""",143lbs,88,87,88
M. ÖzilCOC AD,Arsenal2013 ~ 2021,"5'11""",168lbs,73,69,70
A. LacazetteATT,Arsenal2017 ~ 2022,"5'9""",161lbs,81,84,85
FabinhoCDC,Liverpool2018 ~ 2023,"6'2""",172lbs,69,72,78
V. KompanyDC,Manchester City2008 ~ 2019,"6'3""",187lbs,50,57,73
R. MahrezAD ED,Manchester City2018 ~ 2023,"5'10""",148lbs,88,83,79
A. LaporteDC TS,Manchester City2018 ~ 2025,"6'2""",187lbs,62,66,68
D. AlliCOC,Tottenham Hotspur2015 ~ 2024,"6'2""",176lbs,73,76,78
SokratisDC,Arsenal2018 ~ 2021,"6'1""",187lbs,67,76,77
WillianAD AS,Chelsea2013 ~ 2020,"5'9""",172lbs,91,86,84
KepaPOR,Chelsea2018 ~ 2025,"6'1""",187lbs,34,33,25
I. GündoğanCC CDC,Manchester City2016 ~ 2020,"5'11""",176lbs,67,68,77
K. WalkerTD,Manchester City2017 ~ 2022,"6'0""",154lbs,86,93,86
N. OtamendiDC,Manchester City2015 ~ 2022,"6'0""",179lbs,57,61,69
A. SánchezAS ES,Manchester United2018 ~ 2022,"5'7""",137lbs,86,79,83
N. MatićCDC CC,Manchester United2017 ~ 2020,"6'4""",187lbs,52,59,83
A. MartialAS ATT ES,Manchester United2015 ~ 2024,"6'0""",168lbs,88,89,84
D. SánchezDC,Tottenham Hotspur2017 ~ 2024,"6'2""",174lbs,72,79,66
Felipe AndersonES,West Ham United2018 ~ 2022,"5'9""",154lbs,92,89,86
B. LenoPOR,Arsenal2018 ~ 2023,"6'3""",183lbs,46,52,23
David LuizDC,Chelsea2016 ~ 2019,"6'2""",190lbs,60,64,81
Marcos AlonsoTS ASA,Chelsea2016 ~ 2023,"6'2""",192lbs,69,76,84
JorginhoCC,Chelsea2018 ~ 2023,"5'11""",148lbs,70,61,71
M. Kovačić LCC,Chelsea,"5'9""",172lbs,84,74,79
I. GueyeCDC CC,Everton2016 ~ 2022,"5'9""",146lbs,76,72,80
J. PickfordPOR,Everton2017 ~ 2024,"6'1""",170lbs,53,44,31
G. WijnaldumCC CDC,Liverpool2016 ~ 2021,"5'9""",152lbs,79,76,76
A. RobertsonTS,Liverpool2017 ~ 2024,"5'10""",141lbs,83,86,67
N. KeïtaCC CDC COC,Liverpool2018 ~ 2023,"5'8""",141lbs,78,64,76
J. StonesDC,Manchester City2016 ~ 2022,"6'2""",154lbs,67,71,46
Gabriel JesusATT,Manchester City2016 ~ 2023,"5'9""",161lbs,87,85,78
M. RashfordATT AS AD,Manchester United2014 ~ 2020,"6'1""",154lbs,90,93,87
Lucas MouraED ES ATT,Tottenham Hotspur2018 ~ 2023,"5'9""",154lbs,94,90,79
K. SchmeichelPOR,Leicester City2011 ~ 2023,"6'2""",196lbs,56,60,36
Rui PatrícioPOR,Wolverhampton Wanderers2018 ~ 2022,"6'3""",185lbs,53,57,38
L. KoscielnyDC,Arsenal2010 ~ 2020,"6'1""",165lbs,65,66,54
A. RamseyCC CDC COC,Arsenal2008 ~ 2019,"6'0""",168lbs,65,69,81
S. MustafiDC,Arsenal2016 ~ 2021,"6'0""",181lbs,60,65,66
H. MkhitaryanED AD COC,Arsenal2018 ~ 2021,"5'10""",165lbs,84,78,85
L. TorreiraCDC CC,Arsenal2018 ~ 2023,"5'6""",141lbs,81,74,78
O. GiroudATT,Chelsea2018 ~ 2019,"6'4""",203lbs,43,50,85
PedroAD AS,Chelsea2015 ~ 2020,"5'7""",143lbs,79,74,77
A. RüdigerDC,Chelsea2017 ~ 2022,"6'3""",187lbs,67,78,72
G. SigurðssonCOC,Everton2017 ~ 2022,"6'1""",170lbs,58,55,83
J. HendersonCDC CC,Liverpool2011 ~ 2020,"6'0""",176lbs,67,66,77
X. ShaqiriAD ED COC,Liverpool2018 ~ 2023,"5'7""",159lbs,84,77,87
Juan MataAD ED COC,Manchester United2014 ~ 2019,"5'7""",134lbs,69,62,74
Ander HerreraCC CDC,Manchester United2014 ~ 2019,"6'0""",154lbs,75,68,75
J. LingardAD COC AT,Manchester United2010 ~ 2021,"5'9""",137lbs,84,82,80
M. ArnautovićATT,West Ham United2017 ~ 2023,"6'4""",183lbs,79,83,84
H. MaguireDC,Leicester City2017 ~ 2023,"6'4""",220lbs,39,54,68
J. VardyATT,Leicester City2012 ~ 2022,"5'10""",163lbs,89,90,85
João MoutinhoCC CDC COC,Wolverhampton Wanderers2018 ~ 2020,"5'7""",134lbs,66,59,76
W. ZahaAT ES,Crystal Palace2015 ~ 2023,"5'11""",146lbs,89,92,78
P. ČechPOR,Arsenal2015 ~ 2019,"6'5""",198lbs,35,38,21
G. XhakaCC CDC,Arsenal2016 ~ 2021,"6'1""",181lbs,47,49,90
L. DigneTS,Everton2018 ~ 2023,"5'10""",163lbs,76,75,79
J. MilnerCC TS,Liverpool2015 ~ 2020,"5'9""",154lbs,63,62,82
D. LovrenDC,Liverpool2014 ~ 2021,"6'2""",185lbs,54,55,63
B. MendyTS,Manchester City2017 ~ 2022,"6'1""",187lbs,77,86,79
L. ShawTS,Manchester United2014 ~ 2023,"5'11""",165lbs,83,85,68
V. LindelöfDC,Manchester United2017 ~ 2021,"6'2""",176lbs,74,76,68
M. AlmirónCOC,Newcastle United2019 ~ 2024,"5'9""",139lbs,90,89,78
D. RoseTS ASA,Tottenham Hotspur2007 ~ 2021,"5'9""",168lbs,79,77,68
E. LamelaED ES,Tottenham Hotspur2013 ~ 2022,"6'0""",176lbs,76,74,81
K. TrippierTD ADA,Tottenham Hotspur2015 ~ 2022,"5'10""",159lbs,76,75,75
L. FabiańskiPOR,West Ham United2018 ~ 2021,"6'3""",183lbs,50,47,14
Ricardo PereiraTD ED,Leicester City2018 ~ 2023,"5'9""",154lbs,88,87,68
W. NdidiCDC CC,Leicester City2017 ~ 2024,"6'0""",163lbs,73,73,81
Rúben NevesCC,Wolverhampton Wanderers2017 ~ 2023,"5'11""",176lbs,64,64,84
A. DoucouréCDC CC,Watford2016 ~ 2023,"6'0""",168lbs,63,69,84
Nacho MonrealTS DC,Arsenal2013 ~ 2019,"5'10""",159lbs,72,67,74
Héctor BellerínTD ADA,Arsenal2014 ~ 2023,"5'10""",163lbs,94,91,52
A. ChristensenDC,Chelsea2013 ~ 2022,"6'2""",179lbs,66,70,31
BernardES AS,Everton2018 ~ 2022,"5'5""",132lbs,94,86,76
André Gomes LCC CDC,Everton,"6'2""",185lbs,68,62,80
RicharlisonATT AS ES,Everton2018 ~ 2023,"5'11""",157lbs,83,86,80
J. MatipDC,Liverpool2016 ~ 2020,"6'4""",198lbs,55,69,66
A. Oxlade-ChamberlainCC ED,Liverpool2017 ~ 2022,"5'9""",154lbs,84,85,80
S. RomeroPOR,Manchester United2015 ~ 2021,"6'4""",192lbs,47,44,14
C. SmallingDC,Manchester United2010 ~ 2022,"6'4""",179lbs,61,74,42
FredCC,Manchester United2018 ~ 2023,"5'7""",141lbs,79,76,76
E. BaillyDC,Manchester United2016 ~ 2020,"6'1""",170lbs,75,81,55
S. AurierTD ADA,Tottenham Hotspur2017 ~ 2022,"5'9""",168lbs,79,78,71
E. DierCDC DC CC,Tottenham Hotspur2014 ~ 2021,"6'3""",198lbs,62,68,82
B. DaviesTS,Tottenham Hotspur2014 ~ 2021,"6'0""",168lbs,76,74,65
M. LanziniCOC CC ES,West Ham United2016 ~ 2020,"5'6""",130lbs,84,76,75
A. YarmolenkoED AD,West Ham United2018 ~ 2022,"6'3""",183lbs,69,76,83
F. BalbuenaDC,West Ham United2018 ~ 2021,"6'2""",187lbs,56,65,71
J. SeriCC,Fulham2018 ~ 2022,"5'7""",161lbs,75,64,76
R. PereyraES COC,Watford2016 ~ 2021,"6'0""",170lbs,75,76,68
T. HeatonPOR,Burnley2013 ~ 2020,"6'2""",203lbs,56,55,14
GuaitaPOR,Crystal Palace2018 ~ 2021,"6'3""",176lbs,51,52,45
M. Batshuayi LATT,Crystal Palace,"6'1""",172lbs,77,76,81
M. RyanPOR,Brighton & Hove Albion2017 ~ 2022,"6'0""",181lbs,53,52,35
N. AkéCB,Bournemouth2017 ~ 2022,"5'11""",165lbs,75,74,63
Denis Suárez LCM LW RW,"Arsenal","5'9""",152lbs,77,77,75
S. KolašinacLB LWB,Arsenal2017 ~ 2022,"6'0""",187lbs,70,79,82
G. CahillCB,Chelsea2012 ~ 2019,"6'4""",194lbs,38,46,63
R. BarkleyCAM CM,Chelsea2018 ~ 2023,"6'1""",192lbs,69,70,81
D. ZappacostaRB RWB,Chelsea2017 ~ 2021,"6'0""",159lbs,76,81,75
T. WalcottRM,Everton2018 ~ 2021,"5'9""",150lbs,89,89,76
S. ColemanRB,Everton2009 ~ 2022,"5'10""",170lbs,77,75,75
K. Zouma LCB,"Everton","6'3""",212lbs,60,70,63
M. KeaneCB,Everton2017 ~ 2022,"6'3""",181lbs,58,65,58
D. SturridgeST,Liverpool2013 ~ 2019,"5'11""",168lbs,72,76,82
A. LallanaCM,Liverpool2014 ~ 2021,"5'10""",161lbs,70,68,72
T. Alexander-ArnoldRB,Liverpool2015 ~ 2024,"5'11""",152lbs,82,79,75
F. DelphLB CM,Manchester City2015 ~ 2020,"5'9""",172lbs,75,72,82
DaniloRB LB,Manchester City2017 ~ 2022,"6'0""",172lbs,73,76,85
A. YoungRB LB,Manchester United2011 ~ 2020,"5'9""",143lbs,77,74,75
A. ValenciaRB,Manchester United2009 ~ 2019,"5'11""",183lbs,82,85,85
P. JonesCB,Manchester United2011 ~ 2023,"6'1""",157lbs,54,59,68
M. RojoCB,Manchester United2014 ~ 2021,"6'2""",187lbs,68,69,80
M. DúbravkaGK,Newcastle United2018 ~ 2022,"6'3""",176lbs,49,44,22
J. VestergaardCB,Southampton2018 ~ 2022,"6'6""",216lbs,35,38,83
M. SissokoCM CDM RM,Tottenham Hotspur2016 ~ 2021,"6'2""",201lbs,79,84,85
V. WanyamaCDM CM,Tottenham Hotspur2016 ~ 2021,"6'0""",192lbs,54,61,79
H. WinksCM CDM,Tottenham Hotspur2014 ~ 2023,"5'9""",163lbs,73,69,63
S. NasriCAM LM CM RM,West Ham United2019 ~ 2019,"5'9""",165lbs,77,75,74
J. HernándezST,West Ham United2017 ~ 2020,"5'9""",161lbs,77,69,75
J. WilshereCM CAM CDM,West Ham United2018 ~ 2021,"5'8""",150lbs,68,63,74
JonnyLWB,Wolverhampton Wanderers2019 ~ 2023,"5'7""",154lbs,77,78,68
L. Dendoncker LCDM CB CM,Wolverhampton Wanderers,"6'2""",194lbs,61,68,86
R. BabelLW,Fulham2019 ~ 2019,"6'1""",187lbs,83,82,85
B. FosterGK,Watford2018 ~ 2020,"6'4""",198lbs,50,48,27
E. CapoueCDM CM,Watford2015 ~ 2022,"6'3""",192lbs,57,50,77
DeulofeuCF RW RM LW,Watford2018 ~ 2023,"5'10""",161lbs,89,88,75
S. DefourCM,Burnley2016 ~ 2019,"5'9""",159lbs,67,62,76
J. GuðmundssonRM LM,Burnley2016 ~ 2021,"5'10""",170lbs,79,77,82
J. TarkowskiCB,Burnley2016 ~ 2022,"6'4""",179lbs,55,63,63
N. PopeGK,Burnley2016 ~ 2020,"6'7""",168lbs,50,47,17
M. SakhoCB,Crystal Palace2017 ~ 2021,"6'2""",183lbs,49,55,51
L. MilivojevićCDM CM,Crystal Palace2017 ~ 2020,"6'1""",176lbs,53,59,79
N. Clyne LRB,"Bournemouth","5'9""",148lbs,77,78,74
C. WilsonST,Bournemouth2014 ~ 2022,"5'11""",146lbs,87,89,76
J. LermaCDM CM,Bournemouth2018 ~ 2023,"5'10""",154lbs,74,76,82
A. IwobiLM RM LW,Arsenal2013 ~ 2023,"6'1""",165lbs,80,80,70
D. DrinkwaterCM,Chelsea2017 ~ 2022,"5'10""",179lbs,63,63,77
M. van GinkelCM,Chelsea2013 ~ 2020,"6'1""",181lbs,62,69,79
R. Loftus-CheekCM LM,Chelsea2013 ~ 2021,"6'3""",194lbs,68,74,65
M. SchneiderlinCDM CM,Everton2017 ~ 2021,"6'1""",165lbs,58,58,71
C. TosunST,Everton2018 ~ 2022,"6'0""",172lbs,71,74,83
Y. MinaCB,Everton2018 ~ 2023,"6'5""",207lbs,45,62,70
S. MignoletGK,Liverpool2013 ~ 2021,"6'4""",192lbs,50,52,45
J. GomezCB RB,Liverpool2015 ~ 2024,"6'2""",170lbs,78,83,41
C. BravoGK,Manchester City2016 ~ 2020,"6'0""",176lbs,58,54,22
J. ShelveyCM CDM,Newcastle United2016 ~ 2021,"6'0""",176lbs,63,63,85
F. LejeuneCB,Newcastle United2017 ~ 2022,"6'2""",196lbs,42,52,75
J. LascellesCB,Newcastle United2014 ~ 2024,"6'2""",196lbs,60,63,40
R. BertrandLB LWB,Southampton2015 ~ 2021,"5'10""",187lbs,77,76,59
M. LeminaCM CDM,Southampton2017 ~ 2022,"6'0""",187lbs,76,77,81
M. AntonioST RM LM,West Ham United2015 ~ 2021,"5'10""",181lbs,84,87,75
AdriánGK,West Ham United2013 ~ 2019,"6'3""",176lbs,46,44,35
J. EvansCB,Leicester City2018 ~ 2021,"6'2""",170lbs,58,58,42
Y. Tielemans LCM CDM,"Leicester City","5'9""",159lbs,52,53,88
J. MaddisonCAM LM,Leicester City2018 ~ 2023,"5'9""",161lbs,77,74,82
B. ChilwellLB,Leicester City2015 ~ 2024,"5'10""",170lbs,81,82,69
W. BolyCB,Wolverhampton Wanderers2018 ~ 2021,"6'5""",214lbs,57,69,52
R. Jiménez LST,"Wolverhampton Wanderers","6'2""",179lbs,69,76,79
Diogo JotaLW ST,Wolverhampton Wanderers2018 ~ 2021,"5'10""",161lbs,88,79,81
T. CairneyCM,Fulham2015 ~ 2023,"6'1""",185lbs,69,60,75
Sergio Rico LGK,"Fulham","6'4""",196lbs,48,46,19
A. MitrovićST,Fulham2018 ~ 2023,"6'2""",181lbs,60,66,82
J. HolebasLB,Watford2015 ~ 2020,"6'1""",179lbs,74,76,82
T. DeeneyST,Watford2010 ~ 2021,"6'0""",198lbs,54,60,86
C. KabaseleCB,Watford2016 ~ 2021,"6'2""",185lbs,66,74,57
J. HartGK,Burnley2018 ~ 2020,"6'5""",201lbs,56,60,40
B. MeeCB,Burnley2012 ~ 2019,"6'0""",181lbs,62,63,60
J. TomkinsCB,Crystal Palace2016 ~ 2021,"6'4""",163lbs,41,49,40
A. TownsendRM CF,Crystal Palace2016 ~ 2021,"5'11""",161lbs,81,79,82
M. MeyerCM LM,Crystal Palace2018 ~ 2021,"5'8""",150lbs,76,60,56
S. DuffyCB,Brighton & Hove Albion2016 ~ 2023,"6'4""",168lbs,42,47,55
D. PröpperCM,Brighton & Hove Albion2017 ~ 2021,"6'1""",174lbs,67,63,80
L. DunkCB,Brighton & Hove Albion2010 ~ 2023,"6'4""",194lbs,38,50,72
A. MooyCM CDM,Huddersfield Town2017 ~ 2020,"5'8""",159lbs,64,60,71
C. SchindlerCB,Huddersfield Town2016 ~ 2021,"6'2""",170lbs,60,65,52
A. BegovićGK,Bournemouth2017 ~ 2020,"6'6""",183lbs,52,58,28
J. KingCF ST,Bournemouth2015 ~ 2021,"6'0""",163lbs,86,91,78
S. CookCB,Bournemouth2012 ~ 2021,"6'1""",181lbs,55,53,48
R. FraserLM LW,Bournemouth2013 ~ 2020,"5'4""",154lbs,90,87,60
S. LichtsteinerRB CB RWB,Arsenal2018 ~ 2019,"6'0""",168lbs,63,67,74
D. WelbeckLW ST LM,Arsenal2014 ~ 2019,"6'1""",161lbs,76,83,78
M. ElnenyCDM CM,Arsenal2016 ~ 2022,"5'11""",163lbs,58,60,78
J. McCarthyCDM CM,Everton2013 ~ 2020,"5'11""",159lbs,60,58,67
D. OrigiST,Liverpool2014 ~ 2019,"6'2""",165lbs,76,79,79
Andreas PereiraCM CDM,Manchester United2013 ~ 2020,"5'10""",157lbs,78,74,76
M. RitchieRM LWB,Newcastle United2016 ~ 2021,"5'8""",168lbs,75,73,76
S. Rondón LST,"Newcastle United","6'1""",216lbs,69,68,85
A. McCarthyGK,Southampton2016 ~ 2022,"6'4""",174lbs,58,56,20
Oriol RomeuCDM CM,Southampton2015 ~ 2021,"6'0""",183lbs,53,48,60
M. ElyounoussiLM CAM RM,Southampton2018 ~ 2023,"5'10""",154lbs,84,78,76
J. Ward-ProwseRM CM,Southampton2011 ~ 2022,"5'8""",146lbs,66,57,74
P. HøjbjergCM CDM,Southampton2016 ~ 2021,"6'1""",185lbs,59,64,84
C. SánchezCDM CB,West Ham United2018 ~ 2020,"6'0""",181lbs,69,66,72
A. OgbonnaCB,West Ham United2015 ~ 2022,"6'3""",190lbs,59,64,68
Lucas PérezST RM,West Ham United2018 ~ 2021,"5'11""",161lbs,76,75,82
Pedro ObiangCDM CM,West Ham United2015 ~ 2022,"6'1""",165lbs,64,66,74
I. DiopCB,West Ham United2018 ~ 2023,"6'4""",203lbs,64,68,50
M. AlbrightonRM LM,Leicester City2014 ~ 2022,"5'9""",163lbs,77,73,73
M. DohertyRWB,Wolverhampton Wanderers2010 ~ 2023,"6'0""",196lbs,74,78,74
R. SaïssCDM,Wolverhampton Wanderers2016 ~ 2021,"6'3""",185lbs,62,64,64
FabricioGK,Fulham2018 ~ 2021,"6'0""",176lbs,59,54,25
A. Schürrle LRW LW,"Fulham","6'0""",157lbs,77,76,82
D. JanmaatRB RWB,Watford2016 ~ 2020,"6'1""",176lbs,68,69,76
W. HughesCAM RM CM,Watford2017 ~ 2022,"6'1""",163lbs,67,59,60
J. CorkCM,Burnley2017 ~ 2021,"6'0""",165lbs,57,54,74
A. BarnesST,Burnley2014 ~ 2021,"6'1""",185lbs,64,60,82
C. WoodST,Burnley2017 ~ 2021,"6'2""",203lbs,68,75,80
A. Wan-BissakaRB,Crystal Palace2015 ~ 2022,"6'0""",159lbs,87,88,51
G. MurrayST,Brighton & Hove Albion2017 ~ 2020,"6'0""",176lbs,34,34,78
P. GroßCAM CM,Brighton & Hove Albion2017 ~ 2022,"5'11""",172lbs,60,60,74
MontoyaRB,Brighton & Hove Albion2018 ~ 2022,"5'9""",161lbs,79,79,82
A. JahanbakhshRM,Brighton & Hove Albion2018 ~ 2023,"5'11""",172lbs,79,83,84
F. AndoneST,Brighton & Hove Albion2018 ~ 2023,"5'11""",172lbs,78,75,77
M. JørgensenCB,Huddersfield Town2017 ~ 2020,"6'3""",187lbs,62,68,61
T. KongoloCB LB,Huddersfield Town2018 ~ 2022,"6'2""",154lbs,72,74,67
L. CookCM,Bournemouth2016 ~ 2022,"5'9""",157lbs,74,68,64
R. HoldingCB,Arsenal2016 ~ 2022,"6'2""",165lbs,58,61,48
EmersonLB LM,Chelsea2018 ~ 2022,"5'9""",170lbs,83,78,80
P. JagielkaCB,Everton2007 ~ 2019,"5'11""",192lbs,40,51,64
L. BainesLB,Everton2007 ~ 2019,"5'7""",154lbs,66,59,84
Alberto MorenoLB,Liverpool2014 ~ 2019,"5'7""",143lbs,85,87,80
E. MangalaCB,Manchester City2014 ~ 2019,"6'2""",185lbs,59,67,67
M. DarmianLB RB,Manchester United2015 ~ 2019,"6'0""",154lbs,73,73,69
Ki Sung YuengCM CDM,Newcastle United2018 ~ 2020,"6'2""",165lbs,60,61,82
C. ClarkCB,Newcastle United2016 ~ 2021,"6'1""",194lbs,52,59,71
F. FernándezCB,Newcastle United2018 ~ 2020,"6'3""",183lbs,47,50,27
D. YedlinRB RWB,Newcastle United2016 ~ 2021,"5'8""",165lbs,93,93,73
Ayoze PérezCF RM,Newcastle United2014 ~ 2021,"5'10""",159lbs,77,75,66
Kenedy LLM,"Newcastle United","6'0""",170lbs,79,80,75
Y. MutōST CF,Newcastle United2018 ~ 2022,"5'10""",159lbs,78,77,72
C. AustinST,Southampton2016 ~ 2020,"6'2""",185lbs,58,58,83
D. Ings LST,"Southampton","5'10""",161lbs,79,76,74
LlorenteST,Tottenham Hotspur2017 ~ 2019,"6'4""",203lbs,29,32,79
P. ZabaletaRB,West Ham United2017 ~ 2019,"5'10""",163lbs,50,51,66
M. NobleCM CDM,West Ham United2004 ~ 2021,"5'10""",168lbs,42,45,74
R. SnodgrassRM CM LM,West Ham United2017 ~ 2020,"6'0""",181lbs,61,65,81
W. ReidCB,West Ham United2010 ~ 2023,"6'3""",192lbs,52,64,70
A. CarrollST,West Ham United2013 ~ 2019,"6'4""",174lbs,43,49,83
A. CresswellLB,West Ham United2014 ~ 2021,"5'9""",146lbs,74,72,71
A. MasuakuLB LWB,West Ham United2016 ~ 2020,"5'10""",154lbs,87,86,75
W. MorganCB,Leicester City2012 ~ 2019,"6'1""",223lbs,30,29,52
N. MendyCDM CM,Leicester City2016 ~ 2020,"5'6""",161lbs,71,68,62
H. Nordtveit LCB CDM RB,"Fulham","6'2""",183lbs,48,55,72
GomesGK,Watford2014 ~ 2019,"6'3""",209lbs,43,48,30
C. CathcartCB,Watford2014 ~ 2021,"6'3""",183lbs,40,47,56
T. CleverleyCM CAM,Watford2017 ~ 2022,"5'9""",148lbs,63,67,74
Kiko FemeníaRB RWB RM,Watford2017 ~ 2021,"5'9""",134lbs,77,79,56
A. GrayST,Watford2017 ~ 2022,"5'11""",172lbs,87,87,80
A. LennonRM LM,Burnley2018 ~ 2020,"5'5""",139lbs,82,78,64
A. WestwoodCM,Burnley2017 ~ 2020,"5'9""",161lbs,63,55,72
M. LowtonRB,Burnley2015 ~ 2021,"5'11""",172lbs,70,68,72
R. BradyLM,Burnley2017 ~ 2020,"5'10""",170lbs,77,74,78
J. McArthurCM RM LM,Crystal Palace2014 ~ 2020,"5'10""",146lbs,63,59,65
C. BentekeST,Crystal Palace2016 ~ 2020,"6'3""",183lbs,59,68,78
P. van AanholtLB,Crystal Palace2017 ~ 2021,"5'9""",148lbs,88,89,75
C. KouyatéCDM CM,Crystal Palace2018 ~ 2022,"6'2""",183lbs,65,75,74
J. Ayew LST,"Crystal Palace","6'0""",179lbs,76,77,76
D. StephensCM CDM,Brighton & Hove Albion2014 ~ 2021,"6'1""",157lbs,62,57,67
A. KnockaertRM,Brighton & Hove Albion2016 ~ 2022,"5'8""",152lbs,75,72,73
J. LocadiaST LW,Brighton & Hove Albion2018 ~ 2022,"6'1""",192lbs,73,76,84
J. IzquierdoLM LW,Brighton & Hove Albion2017 ~ 2021,"5'7""",165lbs,89,88,80
A. SmithLB RB RWB,Bournemouth2014 ~ 2021,"5'11""",172lbs,72,76,72
Diego RicoLB LWB,Bournemouth2018 ~ 2022,"6'0""",168lbs,67,75,82
S. BambaCB,Cardiff City2016 ~ 2020,"6'3""",190lbs,53,55,51
Camarasa LCM RM CAM,"Cardiff City","6'0""",168lbs,65,58,76
W. CaballeroGK,Chelsea2017 ~ 2019,"6'1""",179lbs,43,46,23
D. Calvert-LewinST LM,Everton2016 ~ 2023,"6'2""",157lbs,80,86,76
T. DaviesCM CAM CDM,Everton2015 ~ 2022,"6'1""",154lbs,69,66,70
A. LookmanLM LW RM,Everton2017 ~ 2021,"5'9""",172lbs,87,79,78
P. FodenCAM CM,Manchester City2016 ~ 2024,"5'7""",152lbs,78,73,70
M. DiaméCM,Newcastle United2016 ~ 2019,"6'0""",190lbs,67,68,85
P. DummettLB,Newcastle United2010 ~ 2022,"6'0""",181lbs,65,68,42
F. SchärCB,Newcastle United2018 ~ 2021,"6'2""",185lbs,60,50,76
A. Barreca LLB,"Newcastle United","6'0""",154lbs,78,84,53
M. YoshidaCB,Southampton2012 ~ 2020,"6'2""",172lbs,60,61,50
N. RedmondLM RW,Southampton2016 ~ 2021,"5'8""",152lbs,86,83,80
S. ArmstrongCAM CDM CM,Southampton2018 ~ 2022,"6'0""",165lbs,79,76,75
M. VormGK,Tottenham Hotspur2014 ~ 2019,"6'0""",185lbs,53,54,23
P. GazzanigaGK,Tottenham Hotspur2017 ~ 2022,"6'5""",198lbs,63,65,49
V. JanssenST,Tottenham Hotspur2016 ~ 2020,"6'0""",194lbs,60,62,83
D. RiceCDM CB CM,West Ham United2016 ~ 2024,"6'1""",176lbs,61,64,46
D. GrayLM CF,Leicester City2016 ~ 2021,"5'11""",163lbs,88,87,80
C. CoadyCB,Wolverhampton Wanderers2015 ~ 2023,"6'1""",176lbs,45,46,69
Ivan CavaleiroLW RW,Wolverhampton Wanderers2016 ~ 2021,"5'9""",176lbs,86,87,78
R. SessegnonLW LB LM,Fulham2016 ~ 2020,"5'10""",157lbs,85,87,67
N. ChalobahCDM CM,Watford2017 ~ 2022,"6'1""",168lbs,62,69,75
J. HendrickCAM CM RM,Burnley2016 ~ 2020,"6'0""",185lbs,70,67,74
C. TaylorLB,Burnley2017 ~ 2021,"6'1""",154lbs,71,72,63
S. DannCB,Crystal Palace2014 ~ 2020,"6'2""",172lbs,32,33,52
W. HennesseyGK,Crystal Palace2014 ~ 2021,"6'6""",198lbs,40,41,34
M. KellyCB RB,Crystal Palace2014 ~ 2019,"6'3""",170lbs,46,52,61
L. BalogunCB RB,Brighton & Hove Albion2018 ~ 2020,"6'3""",194lbs,60,69,70
BernardoLB RB,Brighton & Hove Albion2018 ~ 2022,"6'1""",168lbs,74,77,72
J. LösslGK,Huddersfield Town2018 ~ 2021,"6'5""",194lbs,29,34,22
J. HoggCDM CM,Huddersfield Town2013 ~ 2020,"5'9""",161lbs,69,65,61
E. DurmRWB LWB LB RB,Huddersfield Town2018 ~ 2019,"6'0""",159lbs,78,76,66
S. MouniéST,Huddersfield Town2017 ~ 2021,"6'3""",176lbs,66,69,79
A. BorucGK,Bournemouth2015 ~ 2019,"6'4""",192lbs,37,39,21
S. FrancisCB RB,Bournemouth2012 ~ 2020,"6'2""",198lbs,49,54,70
C. DanielsLB LWB,Bournemouth2012 ~ 2020,"5'10""",165lbs,74,69,70
A. SurmanCM CDM,Bournemouth2014 ~ 2019,"5'10""",161lbs,59,53,68
J. StanislasRM LM,Bournemouth2014 ~ 2021,"6'0""",168lbs,76,76,71
D. BrooksRM CAM,Bournemouth2018 ~ 2023,"6'0""",137lbs,76,76,67
H. Arter LCM,"Cardiff City","5'9""",154lbs,65,58,75
M. GuendouziCM CDM,Arsenal2018 ~ 2023,"6'1""",150lbs,72,70,69
O. ZinchenkoLB,Manchester City2016 ~ 2021,"5'9""",141lbs,74,68,77
L. GrantGK,Manchester United2018 ~ 2020,"6'4""",183lbs,52,46,24
JoseluST,Newcastle United2017 ~ 2020,"6'4""",176lbs,58,59,77
C. AtsuLM RM,Newcastle United2017 ~ 2021,"5'5""",143lbs,89,87,72
F. ForsterGK,Southampton2014 ~ 2022,"6'7""",205lbs,26,35,36
J. StephensCB,Southampton2011 ~ 2022,"6'1""",165lbs,61,60,55
J. BednarekCB,Southampton2017 ~ 2022,"6'2""",170lbs,57,68,25
C. FuchsLB,Leicester City2015 ~ 2019,"6'2""",196lbs,54,56,83
D. SimpsonRB,Leicester City2014 ~ 2019,"5'9""",176lbs,63,54,37
S. OkazakiCAM CF,Leicester City2015 ~ 2019,"5'8""",172lbs,74,61,75
R. GhezzalRM RW,Leicester City2018 ~ 2022,"6'0""",154lbs,74,70,71
D. AmarteyRB CDM CM,Leicester City2016 ~ 2022,"6'1""",174lbs,69,74,75
K. IheanachoST CF,Leicester City2017 ~ 2022,"6'0""",176lbs,78,78,75
C. SöyüncüCB,Leicester City2018 ~ 2023,"6'1""",181lbs,67,72,65
H. BarnesLW CAM,Leicester City2016 ~ 2022,"5'9""",146lbs,78,77,71
AdamaRW RM,Wolverhampton Wanderers2018 ~ 2023,"5'10""",159lbs,97,96,74
Hélder CostaRW,Wolverhampton Wanderers2017 ~ 2020,"5'10""",170lbs,87,85,73
K. McDonaldCDM,Fulham2016 ~ 2020,"6'4""",212lbs,47,50,71
M. Le MarchandCB LB,Fulham2018 ~ 2022,"6'1""",172lbs,68,69,56
C. Chambers LCDM CB,"Fulham","6'0""",161lbs,59,66,52
L. Vietto LST RW,"Fulham","5'9""",154lbs,79,76,71
A. MawsonCB,Fulham2018 ~ 2022,"6'2""",198lbs,57,58,53
L. MarkovićRM RW,Fulham2019 ~ 2019,"5'9""",143lbs,82,85,65
A. MariappaCB RB,Watford2016 ~ 2020,"5'11""",174lbs,57,52,47
S. PrödlCB,Watford2015 ~ 2021,"6'5""",214lbs,32,31,47
A. MasinaLB,Watford2018 ~ 2023,"6'3""",192lbs,63,75,59
Marc NavarroRB,Watford2018 ~ 2023,"6'2""",174lbs,70,68,71
S. WardLB,Burnley2014 ~ 2019,"6'1""",176lbs,63,60,70
M. VydraCAM,Burnley2018 ~ 2021,"5'9""",157lbs,86,83,72
B. GibsonCB,Burnley2018 ~ 2022,"6'1""",172lbs,61,59,35
J. SchluppLM CM LB,Crystal Palace2017 ~ 2021,"5'10""",159lbs,84,89,77
Bruno SaltorRB,Brighton & Hove Albion2012 ~ 2019,"5'11""",170lbs,52,49,65
G. BongLB,Brighton & Hove Albion2015 ~ 2019,"6'2""",163lbs,63,68,58
S. MarchLM RM RW,Brighton & Hove Albion2013 ~ 2022,"5'11""",170lbs,78,79,74
A. PritchardCAM ST,Huddersfield Town2018 ~ 2021,"5'7""",137lbs,75,66,76
L. DepoitreST,Huddersfield Town2017 ~ 2019,"6'3""",201lbs,48,58,80
F. HadergjonajRWB RB,Huddersfield Town2018 ~ 2020,"6'0""",161lbs,79,78,59
P. BillingCDM CM,Huddersfield Town2013 ~ 2020,"6'6""",176lbs,58,61,84
D. GoslingCM,Bournemouth2014 ~ 2021,"6'0""",174lbs,59,54,71
J. IbeRM RW,Bournemouth2016 ~ 2020,"5'9""",179lbs,83,78,77
S. MorrisonCB,Cardiff City2014 ~ 2022,"6'4""",185lbs,44,46,52
B. Ecuélé MangaCB RB,Cardiff City2014 ~ 2019,"6'1""",168lbs,54,58,43
J. HoilettLM LW RM,Cardiff City2016 ~ 2021,"5'8""",154lbs,88,87,76
N. EtheridgeGK,Cardiff City2017 ~ 2021,"6'3""",196lbs,51,53,24
G. CunninghamLB,Cardiff City2018 ~ 2021,"6'0""",154lbs,75,77,60
J. RallsCM CDM,Cardiff City2011 ~ 2022,"5'10""",154lbs,66,61,72
O. Niasse LST,"Cardiff City","6'0""",181lbs,78,72,76
C. PatersonST CM RWB,Cardiff City2017 ~ 2022,"6'2""",168lbs,72,79,72
M. StekelenburgGK,Everton2016 ~ 2020,"6'6""",203lbs,30,36,13
J. KennyRB RWB,Everton2014 ~ 2022,"5'9""",148lbs,73,72,50
Diogo DalotRB RW,Manchester United2018 ~ 2023,"6'0""",168lbs,78,77,76
S. McTominayCDM CM,Manchester United2013 ~ 2023,"6'4""",194lbs,62,65,71
K. DarlowGK,Newcastle United2014 ~ 2019,"6'3""",194lbs,59,52,13
ManquilloLB RB,Newcastle United2017 ~ 2020,"5'10""",168lbs,74,75,69
S. LongST,Southampton2014 ~ 2020,"5'10""",154lbs,79,84,76
J. FoythCB,Tottenham Hotspur2017 ~ 2022,"6'2""",152lbs,71,71,56
R. FredericksRB,West Ham United2018 ~ 2022,"5'11""",163lbs,94,92,58
D. WardGK,Leicester City2018 ~ 2022,"6'3""",194lbs,46,44,25
R. BennettCB,Wolverhampton Wanderers2017 ~ 2021,"6'2""",172lbs,36,39,43
J. BryanLB LWB,Fulham2018 ~ 2022,"5'9""",168lbs,83,82,70
M. BettinelliGK,Fulham2011 ~ 2021,"6'4""",181lbs,34,24,20
A. Zambo AnguissaCDM CM,Fulham2018 ~ 2023,"6'0""",172lbs,71,69,73
T. Fosu-Mensah LRB CB,"Fulham","6'1""",172lbs,79,87,69
M. BritosCB,Watford2015 ~ 2019,"6'3""",187lbs,37,38,30
I. SuccessST RM LM,Watford2016 ~ 2023,"6'0""",198lbs,75,84,80
A. PeñarandaST CF,Watford2016 ~ 2023,"6'1""",183lbs,78,78,70
K. LongCB,Burnley2010 ~ 2021,"6'3""",181lbs,58,59,56
J. WardRB,Crystal Palace2012 ~ 2021,"6'2""",183lbs,55,62,64
J. RiedewaldCDM CB,Crystal Palace2017 ~ 2022,"6'0""",174lbs,65,63,69
Y. BissoumaCM CDM RM,Brighton & Hove Albion2018 ~ 2023,"6'0""",176lbs,75,71,82
C. LöweLWB LB,Huddersfield Town2016 ~ 2019,"5'9""",150lbs,75,69,72
T. SmithRB,Huddersfield Town2012 ~ 2020,"6'1""",185lbs,74,69,29
A. DiakhabyRM LM ST,Huddersfield Town2018 ~ 2021,"6'2""",163lbs,89,87,71
A. SmithiesGK,Cardiff City2018 ~ 2022,"6'2""",194lbs,59,59,46
A. GunnarssonCDM CM,Cardiff City2011 ~ 2019,"5'10""",190lbs,56,57,70
B. ReidST CF,Cardiff City2018 ~ 2022,"5'7""",150lbs,84,78,67
R. ElliotGK,Newcastle United2011 ~ 2020,"6'3""",207lbs,47,48,11
I. HaydenCDM CM,Newcastle United2016 ~ 2021,"6'1""",174lbs,55,64,62
A. GunnGK,Southampton2018 ~ 2023,"6'5""",170lbs,48,49,24
E. JakupovićGK,Leicester City2017 ~ 2020,"6'3""",187lbs,43,45,25
N. KebanoLW LM CAM,Fulham2016 ~ 2019,"5'7""",143lbs,85,76,65
K. SemaLM RM,Watford2018 ~ 2023,"5'11""",152lbs,77,81,77
P. CrouchST,Burnley2019 ~ 2019,"6'7""",165lbs,31,32,75
P. BardsleyRB,Burnley2017 ~ 2019,"5'11""",174lbs,57,50,80
B. KayalCM,Brighton & Hove Albion2015 ~ 2019,"5'10""",163lbs,66,66,72
J. Puncheon LCM LM,"Huddersfield Town","5'8""",146lbs,61,58,70
I. Mbenza LST RM,"Huddersfield Town","6'2""",170lbs,85,86,77
J. BennettLB,Cardiff City2016 ~ 2021,"5'10""",163lbs,74,68,65
N. Mendez-LaingRM RW,Cardiff City2017 ~ 2021,"5'11""",165lbs,85,85,67
A. Maitland-NilesCM RM LB RB,Arsenal2014 ~ 2023,"5'10""",157lbs,82,85,65
C. Hudson-OdoiLW CAM RW,Chelsea2017 ~ 2020,"5'10""",165lbs,86,84,60
M. TargettLB LWB,Southampton2013 ~ 2022,"6'0""",154lbs,71,75,53
K. Walker-PetersRB LB,Tottenham Hotspur2015 ~ 2023,"5'9""",141lbs,77,72,31
H. ChoudhuryCDM CM,Leicester City2015 ~ 2022,"5'10""",141lbs,73,71,69
J. RuddyGK,Wolverhampton Wanderers2017 ~ 2020,"6'4""",214lbs,38,43,24
T. ReamCB,Fulham2015 ~ 2020,"6'2""",176lbs,55,66,48
C. ChristieRB RWB,Fulham2018 ~ 2021,"6'2""",172lbs,76,87,60
J. WaltersST RM,Burnley2017 ~ 2019,"6'0""",174lbs,56,53,74
B. SakoLW LM ST,Crystal Palace2019 ~ 2019,"6'0""",198lbs,75,75,77
C. WickhamST,Crystal Palace2015 ~ 2020,"6'3""",198lbs,53,58,76
D. BurnCB,Brighton & Hove Albion2018 ~ 2022,"6'6""",192lbs,42,44,53
D. WilliamsCM CDM,Huddersfield Town2017 ~ 2019,"6'0""",176lbs,74,68,78
E. KachungaRM,Huddersfield Town2016 ~ 2020,"5'10""",163lbs,78,79,72
K. ZohoreST,Cardiff City2016 ~ 2020,"6'4""",212lbs,54,74,78
J. MurphyLM ST LW,Cardiff City2018 ~ 2022,"5'8""",148lbs,83,86,74
R. GreenGK,Chelsea2018 ~ 2019,"6'2""",203lbs,37,31,22
P. SandlerCB,Manchester City2018 ~ 2022,"6'3""",181lbs,66,67,63
M. JamesCM CDM,Leicester City2012 ~ 2021,"5'11""",190lbs,62,52,72
F. AyitéLW ST RW,Fulham2016 ~ 2019,"5'9""",163lbs,82,84,78
J. BacunaCM CDM,Huddersfield Town2018 ~ 2021,"5'10""",163lbs,72,67,76
L. MoussetST RM LW,Bournemouth2016 ~ 2020,"6'0""",176lbs,79,76,76
D. SolankeST,Bournemouth2019 ~ 2023,"6'2""",176lbs,67,69,73
C. MephamCB,Bournemouth2019 ~ 2023,"6'3""",165lbs,64,65,33
C. JenkinsonRB,Arsenal2011 ~ 2020,"6'1""",170lbs,58,73,72
S. GallagherST,Southampton2012 ~ 2021,"6'4""",165lbs,62,69,76
D. OdoiCB RB,Fulham2016 ~ 2019,"5'10""",159lbs,78,85,62
D. McNeilLM,Burnley2018 ~ 2023,"6'0""",150lbs,76,75,67
P. SouaréLB,Crystal Palace2015 ~ 2021,"5'10""",146lbs,71,69,60
L. PeltierRB RWB LB,Cardiff City2015 ~ 2020,"5'10""",161lbs,65,57,32
L. DamourCDM CM CAM,Cardiff City2017 ~ 2019,"5'11""",165lbs,63,68,65
A. RichardsRB LB RWB,Cardiff City2016 ~ 2019,"5'9""",165lbs,68,69,56
D. WardST,Cardiff City2017 ~ 2020,"5'11""",159lbs,73,73,74
PleguezueloCB,Arsenal2014 ~ 2019,"5'11""",139lbs,71,70,38
K. MavropanosCB,Arsenal2018 ~ 2022,"6'4""",194lbs,52,60,45
B. WoodburnCAM LW ST,Liverpool2016 ~ 2022,"5'9""",159lbs,82,73,66
Rúben VinagreLWB,Wolverhampton Wanderers2018 ~ 2023,"5'9""",141lbs,87,89,62
M. Gibbs-WhiteCM CAM LW,Wolverhampton Wanderers2017 ~ 2022,"5'10""",154lbs,67,65,69
I. CisséCDM CM,Fulham2017 ~ 2020,"5'11""",185lbs,75,69,73
P. DahlbergGK,Watford2018 ~ 2023,"6'5""",198lbs,25,31,20
A. LindegaardGK,Burnley2017 ~ 2019,"6'4""",187lbs,47,52,28
J. SperoniGK,Crystal Palace2004 ~ 2019,"6'1""",176lbs,42,39,20
D. ButtonGK,Brighton & Hove Albion2018 ~ 2021,"6'3""",192lbs,60,52,12
J. SteeleGK,Brighton & Hove Albion2018 ~ 2021,"6'2""",174lbs,34,36,18
L. BacunaCDM CM RB,Cardiff City2019 ~ 2023,"5'11""",170lbs,76,79,79
A. GomesCAM CM LW,Manchester United2016 ~ 2021,"5'7""",134lbs,75,69,61
J. SimsRW RM,Southampton2013 ~ 2020,"5'6""",143lbs,85,77,64
Xande SilvaST RM LM,West Ham United2018 ~ 2021,"5'10""",150lbs,79,77,67
E. HyndmanCM CAM,Bournemouth2016 ~ 2020,"5'7""",134lbs,67,55,60
K. HarrisLM RM,Cardiff City2012 ~ 2019,"5'9""",150lbs,86,80,55
E. NketiahST,Arsenal2015 ~ 2021,"5'9""",154lbs,87,82,60
B. GallowayLB,Everton2014 ~ 2020,"6'1""",163lbs,71,77,51
C. GomesCDM CM,Manchester City2018 ~ 2023,"5'11""",154lbs,70,69,63
T. ChongRW LW,Manchester United2017 ~ 2019,"6'0""",154lbs,78,79,62
M. GreenwoodCF ST RW CAM,Manchester United2018 ~ 2020,"6'1""",161lbs,78,76,65
F. WoodmanGK,Newcastle United2014 ~ 2020,"6'3""",183lbs,43,47,24
S. LongstaffCM CAM,Newcastle United2015 ~ 2022,"5'11""",143lbs,58,64,64
Y. ValeryRWB RB,Southampton2016 ~ 2020,"5'11""",154lbs,76,71,58
W. NorrisGK,Wolverhampton Wanderers2017 ~ 2021,"6'3""",179lbs,40,49,18
Domingos QuinaCAM CM CDM,Watford2018 ~ 2022,"5'9""",146lbs,74,66,59
R. InnissCB,Crystal Palace2013 ~ 2019,"6'5""",185lbs,36,37,49
S. AhannachLM,Brighton & Hove Albion2017 ~ 2020,"5'8""",146lbs,73,71,60
B. HamerGK,Huddersfield Town2018 ~ 2021,"6'4""",201lbs,45,45,23
K. GrantST LM,Huddersfield Town2019 ~ 2022,"6'0""",154lbs,86,88,60
M. ConnollyRB CB,Cardiff City2012 ~ 2020,"6'2""",185lbs,55,57,63
B. SakaLW RW,Arsenal2018 ~ 2023,"5'10""",154lbs,86,83,64
E. AmpaduCB CDM,Chelsea2017 ~ 2023,"6'0""",159lbs,62,58,52
L. AmosCM CDM,Tottenham Hotspur2015 ~ 2021,"5'10""",159lbs,58,63,57
G. DianganaRM LM,West Ham United2015 ~ 2025,"5'9""",161lbs,84,79,50
A. SabiriLM CAM,Huddersfield Town2017 ~ 2020,"6'1""",176lbs,71,72,55
J. SimpsonCB,Bournemouth2015 ~ 2021,"6'0""",183lbs,53,50,58
S. O'KeefeCM CDM,Cardiff City2015 ~ 2019,"5'8""",141lbs,63,58,62
A. MuricGK,Manchester City2017 ~ 2020,"6'6""",179lbs,44,46,21
Eric GarcíaCB,Manchester City2017 ~ 2022,"6'0""",174lbs,60,63,51
J. BohuiLW ST RW,Manchester United2016 ~ 2019,"5'9""",165lbs,75,78,59
E. LairdRB LB CB,Manchester United2018 ~ 2020,"5'10""",165lbs,75,78,53
T. Oakley-BootheCM CDM,Tottenham Hotspur2017 ~ 2021,"6'0""",150lbs,63,67,44
O. SkippCDM CM,Tottenham Hotspur2017 ~ 2021,"5'9""",154lbs,64,65,55
S. HughesCB,Leicester City2017 ~ 2020,"6'2""",176lbs,52,56,42
L. de la TorreCAM,Fulham2015 ~ 2020,"5'10""",150lbs,72,61,52
A. LegzdinsGK,Burnley2017 ~ 2020,"6'3""",198lbs,35,30,20
S. SurridgeST,Bournemouth2016 ~ 2021,"6'3""",170lbs,68,64,67
B. MurphyGK,Cardiff City2016 ~ 2019,"6'0""",183lbs,34,32,21
C. BramallLB,Arsenal2017 ~ 2019,"5'10""",159lbs,88,88,55
J. WillockCM,Arsenal2016 ~ 2022,"6'0""",157lbs,68,74,58
M. FeeneyCB,Everton2016 ~ 2020,"6'3""",170lbs,46,46,45
J. GarnerCDM CM CB,Manchester United2018 ~ 2020,"6'0""",165lbs,66,67,54
L. O'ConnorLB RB CB,Manchester United2018 ~ 2019,"5'10""",165lbs,75,72,52
Víctor FernándezLM CAM RM,Newcastle United2017 ~ 2019,"5'9""",154lbs,76,69,63
A. JonesCB,Southampton2016 ~ 2019,"6'0""",154lbs,55,60,48
M. ObafemiST,Southampton2017 ~ 2022,"5'7""",157lbs,85,82,60
J. ColemanGK,Huddersfield Town2016 ~ 2020,"6'6""",181lbs,40,49,22
J. Gorenc StankovićCB,Huddersfield Town2016 ~ 2020,"6'3""",172lbs,50,44,53
R. HealeyST LW,Cardiff City2013 ~ 2020,"5'11""",159lbs,77,69,63
F. HornbyST CF CAM,Everton2018 ~ 2021,"6'2""",170lbs,58,54,62
R. BrewsterST,Liverpool2017 ~ 2023,"5'9""",165lbs,78,76,54
Rafael CamachoLW RB,Liverpool2018 ~ 2020,"5'9""",143lbs,75,73,57
C. Humphreys-GrantCB,Manchester City2015 ~ 2019,"6'2""",176lbs,65,66,44
F. NmechaCAM CM,Manchester City2017 ~ 2021,"6'1""",154lbs,75,77,62
H. LewisGK,Southampton2015 ~ 2020,"6'1""",170lbs,30,35,25
J. RoseGK,Southampton2017 ~ 2020,"6'0""",165lbs,41,43,24
J. TangangaCB,Tottenham Hotspur2017 ~ 2019,"6'0""",161lbs,66,71,36
N. HollandLM RM,West Ham United2017 ~ 2020,"5'10""",154lbs,85,82,56
L. NdukwuRM LM,Leicester City2016 ~ 2020,"5'9""",159lbs,75,69,57
J. KitolanoLWB LB,Wolverhampton Wanderers2018 ~ 2021,"5'9""",143lbs,79,79,43
D. AgyeiST,Burnley2015 ~ 2019,"6'0""",170lbs,75,75,64
V. GyökeresST LW RW,Brighton & Hove Albion2018 ~ 2020,"6'2""",190lbs,68,70,59
I. UgboST,Chelsea2015 ~ 2021,"6'1""",161lbs,78,72,58
M. Taylor-CrossdaleST,Chelsea2016 ~ 2019,"6'1""",170lbs,65,72,70
B. GilmourCM CAM,Chelsea2018 ~ 2021,"5'8""",150lbs,66,56,48
H. CharsleyLM CM RM RB,Everton2014 ~ 2019,"5'10""",141lbs,56,56,53
M. FouldsCB LB,Everton2016 ~ 2019,"5'11""",165lbs,59,48,38
M. HeweltGK,Everton2015 ~ 2019,"6'1""",172lbs,47,42,30
João VirgíniaGK,Everton2018 ~ 2021,"6'3""",176lbs,54,50,25
R. AstleyCB RB,Everton2019 ~ 2021,"5'11""",154lbs,57,56,44
C. RandallRB RWB,Liverpool2013 ~ 2019,"5'11""",168lbs,67,64,49
C. MastersonCB,Liverpool2016 ~ 2019,"6'2""",159lbs,48,49,46
N. PhillipsCB,Liverpool2017 ~ 2021,"6'2""",154lbs,52,52,45
C. JonesCM CAM,Liverpool2018 ~ 2021,"6'0""",150lbs,64,63,60
K. HoeverRB CB,Liverpool2018 ~ 2020,"6'0""",148lbs,74,70,42
T. JohnsonRM,Southampton2015 ~ 2020,"5'9""",143lbs,83,79,55
C. KlarerCB,Southampton2016 ~ 2019,"6'3""",161lbs,52,61,42
A. WhitemanGK,Tottenham Hotspur2015 ~ 2020,"6'3""",168lbs,34,28,17
J. DinzeyiCB,Tottenham Hotspur2017 ~ 2019,"6'0""",183lbs,66,71,48
T. EyomaCB RB,Tottenham Hotspur2017 ~ 2021,"6'0""",168lbs,67,62,37
A. PaşcanuCB RB,Leicester City2016 ~ 2019,"6'1""",161lbs,70,68,35
A. EdunCM LM LB,Fulham2015 ~ 2020,"5'7""",165lbs,74,72,49
Lucas PerriGK,Crystal Palace2019 ~ 2019,"6'5""",209lbs,25,22,16
Robert SanchezGK,Brighton & Hove Albion2015 ~ 2021,"6'6""",187lbs,45,41,27
L. ØstigårdCB,Brighton & Hove Albion2018 ~ 2021,"6'0""",176lbs,69,66,46
D. DuhaneyRB LB,Huddersfield Town2018 ~ 2020,"5'11""",154lbs,70,78,51
M. ButcherCM CDM CB,Bournemouth2015 ~ 2019,"6'2""",183lbs,50,54,54
Z. MedleyCB,Arsenal2017 ~ 2019,"6'4""",165lbs,54,52,41
K. ScottCM,Chelsea2014 ~ 2019,"5'8""",132lbs,60,62,54
L. GibsonCB LB,Everton2017 ~ 2020,"6'1""",165lbs,62,56,48
A. GordonCAM LM LW,Everton2017 ~ 2023,"6'0""",154lbs,77,72,55
B. AdekanyeRW LW,Liverpool2017 ~ 2019,"5'7""",137lbs,75,73,63
B. GarréLW,Manchester City2017 ~ 2020,"5'7""",139lbs,76,69,59
B. WilliamsLB RB CB,Manchester United2018 ~ 2020,"6'0""",154lbs,74,72,48
L. CharmanST,Newcastle United2017 ~ 2021,"6'1""",183lbs,63,64,64
M. BarnesST,Southampton2013 ~ 2020,"6'1""",159lbs,67,63,58
C. SlatteryCAM CM,Southampton2016 ~ 2020,"6'3""",154lbs,55,67,52
K. RamsayRB CB,Southampton2018 ~ 2021,"5'10""",146lbs,72,70,31
K. Dewsbury-HallCDM CM,Leicester City2016 ~ 2019,"5'10""",154lbs,63,56,55
C. WrightCAM LM,Leicester City2018 ~ 2021,"6'0""",159lbs,68,69,58
M. FosseyRB,Fulham2016 ~ 2020,"5'10""",168lbs,78,77,42
J. MukenaCB,Watford2017 ~ 2019,"6'0""",159lbs,61,52,42
G. McEachranCAM CM,Chelsea2017 ~ 2019,"5'8""",143lbs,64,60,47
J. WakelyCB,Chelsea2017 ~ 2020,"6'3""",165lbs,52,59,51
J. LatibeaudiereCB,Manchester City2017 ~ 2020,"5'11""",159lbs,60,65,38
K. HansenCAM,Southampton2018 ~ 2019,"5'11""",165lbs,60,57,63
N. TrottGK,West Ham United2017 ~ 2022,"6'0""",154lbs,40,33,18
Paulo AlvesCM CAM,Wolverhampton Wanderers2018 ~ 2020,"5'9""",159lbs,57,59,63
L. GordonLB,Watford2018 ~ 2020,"5'5""",143lbs,68,63,29
H. ForsterRM RB,Watford2018 ~ 2019,"5'9""",157lbs,74,66,57
J. BensonCM,Burnley2019 ~ 2020,"5'9""",163lbs,72,69,55
L. DreherCM,Crystal Palace2015 ~ 2020,"6'0""",170lbs,61,68,56
J. MolumbyCM,Brighton & Hove Albion2016 ~ 2019,"5'10""",141lbs,51,41,54
M. DalyCM CAM,Huddersfield Town2018 ~ 2021,"5'9""",165lbs,61,52,55
K. TaylorCAM,Bournemouth2017 ~ 2022,"5'10""",154lbs,69,63,61
N. OfoborhCDM CM,Bournemouth2017 ~ 2021,"6'0""",170lbs,60,61,58
A. Bolger LCM CDM,"Cardiff City","5'7""",143lbs,66,68,48
M. GuehiCB,Chelsea2017 ~ 2020,"6'0""",165lbs,58,60,49
N. BroadheadRW RM,Everton2016 ~ 2020,"5'10""",161lbs,63,65,65
C. KelleherGK,Liverpool2017 ~ 2021,"6'2""",152lbs,37,33,25
A. LewisLB LM,Liverpool2017 ~ 2020,"5'9""",139lbs,68,66,30
D. KempRM,West Ham United2015 ~ 2021,"5'6""",139lbs,74,67,44
A. MuskweST,Leicester City2016 ~ 2019,"6'0""",165lbs,61,65,56
K. LeshabelaCAM,Leicester City2017 ~ 2022,"5'10""",168lbs,72,67,53
N. EnnisST,Wolverhampton Wanderers2016 ~ 2020,"5'11""",176lbs,78,79,60
Pedro GonçalvesCM,Wolverhampton Wanderers2017 ~ 2019,"5'8""",154lbs,65,68,71
E. FrancisCB LB,Wolverhampton Wanderers2019 ~ 2021,"6'0""",168lbs,59,67,41
R. GilesLWB LW,Wolverhampton Wanderers2018 ~ 2020,"5'10""",159lbs,87,83,57
S. SessegnonRB CB,Fulham2017 ~ 2022,"5'9""",152lbs,72,69,38
M. O'RileyCM,Fulham2017 ~ 2020,"6'2""",170lbs,59,58,53
T. AbrahamST,Fulham2017 ~ 2020,"6'1""",172lbs,71,69,54
O. YoungerCB,Burnley2018 ~ 2020,"6'0""",154lbs,56,57,50
G. McGregorCM,Crystal Palace2016 ~ 2020,"5'9""",157lbs,67,69,55
M. SandersCM,Brighton & Hove Albion2017 ~ 2019,"5'9""",176lbs,54,57,58
S. HighCM,Huddersfield Town2018 ~ 2020,"5'10""",143lbs,61,51,55
J. AnthonyST,Bournemouth2018 ~ 2019,"5'10""",150lbs,75,73,59
D. IlievGK,Arsenal2012 ~ 2019,"6'5""",192lbs,45,43,16
T. Dele-BashiruCM,Manchester City2017 ~ 2019,"5'10""",150lbs,70,71,53
A. WilsonLM LB,Newcastle United2018 ~ 2020,"5'9""",154lbs,79,79,56
Y. ToureST LW RW,Newcastle United2018 ~ 2021,"6'1""",165lbs,69,70,60
J. VokinsLB LWB,Southampton2016 ~ 2021,"5'11""",154lbs,76,73,35
G. MarshCDM CB RB,Tottenham Hotspur2017 ~ 2019,"5'10""",150lbs,66,58,60
T. ParrottST,Tottenham Hotspur2019 ~ 2021,"5'9""",159lbs,77,73,55
J. PaskCB,West Ham United2014 ~ 2019,"6'2""",168lbs,59,65,38
C. CoventryCM CDM,West Ham United2017 ~ 2019,"5'9""",143lbs,65,60,48
R. LoftST,Leicester City2018 ~ 2019,"6'3""",161lbs,60,60,60
O. Buur RasmussenRWB RB,Wolverhampton Wanderers2017 ~ 2021,"5'9""",154lbs,77,74,36
Carlos HerediaRW,Wolverhampton Wanderers2017 ~ 2019,"5'8""",139lbs,79,79,62
R. HarkerST,Burnley2018 ~ 2019,"5'11""",176lbs,74,72,60
T. ChakwanaRM,Burnley2017 ~ 2019,"5'7""",137lbs,78,76,53
M. BlairLM CAM,Burnley2018 ~ 2019,"5'9""",150lbs,75,74,55
K. FlanaganCAM,Crystal Palace2016 ~ 2019,"5'10""",159lbs,71,62,51
T. MitchellLB,Crystal Palace2017 ~ 2021,"5'9""",143lbs,79,76,29
S. WoodsCB,Crystal Palace2017 ~ 2020,"6'1""",170lbs,46,39,42
B. HallCB,Brighton & Hove Albion2016 ~ 2019,"6'1""",172lbs,53,50,35
P. GwargisLM CAM,Brighton & Hove Albion2018 ~ 2020,"5'11""",165lbs,67,63,57
J. BarrettCB RB,Huddersfield Town2018 ~ 2019,"6'1""",165lbs,52,48,49
H. SprattLB CB,Huddersfield Town2018 ~ 2019,"5'10""",165lbs,61,52,29
M. ObieroST,Huddersfield Town2018 ~ 2019,"5'10""",150lbs,62,55,54
D. GillelaCB CDM,Bournemouth2018 ~ 2019,"5'11""",168lbs,64,60,49
S. SherringCB,Bournemouth2018 ~ 2019,"5'11""",148lbs,62,61,41
G. KilkennyCAM,Bournemouth2018 ~ 2019,"5'8""",141lbs,67,69,53
M. BulkaGK,Chelsea2016 ~ 2019,"6'6""",198lbs,28,25,22
S. O'ConnorCB,Newcastle United2017 ~ 2019,"6'1""",179lbs,45,49,41
N. HarkerGK,Newcastle United2017 ~ 2020,"6'3""",183lbs,33,30,17
J. Hector-IngramST,West Ham United2016 ~ 2019,"6'0""",165lbs,68,73,56
M. KilmanCB LB CM,Wolverhampton Wanderers2018 ~ 2020,"6'1""",176lbs,71,73,51
L. Ashby-HammondGK,Fulham2018 ~ 2019,"6'1""",168lbs,23,26,20
R. CassidyST,Watford2018 ~ 2020,"5'9""",152lbs,55,47,58
O. O'DwyerCB,Crystal Palace2015 ~ 2019,"6'7""",183lbs,28,31,42
W. CollarRB CM,Brighton & Hove Albion2015 ~ 2019,"5'11""",168lbs,56,68,53
L. CassRB CB,Newcastle United2018 ~ 2019,"6'1""",163lbs,59,60,45
S. DialloCM CDM,Wolverhampton Wanderers2018 ~ 2020,"5'11""",159lbs,64,63,65
T. FrancoisCM,Fulham2017 ~ 2020,"5'7""",132lbs,65,60,48
V. SteelsLM,Burnley2018 ~ 2020,"5'7""",137lbs,73,69,45
W. O'HoraCB,Brighton & Hove Albion2018 ~ 2020,"6'3""",185lbs,51,52,38
T. DuffusCM,Cardiff City2017 ~ 2019,"6'1""",150lbs,50,67,59
C. GilmourCM CDM,Arsenal2016 ~ 2019,"6'0""",152lbs,64,62,42
D. GrimshawGK,Manchester City2016 ~ 2021,"6'1""",170lbs,44,47,21
C. JohnCB LWB,Wolverhampton Wanderers2017 ~ 2020,"5'11""",172lbs,72,73,42
E. WattCM,Wolverhampton Wanderers2017 ~ 2022,"5'9""",159lbs,68,67,55
A. SamuelsST,Wolverhampton Wanderers2017 ~ 2021,"5'9""",165lbs,79,77,58
A. SøndergaardGK,Wolverhampton Wanderers2018 ~ 2020,"6'2""",168lbs,21,20,15
W. DennisGK,Bournemouth2018 ~ 2019,"6'2""",174lbs,29,40,20
C. CoxeRB,Cardiff City2017 ~ 2019,"5'11""",154lbs,68,64,32
L. MewittGK,Huddersfield Town2017 ~ 2019,"6'0""",176lbs,20,25,24
J. WaiteCM CAM,Cardiff City2017 ~ 2019,"5'9""",134lbs,63,65,57
G. RosarioGK,Huddersfield Town2018 ~ 2019,"6'1""",168lbs,33,32,22
A. EleftheriouRM RB,Watford2016 ~ 2019,"5'11""",163lbs,65,67,40
J. TupperGK,Crystal Palace2018 ~ 2019,"6'2""",170lbs,23,21,22
L. HumphriesCM,Cardiff City2016 ~ 2021,"5'8""",154lbs,62,61,46
A. ParkesGK,Watford2019 ~ 2019,"5'11""",165lbs,32,18,19