  0.0   0.0   4.6e5    1.5e4   2.15 2.5e-11  1.0   0.0   # alpha Fe (Kneller) (cubic!)
#
# theta phi   K1       K2      Js   A        alpha psi   # parameter
# (rad) (rad) (J/m^3)  (J/m^3) (T)  (J/m)    (1)   (rad) # units
