  0.0   0.0   5.00E+06 0.0     1.32 1.40E-11 0.1   uni   # Sm2Co17: Durst, Phys. Stat. Sol. (a) 108 (1988) 403
  0.0   0.0   9.00E+06 0.0     0.80 1.40E-11 0.1   uni   # SmCo5: Durst, Phys. Stat. Sol. (a) 108 (1988) 403
#
# theta phi   K1       K2      Js   A        alpha psi   # parameter
# (rad) (rad) (J/m^3)  (J/m^3) (T)  (J/m)    (1)   (rad) # units
