Point (1) = {-2, 0, 0, 0.3};
Point (2) = {-1, 0, 0, 0.3};
Point (3) = {-1, 1, 0, 0.3};
Point (4) = {-2, 1, 0, 0.3};
Point (5) = {-2, 0, 1, 0.3};
Point (6) = {-1, 0, 1, 0.3};
Point (7) = {-1, 1, 1, 0.3};
Point (8) = {-2, 1, 1, 0.3};
Point (9) = {0, 0, 1, 0.3};
Point (10) = {1, 0, 1, 0.3};
Point (14) = {1, 1, 1, 0.3};
Point (18) = {0, 1, 1, 0.3};
Point (30) = {0, 1, 0, 0.3};
Point (34) = {1, 1, 0, 0.3};
Point (41) = {1, 0, 0, 0.3};
Point (42) = {0, 0, 0, 0.3};
Line (1) = {4, 3};
Line (2) = {3, 2};
Line (3) = {2, 1};
Line (4) = {1, 4};
Line (6) = {5, 6};
Line (7) = {6, 7};
Line (8) = {7, 8};
Line (9) = {8, 5};
Line (10) = {1, 5};
Line (11) = {4, 8};
Line (12) = {2, 6};
Line (13) = {3, 7};
Line (27) = {9, 10};
Line (28) = {10, 14};
Line (29) = {14, 18};
Line (30) = {18, 9};
Line (33) = {18, 30};
Line (34) = {30, 34};
Line (35) = {34, 14};
Line (37) = {41, 42};
Line (38) = {42, 30};
Line (40) = {34, 41};
Line (42) = {41, 10};
Line (50) = {42, 9};
Line Loop (15) = {3, 4, 1, 2};
Plane Surface (15) = {15};
Line Loop (17) = {6, 7, 8, 9};
Plane Surface (17) = {17};
Line Loop (19) = {10, -9, -11, -4};
Plane Surface (19) = {19};
Line Loop (21) = {8, -11, 1, 13};
Plane Surface (21) = {21};
Line Loop (23) = {12, 7, -13, 2};
Plane Surface (23) = {23};
Line Loop (25) = {6, -12, 3, 10};
Plane Surface (25) = {25};
Line Loop (26) = {27, 28, 29, 30};
Plane Surface (26) = {26};
Line Loop (31) = {29, 33, 34, 35};
Plane Surface (31) = {31};
Line Loop (36) = {37, 38, 34, 40};
Plane Surface (36) = {36};
Line Loop (41) = {42, 28, -35, 40};
Plane Surface (41) = {41};
Line Loop (46) = {27, -42, 37, 50};
Plane Surface (46) = {46};
Line Loop (51) = {50, -30, 33, -38};
Plane Surface (51) = {51};
Surface Loop (1) = {17, 25, 23, 21, 19, 15};
Volume (1) = {1};
Surface Loop (53) = {36, 46, 26, 41, 31, 51};
Volume (53) = {53};
Physical Volume (1) = {1};
Physical Volume (2) = {53};
