﻿country,life_expectancy_years,at_least_basic_sanitation,cell_phones_per_100_people,child_mortality_0to5Y_per_1000_born,co2_emissions_tonnes_per_person,income_gdp_per_person,medical_doctors_per_1000_people
Central African Republic,53.3,0.253,32.3,110,0.0651,817,0.0721
Guinea,59.1,0.129,82.8,45.2,0.911,3950,0.0699
Papua New Guinea,59.1,0.129,47.6,45.2,0.911,3950,0.0699
Mozambique,60.4,0.294,47.7,68.1,0.281,1210,0.0838
Chad,60.9,0.0834,48.1,114,0.0656,1790,0.0434
Guinea-Bissau,61,0.205,82.8,77.1,0.181,1680,0.127
Zimbabwe,62.3,0.362,90.1,43.1,0.85,2410,0.21
Eswatini,62.4,0.584,93.5,50.9,1.06,9510,0.329
Burundi,62.6,0.458,57.6,55.1,0.0467,628,0.1
Burkina Faso,62.9,0.194,100,71.5,0.198,1860,0.0847
Mali,63.3,0.393,115,92.4,0.187,2140,0.129
Congo. Dem. Rep.,63.4,0.205,42.8,84.5,0.0243,845,0.074
Eritrea,63.8,0.119,20.4,37.8,0.215,1420,0.0628
Zambia,64.3,0.264,96.4,54.5,0.302,3650,1.19
Malawi,64.6,0.262,47.8,45.1,0.0762,1210,0.0358
Vanuatu,65.1,0.341,88.4,24.9,0.529,2910,0.165
Togo,65.3,0.161,77.2,66.2,0.434,1650,0.0774
Angola,65.4,0.499,46.6,72.3,1.12,5440,0.215
Liberia,65.5,0.17,56.6,67.1,0.324,1130,0.0376
Benin,65.6,0.165,87.7,88.8,0.623,2310,0.0791
Niger,65.6,0.392,88.2,114,0.65,5300,0.381
Nigeria,65.6,0.392,88.2,114,0.65,5300,0.381
Haiti,66,0.347,57.5,61.6,0.27,1640,0.234
Ghana,66.4,0.185,134,44.8,0.615,4590,0.136
Equatorial Guinea,66.6,0.663,45.2,81,4.35,17700,0.402
Gambia,66.8,0.392,140,55.1,0.268,1620,0.102
Kenya,66.9,0.291,104,38.5,0.36,3260,0.157
Uganda,67,0.185,57.3,43,0.135,1920,0.168
South Africa,67.2,0.757,166,32.1,8.1,12000,0.905
Pakistan,67.3,0.599,76.4,66.6,1.05,5020,0.98
Sao Tome and Principe,67.5,0.43,77.1,29.3,0.587,3090,0.0531
Namibia,67.6,0.345,113,36.8,1.75,9660,0.418
Tanzania,68.1,0.299,82.2,49.5,0.222,3060,0.014
Fiji,68.4,0.951,118,24.8,2.41,10200,0.86
Lao,68.5,0.745,60.8,43.9,2.74,7290,0.373
Senegal,68.9,0.515,110,40.3,0.739,3590,0.0691
Solomon Islands,69,0.335,71.4,19,0.273,2170,0.194
Comoros,69.3,0.359,67.6,64.8,0.263,2520,0.272
Gabon,69.3,0.474,138,42.4,2.53,16500,0.682
Myanmar,69.3,0.643,114,43.6,0.491,6620,0.677
Ethiopia,69.5,0.0732,37.2,50.8,0.137,2000,0.0769
Mongolia,69.5,0.585,137,15.1,8.88,13200,2.86
Rwanda,69.5,0.666,76.5,32,0.0913,2230,0.134
Guyana,69.6,0.858,83,28.7,3.12,8200,0.802
India,69.7,0.595,84.3,33.9,1.96,7630,0.857
Botswana,70,0.773,174,34.8,2.96,17200,0.527
Philippines,70.1,0.765,155,27.2,1.27,8640,0.6
Sudan,71,0.366,77.1,57.8,0.504,4540,0.262
Egypt,71.1,0.942,95,19.8,2.43,11800,0.452
Mauritania,71.3,0.484,104,72.1,0.605,4020,0.186
Timor-Leste,71.5,0.535,110,42.7,0.412,7000,0.722
Nepal,71.8,0.621,139,29.8,0.337,3020,0.749
Indonesia,72.1,0.731,127,23.3,2.3,12500,0.427
Suriname,72.4,0.845,140,17.9,3.1,14100,1.21
Syria,72.4,0.912,114,14.8,1.67,2910,1.29
North Korea,72.5,0.832,15,16.7,1.18,1710,3.68
Russia,72.7,0.905,164,6.52,11.7,26200,4.01
Moldova,73.2,0.763,89.4,14.9,1.27,6980,3.21
Georgia,73.3,0.9,135,9.02,2.64,11300,7.12
Guatemala,73.3,0.651,119,24.3,1.07,7720,0.355
Samoa,73.3,0.982,63.6,14.9,1.32,6460,0.344
Libya,73.5,1,91.5,11.2,8.09,14600,2.09
Bolivia,73.6,0.607,101,25.4,1.96,7320,1.59
Dominica,73.7,0.839,83.3,27.7,2.34,17100,1.56
Dominican Republic,73.7,0.839,83.3,27.7,2.34,17100,1.56
Seychelles,73.8,1,198,14,6.75,28500,2.12
United Arab Emirates,73.8,0.986,201,7.16,21.4,65300,2.53
Bangladesh,73.9,0.482,102,27.7,0.531,4400,0.581
Bahamas,74.2,0.949,109,9.62,4.7,28300,2.01
Grenada,74.2,0.915,104,15.2,2.43,14700,1.41
Belize,74.5,0.879,65.3,12.4,1.5,7780,1.12
Honduras,74.5,0.813,72.7,16.6,1.04,4720,0.309
Belarus,74.6,0.978,123,3.26,6.93,18200,5.19
Morocco,74.6,0.885,128,20.6,1.84,7980,0.731
Trinidad and Tobago,74.6,0.934,155,17.5,31.3,28800,4.17
El Salvador,74.7,0.874,147,12.6,1.11,7610,1.57
Vietnam,74.8,0.835,141,20,2.16,7350,0.828
Bhutan,75,0.693,95.6,27.4,1.61,10200,0.424
Jamaica,75,0.873,103,13.8,2.79,8350,1.31
Bulgaria,75.2,0.86,116,6.53,6.32,20900,4.03
Malaysia,75.2,0.996,140,7.38,8.08,30000,1.54
Mauritius,75.2,0.955,151,14.8,3.83,22700,2.53
Latvia,75.5,0.921,109,3.64,3.73,28100,3.19
Lithuania,75.6,0.934,169,3.86,4.84,33500,6.35
Romania,75.6,0.843,117,6.87,3.8,26400,2.98
Mexico,75.7,0.912,95.1,12.3,3.79,18100,2.38
Brunei,75.8,0.963,129,11.1,18.5,75100,1.61
Armenia,76,0.936,122,11.7,1.89,10200,4.4
St. Lucia,76,0.884,102,15.9,2.31,12800,0.641
Brazil,76.1,0.883,98.8,13.5,2.18,14500,2.16
Serbia,76.2,0.976,96.4,5.16,5.17,17400,3.11
Cape Verde,76.4,0.739,108,18.1,1.16,7170,0.781
Paraguay,76.5,0.898,107,19.4,1.07,12300,1.35
Montenegro,76.8,0.978,183,2.38,3.2,18200,2.76
North Macedonia,76.9,0.991,98.7,9.69,3.49,14400,2.87
Argentina,77.1,0.943,131,9.4,4.41,17100,3.99
Bosnia and Herzegovina,77.1,0.954,112,5.5,6.53,13500,2.16
Iraq,77.2,0.941,95,25.1,5.32,16000,0.708
Hungary,77.3,0.98,106,3.99,5.14,30600,3.41
Saudi Arabia,77.3,1,121,6.49,18.4,48200,2.61
Antigua and Barbuda,77.4,0.875,193,6.09,5.88,25000,2.96
Ecuador,77.4,0.88,91.2,13.5,2.46,10100,2.04
Barbados,77.5,0.973,109,11.7,4.48,16700,2.48
Uruguay,77.5,0.966,138,7.2,2.01,21300,5.08
China,77.7,0.848,120,8.09,7.06,18100,1.98
Oman,77.8,1,138,10.4,13.9,36000,2
Slovak Republic,77.9,0.979,136,5.27,6.61,32900,3.42
Iran,78,0.884,142,13.4,8.81,15900,1.58
Sri Lanka,78,0.958,143,6.97,1.1,12400,1
Lebanon,78.1,0.985,61.8,7.32,3.53,11900,2.1
Algeria,78.3,0.876,109,22.2,3.69,14000,1.72
Poland,78.5,0.988,138,4.13,9.07,30900,2.38
Albania,78.6,0.977,91.3,8.52,1.59,13200,1.22
Cuba,78.6,0.928,53.3,4.82,2.53,8370,8.42
Estonia,78.6,0.991,147,2.4,14.8,32900,4.48
United States,78.6,1,129,6.62,16.6,57500,2.61
Thailand,78.8,0.988,186,8.49,4.15,17900,0.805
Tunisia,78.9,0.909,126,15.9,2.73,11300,1.3
Croatia,79,0.965,107,4.45,4.48,25300,3
Nicaragua,79.5,0.744,88.4,17.3,0.862,4530,0.978
Czech Republic,79.6,0.991,124,3.21,9.94,35000,4.12
Jordan,79.7,0.973,77,15.3,2.42,8440,2.32
Turkey,79.7,0.973,96.8,9.73,5.2,25500,1.85
Panama,79.8,0.833,132,14.6,2.62,24300,1.57
Bahrain,79.9,1,116,6.69,19.8,42000,0.926
Costa Rica,80,0.978,162,8.19,1.61,16000,2.89
Chile,80.1,1,132,6.86,4.59,23300,2.59
Qatar,80.6,1,138,6.49,38,116000,2.49
Colombia,80.7,0.896,132,13.5,1.96,14000,2.18
Peru,81,0.743,132,13.5,1.74,13300,1.3
Denmark,81.1,0.996,125,3.97,6.06,48900,4.01
Germany,81.1,0.992,128,3.24,9.14,46700,4.25
United Kingdom,81.2,0.991,118,4.21,5.65,40700,2.81
Greece,81.5,0.99,113,4.31,7.03,26300,5.48
Malta,81.5,1,144,6.61,3.61,40400,2.86
Slovenia,81.6,0.991,121,2.07,6.95,34600,3.09
Belgium,81.9,0.995,99.7,3.38,8.69,43900,3.07
Finland,81.9,0.994,129,1.58,8.52,42900,3.81
Netherlands,81.9,0.977,127,3.53,9.48,51200,3.61
Portugal,82,0.996,116,3.46,4.97,29800,5.12
Austria,82.1,1,120,3.21,7.75,47300,5.17
Luxembourg,82.1,0.976,136,2.31,15.9,95100,3.01
New Zealand,82.1,1,135,5.54,7.34,36700,3.59
Cyprus,82.2,0.992,144,2.22,6.3,35100,1.95
Canada,82.3,0.993,92.5,4.89,15.3,44500,2.61
Maldives,82.4,0.994,156,7.87,2.96,14900,4.56
Ireland,82.5,0.912,105,3.19,8.09,74100,3.31
Andorra,82.7,1,114,2.85,6.12,55000,3.33
Norway,82.7,0.981,107,2.36,8.31,67500,2.92
Australia,82.8,1,111,3.5,16.9,45800,3.68
Sweden,82.9,0.993,126,2.53,4.12,47400,3.98
France,83.2,0.987,111,3.83,5.2,40400,3.27
Iceland,83.2,0.988,122,1.89,10.8,47700,4.08
South Korea,83.2,1,134,2.91,12.9,38000,2.36
Israel,83.4,1,127,3.45,7.67,34400,4.62
Kuwait,83.4,1,174,7.42,23.7,64300,2.65
Spain,83.5,0.999,118,2.84,5.75,36200,3.87
Italy,83.6,0.988,133,2.83,5.58,36100,3.98
Switzerland,84.4,0.999,127,3.91,4.33,59100,4.3
Japan,84.7,0.999,141,2.34,9.14,40100,2.41
Singapore,85.3,1,156,2.61,7.1,90500,2.29