ages,x0,b,d,u
0,115383,0,0.0017,1060
1,118776,0,0.0004,1869
2,120030,0,0.0001,1201
3,124681,0,0.0001,1113
4,122848,0,0.0001,978
5,124569,0,0.0001,958
6,123335,0,0.0001,803
7,124541,0,0.0001,973
8,123471,0,0,925
9,128168,0,0,961
10,124897,0,0,974
11,123654,0,0.0001,996
12,121905,0,0,1015
13,121199,0,0.0001,1054
14,117364,0,0.0001,1026
15,116944,0.0002,0.0001,961
16,115523,0.0005,0.0001,1113
17,113220,0.0013,0.0002,1004
18,110326,0.0035,0.0003,1197
19,112896,0.0061,0.0003,1824
20,116615,0.0102,0.0004,3786
21,113130,0.0148,0.0005,2066
22,112295,0.0213,0.0004,1972
23,118181,0.0271,0.0003,2189
24,127478,0.0341,0.0004,2204
25,137195,0.0403,0.0006,2229
26,143233,0.0468,0.0005,2350
27,149623,0.053,0.0004,2164
28,153357,0.0595,0.0005,2115
29,156288,0.0584,0.0004,2247
30,149862,0.0616,0.0004,2031
31,147879,0.0583,0.0006,1988
32,141166,0.0564,0.0006,1790
33,139859,0.0515,0.0004,1600
34,137125,0.0465,0.0004,1548
35,132541,0.0403,0.0006,1415
36,129376,0.034,0.0006,1255
37,129609,0.0276,0.0007,1234
38,127537,0.0236,0.0007,1039
39,131535,0.0167,0.0006,995
40,127439,0.0118,0.0008,913
41,123405,0.0085,0.0007,782
42,124745,0.0048,0.0008,827
43,125676,0.0029,0.0008,670
44,129998,0.0018,0.001,634
45,135272,0.001,0.001,584
46,132678,0.0006,0.0012,509
47,134736,0.0002,0.0011,478
48,133927,0.0005,0.0012,367
49,130479,0,0.0013,379
50,127993,0,0.0014,338
51,132894,0,0.0015,316
52,138613,0,0.002,271
53,139269,0,0.0022,244
54,138986,0,0.0024,155
55,137804,0,0.0027,126
56,128099,0,0.003,146
57,121763,0,0.0035,139
58,117040,0,0.0037,46
59,115402,0,0.0038,105
60,115014,0,0.0045,31
61,113959,0,0.0052,25
62,114438,0,0.006,-18
63,113841,0,0.0063,7
64,111138,0,0.007,-21
65,108095,0,0.0074,-37
66,109510,0,0.0092,-30
67,107927,0,0.0091,5
68,105509,0,0.0102,-26
69,109007,0,0.0118,-14
70,111522,0,0.0126,-22
71,113904,0,0.0134,-2
72,113141,0,0.0153,-5
73,112310,0,0.0181,4
74,109538,0,0.0193,9
75,105077,0,0.0217,2
76,95932,0,0.0246,-4
77,85993,0,0.0265,-7
78,73767,0,0.0304,9
79,67829,0,0.0337,-14
80,65302,0,0.0398,1
81,60124,0,0.043,0
82,54029,0,0.0515,-9
83,49510,0,0.0583,-9
84,44085,0,0.0671,-2
85,39486,0,0.0771,-6
86,35646,0,0.0873,-7
87,33049,0,0.1025,-7
88,29430,0,0.1158,3
89,26018,0,0.1326,-1
90,21450,0,0.1552,1
91,18531,0,0.1755,-2
92,15006,0,0.1999,-4
93,12119,0,0.2314,-2
94,9538,0,0.2606,-4
95,7317,0,0.2953,0
96,5241,0,0.3358,-1
97,3655,0,0.3622,-2
98,2709,0,0.4282,-3
99,1854,0,0.4682,-1
