-570	2.213365890766629e+16
-569	5.39758212218229e+16
-568	6.185678015647539e+16
-567	6.333740847146421e+16
-566	6.362478001886658e+16
-565	6.363021286419293e+16
-564	6.353426745508451e+16
-563	6.338615352855176e+16
-562	6.3206659425944e+16
-561	6.300750009057338e+16
-560	6.279602063779798e+16
-559	6.123748929574205e+16
-558	6.5416904488180264e+16
-557	6.525138313783786e+16
-556	6.465808992665883e+16
-555	6.413753629190328e+16
-554	6.371281060644754e+16
-553	6.335622666110173e+16
-552	6.304431661769397e+16
-551	6.276139374591258e+16
-550	6.249738915556944e+16
-549	6.318100168577275e+16
-548	6.35804325535327e+16
-547	6.295954491937629e+16
-546	6.239564492527779e+16
-545	6.194950504788101e+16
-544	6.158648476220352e+16
-543	6.127674843607758e+16
-542	6.100082247621702e+16
-541	6.074647200751939e+16
-540	6.050604253218526e+16
-539	6.474232001786124e+16
-538	7.549576584034693e+16
-537	7.560592547065258e+16
-536	7.479591445469731e+16
-535	7.409245845468253e+16
-534	7.353049899889802e+16
-533	7.306341925006714e+16
-532	7.265550048524518e+16
-531	7.228432812601688e+16
-530	7.193623161515347e+16
-529	7.084870639499091e+16
-528	7.283847112530445e+16
-527	7.240573051171654e+16
-526	7.186764909061989e+16
-525	7.140611731960377e+16
-524	7.100522816615965e+16
-523	7.064280362461121e+16
-522	7.030430005006184e+16
-521	6.998087046959663e+16
-520	6.966718715056313e+16
-519	6.777978631388769e+16
-518	6.432529376834791e+16
-517	6.3978509989962184e+16
-516	6.384088135580687e+16
-515	6.36737323298448e+16
-514	6.347426393147909e+16
-513	6.325420735788804e+16
-512	6.302199044109912e+16
-511	6.278287047876314e+16
-510	6.254005900412565e+16
-509	6.14172668140689e+16
-508	5.760619451124427e+16
-507	5.731182493584451e+16
-506	5.723809758192157e+16
-505	5.7128354967838344e+16
-504	5.698129158946791e+16
-503	5.681016866793985e+16
-502	5.662445698940531e+16
-501	5.643012334968528e+16
-500	5.623085960108298e+16
-499	5.628697873715446e+16
-498	5.49345509560851e+16
-497	5.4685121338804216e+16
-496	5.4512292772748856e+16
-495	5.433535828101528e+16
-494	5.41518097085073e+16
-493	5.39641475765251e+16
-492	5.377426118153553e+16
-491	5.358334508334872e+16
-490	5.339213742864158e+16
-489	4.9500691739845144e+16
-488	4.973545633680252e+16
-487	4.9619186563400056e+16
-486	4.946916155038095e+16
-485	4.931231373240581e+16
-484	4.915255150398002e+16
-483	4.899133387822008e+16
-482	4.882949021802159e+16
-481	4.866752661195993e+16
-480	4.850575411799139e+16
-479	5.043684018775369e+16
-478	5.116849814724245e+16
-477	5.103651353796283e+16
-476	5.084566592524605e+16
-475	5.065629029442842e+16
-474	5.04710842847214e+16
-473	5.028899116880923e+16
-472	5.010914389530751e+16
-471	4.9930988992786504e+16
-470	4.975418180437675e+16
-469	4.885170966584319e+16
-468	4.7752203608625576e+16
-467	4.747786393138289e+16
-466	4.727805582835191e+16
-465	4.709418424524351e+16
-464	4.6918299756635336e+16
-463	4.674746314121806e+16
-462	4.65800002018254e+16
-461	4.641488858469184e+16
-460	4.625149809710957e+16
-459	5.200973462056728e+16
-458	5.391622083592236e+16
-457	5.387351368131843e+16
-456	5.365804173889675e+16
-455	5.342849312513076e+16
-454	5.319892527697536e+16
-453	5.297054833699167e+16
-452	5.274344450931609e+16
-451	5.251760279342803e+16
-450	5.229300792903166e+16
-449	2.327343560883611e+16
-448	2.4036092716566736e+16
-447	2.393048480772549e+16
-446	2.380003675902357e+16
-445	2.367860394922864e+16
-444	2.356402869155699e+16
-443	2.345391528793373e+16
-442	2.334674635182835e+16
-441	2.324158908831768e+16
-440	2.313787058353104e+16
-439	1.5778384437287984e+16
-438	1.6388328164819872e+16
-437	1.6338757604045712e+16
-436	1.6266070154328016e+16
-435	1.6192983625173792e+16
-434	1.6120283224623392e+16
-433	1.6047981687333376e+16
-432	1.5976069347312656e+16
-431	1.5904538803774992e+16
-430	1.5833384616091264e+16
-429	4853530250727984.0
-428	4512224180271360.0
-427	4492022271553440.0
-426	4473989049706304.0
-425	4454816337256208.0
-424	4434950789089504.0
-423	4414699085593920.0
-422	4394250136394176.0
-421	4373719926001152.0
-420	4353179560248080.0
-419	-8952080583266112.0
-418	-7448460732633760.0
-417	-7483589301826752.0
-416	-7467399990055840.0
-415	-7446860206648000.0
-414	-7422913207073120.0
-413	-7396913511993056.0
-412	-7369680362433104.0
-411	-7341721964240512.0
-410	-7313353019521344.0
-409	1.714372683517144e+16
-408	1.7696293844188048e+16
-407	1.7752140928216336e+16
-406	1.7741086126915248e+16
-405	1.7701141057808672e+16
-404	1.7643881105667568e+16
-403	1.7575959425828944e+16
-402	1.7501531969352416e+16
-401	1.7423207225827152e+16
-400	1.734262003720272e+16
-399	2.3416805027528304e+16
-398	2.450321535945656e+16
-397	2.44951581053776e+16
-396	2.440234255451531e+16
-395	2.429671508584053e+16
-394	2.4185972410673024e+16
-393	2.407245755615288e+16
-392	2.3957475038583616e+16
-391	2.384183065326008e+16
-390	2.372602718736853e+16
-389	1.4457074549871184e+16
-388	1.5080668575962336e+16
-387	1.5018089151252432e+16
-386	1.4935630570348592e+16
-385	1.4857409516925504e+16
-384	1.4782638335397264e+16
-383	1.4710188912029376e+16
-382	1.4639330529417648e+16
-381	1.4569604718023824e+16
-380	1.45007239709e+16
-379	1.88091732671e+15
-378	1.87378664371e+15
-377	1.98657690704e+15
-376	2.06827964529e+15
-375	2.12282103944e+15
-374	2.15615972338e+15
-373	2.1729806568e+15
-372	2.17690066612e+15
-371	2.17073245888e+15
-370	2.15668482536e+15
-369	-1.28317294584e+16
-368	-1.23500268097e+16
-367	-1.21935166309e+16
-366	-1.20208841803e+16
-365	-1.18473550055e+16
-364	-1.16719035489e+16
-363	-1.14949836319e+16
-362	-1.13173163972e+16
-361	-1.11397412249e+16
-360	-1.09631062908e+16
-359	-3.74165912186e+16
-358	-3.47512591322e+16
-357	-3.46112998001e+16
-356	-3.40962973089e+16
-355	-3.36450760581e+16
-354	-3.31961353529e+16
-353	-3.27591037494e+16
-352	-3.23338324219e+16
-351	-3.19212894955e+16
-350	-3.15408664912e+16
-349	-4.31863887288e+16
-348	-3.91610175924e+16
-347	-4.01618642817e+16
-346	-4.0097487258e+16
-345	-4.01242321053e+16
-344	-4.00712931933e+16
-343	-3.99924210553e+16
-342	-3.98927602914e+16
-341	-3.97807730799e+16
-340	-3.96609145918e+16
-339	-4.77819874375e+16
-338	-3.60435816703e+16
-337	-3.95191990032e+16
-336	-3.89755404628e+16
-335	-3.92400667721e+16
-334	-3.9222038873e+16
-333	-3.92120814979e+16
-332	-3.91617461937e+16
-331	-3.90959688922e+16
-330	-3.90176064284e+16
-329	-4.72023900707e+16
-328	-4.15170476406e+16
-327	-4.30868109562e+16
-326	-4.25159706326e+16
-325	-4.25649922864e+16
-324	-4.24327644077e+16
-323	-4.23520067035e+16
-322	-4.22558594538e+16
-321	-4.21637531901e+16
-320	-4.20702548789e+16
-319	-5.16248520875e+16
-318	-4.89281721979e+16
-317	-4.94636103384e+16
-316	-4.89707907679e+16
-315	-4.88924845975e+16
-314	-4.87117803991e+16
-313	-4.8591104349e+16
-312	-4.84663662167e+16
-311	-4.83534147283e+16
-310	-4.82431987932e+16
-309	-5.61433607141e+16
-308	-5.4558048746e+16
-307	-5.47227669469e+16
-306	-5.43258367522e+16
-305	-5.42083562799e+16
-304	-5.40288974238e+16
-303	-5.38998879561e+16
-302	-5.3769544433e+16
-301	-5.3650734767e+16
-300	-5.35346714889e+16
-299	-5.42822138898e+16
-298	-5.57521303438e+16
-297	-5.50927076906e+16
-296	-5.51454315738e+16
-295	-5.49616037609e+16
-294	-5.4856647783e+16
-293	-5.47259185095e+16
-292	-5.46038303088e+16
-291	-5.44790104404e+16
-290	-5.43551370376e+16
-289	-4.95767060695e+16
-288	-4.54993534058e+16
-287	-4.71274559677e+16
-286	-4.67944313621e+16
-285	-4.69728193626e+16
-284	-4.69204214922e+16
-283	-4.68957629874e+16
-282	-4.6832968438e+16
-281	-4.67630425565e+16
-280	-4.6682908415e+16
-279	-4.58397699842e+16
-278	-4.7505076432e+16
-277	-4.68023959846e+16
-276	-4.68182079735e+16
-275	-4.66474957394e+16
-274	-4.65440131504e+16
-273	-4.64301340623e+16
-272	-4.632494972e+16
-271	-4.62210210079e+16
-270	-4.61191594677e+16
-269	-2.76358933929e+16
-268	-3.20792469739e+16
-267	-3.13113245377e+16
-266	-3.12521147638e+16
-265	-3.1118183124e+16
-264	-3.10060288921e+16
-263	-3.08988586127e+16
-262	-3.07961645644e+16
-261	-3.06962798185e+16
-260	-3.05983035408e+16
-259	7.27897488293e+15
-258	9.54980322283e+15
-257	9.60578871233e+15
-256	9.57142764952e+15
-255	9.52975815011e+15
-254	9.48501290118e+15
-253	9.43842837635e+15
-252	9.39075787606e+15
-251	9.34248605356e+15
-250	9.29392522549e+15
-249	9.10904201545e+15
-248	9.41575999093e+15
-247	9.38983745334e+15
-246	9.34904554917e+15
-245	9.30470417466e+15
-244	9.25834403432e+15
-243	9.21078442827e+15
-242	9.16255016993e+15
-241	9.11398016021e+15
-240	9.06529305506e+15
-239	9.34261636896e+15
-238	8.86842873005e+15
-237	8.8034986184e+15
-236	8.75317646842e+15
-235	8.7050106045e+15
-234	8.65810734717e+15
-233	8.61210049454e+15
-232	8.5667592645e+15
-231	8.52193425843e+15
-230	8.47752845429e+15
-229	3.61239606551e+16
-228	3.70572851733e+16
-227	3.69088737354e+16
-226	3.66791819048e+16
-225	3.64545717925e+16
-224	3.6238930555e+16
-223	3.6030002793e+16
-222	3.5825897684e+16
-221	3.562535439e+16
-220	3.54275536778e+16
-219	4.38977571591e+16
-218	4.28190809229e+16
-217	4.24389098444e+16
-216	4.21517391013e+16
-215	4.18883163788e+16
-214	4.16369635862e+16
-213	4.1393537805e+16
-212	4.11557169346e+16
-211	4.09220396721e+16
-210	4.06915661403e+16
-209	4.01549144429e+16
-208	4.10467136e+16
-207	4.10176765713e+16
-206	4.08528960124e+16
-205	4.06496162413e+16
-204	4.04272476872e+16
-203	4.01937693778e+16
-202	3.99538556176e+16
-201	3.97104703979e+16
-200	3.94655163724e+16
-199	3.36031215784e+16
-198	3.24047370632e+16
-197	3.21432203174e+16
-196	3.19589863254e+16
-195	3.17774327683e+16
-194	3.15937804045e+16
-193	3.1408857689e+16
-192	3.12235486711e+16
-191	3.1038452277e+16
-190	3.08539543891e+16
-189	2.29784186652e+16
-188	2.38263749582e+16
-187	2.36744216546e+16
-186	2.34903096215e+16
-185	2.33241589969e+16
-184	2.31722018839e+16
-183	2.3029785231e+16
-182	2.28937843565e+16
-181	2.27621831915e+16
-180	2.26336844424e+16
-179	1.76577635388e+16
-178	2.0206183392e+16
-177	2.01126633267e+16
-176	1.99263113008e+16
-175	1.97607505355e+16
-174	1.96124389964e+16
-173	1.9475558193e+16
-172	1.93462434583e+16
-171	1.92220274465e+16
-170	1.91013373129e+16
-169	1.34386783467e+16
-168	1.38214771905e+16
-167	1.36967826879e+16
-166	1.3577595823e+16
-165	1.34732450533e+16
-164	1.33788199313e+16
-163	1.32908578095e+16
-162	1.32071597017e+16
-161	1.31263344829e+16
-160	1.30475012124e+16
-159	7.5005656088e+15
-158	7.29001273351e+15
-157	7.24806391651e+15
-156	7.20982551996e+15
-155	7.17194477891e+15
-154	7.13432421634e+15
-153	7.09694215916e+15
-152	7.05978524594e+15
-151	7.0228445936e+15
-150	6.98611414351e+15
-149	1.95825452826e+16
-148	1.96241812798e+16
-147	1.95771600997e+16
-146	1.95210999592e+16
-145	1.94616529656e+16
-144	1.94001925607e+16
-143	1.93374827001e+16
-142	1.92740035785e+16
-141	1.92100602056e+16
-140	1.91458465972e+16
-139	-2.66722659524e+15
-138	-2.39381502858e+15
-137	-2.3904582399e+15
-136	-2.38436118981e+15
-135	-2.37826425525e+15
-134	-2.48332924604e+15
-133	-2.73192277882e+15
-132	-2.67428766079e+15
-131	-2.63716472611e+15
-130	-2.61127149703e+15
-129	-1.76035855352e+16
-128	-1.80550969687e+16
-127	-1.78054741814e+16
-126	-1.76551817353e+16
-125	-1.75444900537e+16
-124	-1.73459056794e+16
-123	-1.70620118191e+16
-122	-1.70489628034e+16
-121	-1.70157321611e+16
-120	-1.69771682268e+16
-119	-2.10207415283e+16
-118	-2.08630988752e+16
-117	-2.07736137115e+16
-116	-2.06987526089e+16
-115	-2.06339372048e+16
-114	-2.08215699259e+16
-113	-2.12108953724e+16
-112	-2.10487755063e+16
-111	-2.0947141454e+16
-110	-2.08635815373e+16
-109	-1.65214354567e+16
-108	-1.66525581378e+16
-107	-1.65833276752e+16
-106	-1.65310996981e+16
-105	-1.64838794227e+16
-104	-1.61275091564e+16
-103	-1.55449470413e+16
-102	-1.56301726041e+16
-101	-1.56506275871e+16
-100	-1.56495379584e+16
-99	-1.14314364939e+16
-98	-1.11499690556e+16
-97	-1.12226057904e+16
-96	-1.12531251226e+16
-95	-1.12642091517e+16
-94	-1.08984700861e+16
-93	-1.03148516242e+16
-92	-1.04150073663e+16
-91	-1.0458503093e+16
-90	-1.04797574115e+16
-89	-7.87378257398e+15
-88	-7.76124025892e+15
-87	-7.79285374972e+15
-86	-7.80621897534e+15
-85	-7.81028903452e+15
-84	-7.86302514724e+15
-83	-7.88639243153e+15
-82	-7.86267528032e+15
-81	-7.84367647505e+15
-80	-7.81301120242e+15
-79	-8.57657812601e+15
-78	-8.19164012156e+15
-77	-8.15776347063e+15
-76	-8.12421028579e+15
-75	-8.0963238308e+15
-74	-8.02571113585e+15
-73	-7.79567286324e+15
-72	-7.79237964151e+15
-71	-7.78028601753e+15
-70	-7.76629197449e+15
-69	-8.59153340106e+15
-68	-7.87827469948e+15
-67	-7.89450306055e+15
-66	-7.88065439627e+15
-65	-7.86063475567e+15
-64	-7.90315098588e+15
-63	-8.14031282417e+15
-62	-8.07334819413e+15
-61	-8.02361021858e+15
-60	-7.97959563861e+15
-59	-4.44276802536e+15
-58	-4.53208585622e+15
-57	-4.49627840821e+15
-56	-4.46812052096e+15
-55	-4.44386261865e+15
-54	-4.46278339422e+15
-53	-4.52285929919e+15
-52	-4.48927307587e+15
-51	-4.46202064865e+15
-50	-4.43808631915e+15
-49	-3.92502261876e+15
-48	-3.83761923409e+15
-47	-3.83428073967e+15
-46	-3.82604865446e+15
-45	-3.81530412358e+15
-44	-3.67147575956e+15
-43	-3.36200222835e+15
-42	-3.39837677033e+15
-41	-3.41489827612e+15
-40	-3.42116936848e+15
-39	-4.29684555776e+15
-38	-3.84433258382e+15
-37	-3.87037604015e+15
-36	-3.87687006608e+15
-35	-3.87516078648e+15
-34	-3.8158050766e+15
-33	-3.52051622193e+15
-32	-3.53285034817e+15
-31	-3.53325058461e+15
-30	-3.52867631478e+15
-29	2.60330464164e+15
-28	2.54570628576e+15
-27	2.54072398893e+15
-26	2.53510911231e+15
-25	2.5288342614e+15
-24	2.52459605761e+15
-23	2.40009890478e+15
-22	2.39631777327e+15
-21	2.3920800727e+15
-20	2.38699935588e+15
-19	9.61758489853e+15
-18	9.15298921608e+15
-17	9.1194964432e+15
-16	9.09962291262e+15
-15	9.07957242264e+15
-14	9.06806640969e+15
-13	8.98868486804e+15
-12	8.96612455713e+15
-11	8.94528149688e+15
-10	8.92438304672e+15
-9	1.3852125252e+16
-8	1.33200244313e+16
-7	1.3265889365e+16
-6	1.3238839737e+16
-5	1.32131869512e+16
-4	1.33112628288e+16
-3	1.31773342772e+16
-2	1.31321804214e+16
-1	1.30965186749e+16
0	1.30643831054e+16