-570	-0.027
-569	-0.027006256368479635
-568	-0.027010576855117156
-567	-0.027014440191894792
-566	-0.027018185086673814
-565	-0.027021883410441754
-564	-0.02702555720336278
-563	-0.027029216697229987
-562	-0.027032867859371954
-561	-0.027036514446640233
-560	-0.027040158868812322
-559	-0.027043802672809095
-558	-0.02704751970755368
-557	-0.02705109684189931
-556	-0.027054723365252487
-555	-0.027058402662862777
-554	-0.027062119439882685
-553	-0.02706586137105445
-552	-0.027069620193416254
-551	-0.027073390549597884
-550	-0.027077168983402743
-549	-0.02708095326055673
-548	-0.0270846782711524
-547	-0.027088443731443094
-546	-0.02709227508500184
-545	-0.027096153144684942
-544	-0.027100061609935208
-543	-0.027103989713573293
-542	-0.02710793060513282
-541	-0.027111879947578785
-540	-0.027115834990267488
-539	-0.027119793980976786
-538	-0.027124447269194777
-537	-0.027128397302365024
-536	-0.027132411187861718
-535	-0.027136528679520003
-534	-0.027140722337199216
-533	-0.027144969353339553
-532	-0.027149255075201974
-531	-0.02715357043275099
-530	-0.027157909831098184
-529	-0.027162269804965656
-528	-0.02716682172813182
-527	-0.027171268893581037
-526	-0.027175776041398935
-525	-0.02718033742602356
-524	-0.027184938646406902
-523	-0.027189569860381086
-522	-0.027194224972866034
-521	-0.027198900248646064
-520	-0.027203593385639543
-519	-0.027208302947197657
-518	-0.02721301100489177
-517	-0.02721793827811414
-516	-0.02722285867639547
-515	-0.02722776565087909
-514	-0.027232667426431614
-513	-0.027237570125543533
-512	-0.027242477547128035
-511	-0.027247391975788078
-510	-0.027252314763903756
-509	-0.027257246694834536
-508	-0.027261759043949743
-507	-0.02726651286696401
-506	-0.02727125184765291
-505	-0.027275970234424653
-504	-0.027280677905301934
-503	-0.027285382118798565
-502	-0.02729008742687807
-501	-0.02729479661433779
-500	-0.02729951136702204
-499	-0.02730423269205397
-498	-0.027308485613777887
-497	-0.02731282857643043
-496	-0.02731717860447389
-495	-0.027321531880019182
-494	-0.027325890079318096
-493	-0.02733025455705224
-492	-0.02733462615096288
-491	-0.027339005351975615
-490	-0.02734339243425303
-489	-0.02734778753773826
-488	-0.027351763333427592
-487	-0.027355711744876894
-486	-0.027359661862291107
-485	-0.027363617252675988
-484	-0.027367579014760276
-483	-0.027371547723446306
-482	-0.027375523704740765
-481	-0.027379507136182247
-480	-0.027383498103799205
-479	-0.027387496636990135
-478	-0.02739094416542023
-477	-0.027394333617529874
-476	-0.02739773178924338
-475	-0.027401142514206736
-474	-0.027404565174395986
-473	-0.027407999129916476
-472	-0.0274114439425936
-471	-0.027414899315879857
-470	-0.027418365042117882
-469	-0.027421840968710687
-468	-0.027426331630892864
-467	-0.027430943689021586
-466	-0.02743558627418143
-465	-0.027440249395682632
-464	-0.02744493007210312
-463	-0.02744962665636567
-462	-0.02745433811686201
-461	-0.02745906378725078
-460	-0.02746380322550764
-459	-0.027468556127904352
-458	-0.02747311915296006
-457	-0.027477479939444247
-456	-0.02748184033268944
-455	-0.027486218233980963
-454	-0.027490615107073863
-453	-0.027495030961419385
-452	-0.027499465682648532
-451	-0.027503919148564995
-450	-0.02750839123817471
-449	-0.02751288183173084
-448	-0.02752008600713458
-447	-0.027527218925585833
-446	-0.027534357731975736
-445	-0.027541501395597228
-444	-0.027548646950835233
-443	-0.02755579242798924
-442	-0.0275629365720985
-441	-0.027570078572235274
-440	-0.02757721789063909
-439	-0.027584354157558826
-438	-0.02759228481420152
-437	-0.027600143966224094
-436	-0.027607987103612622
-435	-0.027615816113561734
-434	-0.027623630985049382
-433	-0.027631431648397924
-432	-0.027639218037488835
-431	-0.027646990090057447
-430	-0.02765474774653271
-429	-0.027662490949276603
-428	-0.027661729585034357
-427	-0.02766097054212839
-426	-0.02766021545877022
-425	-0.027659464119056218
-424	-0.02765871636960959
-423	-0.027657972110784176
-422	-0.027657231276130134
-421	-0.027656493819605048
-420	-0.02765575970772054
-419	-0.02765502891471872
-418	-0.027645935614131235
-417	-0.02763702121564238
-416	-0.02762817244371258
-415	-0.027619386560390702
-414	-0.02761065990628968
-413	-0.027601990122306616
-412	-0.027593375600195133
-411	-0.02758481519730112
-410	-0.027576308059630714
-409	-0.02756785351281316
-408	-0.027565670283877183
-407	-0.027563522232845302
-406	-0.027561392599652863
-405	-0.02755927633325022
-404	-0.02755717057352409
-403	-0.027555073551414816
-402	-0.02755298416343449
-401	-0.027550901720765568
-400	-0.027548825793573806
-399	-0.02754675611385134
-398	-0.027548992545950113
-397	-0.02755118927647333
-396	-0.027553378441204146
-395	-0.027555563255179678
-394	-0.02755774459639271
-393	-0.027559922928875984
-392	-0.027562098526812365
-391	-0.02756427154998275
-390	-0.027566442086799404
-389	-0.027568610181025167
-388	-0.027572964513793385
-387	-0.027577280792796297
-386	-0.02758159297329765
-385	-0.02758590070982423
-384	-0.02759020290266225
-383	-0.027594498816597066
-382	-0.027598787978543617
-381	-0.02760307008115146
-380	-0.027607344921107134
-379	-0.0276116123604
-378	-0.0276150234155
-377	-0.0276184262641
-376	-0.0276218154785
-375	-0.0276251912335
-374	-0.0276285539084
-373	-0.0276319038923
-372	-0.0276352415473
-371	-0.027638567195
-370	-0.027641881113
-369	-0.0276451835358
-368	-0.0276511517598
-367	-0.0276570789138
-366	-0.0276629781581
-365	-0.0276688467768
-364	-0.0276746836234
-363	-0.0276804880042
-362	-0.0276862595628
-361	-0.0276919981733
-360	-0.0276977038713
-359	-0.0277033768073
-358	-0.0277049707558
-357	-0.0277065249779
-356	-0.0277080683164
-355	-0.0277095967131
-354	-0.0277111110509
-353	-0.0277126115199
-352	-0.0277140984119
-351	-0.0277155720112
-350	-0.0277170326072
-349	-0.0277184806898
-348	-0.027717312299
-347	-0.0277161922871
-346	-0.0277150755431
-345	-0.0277139691427
-344	-0.0277128711685
-343	-0.0277117815203
-342	-0.0277106999071
-341	-0.0277096261544
-340	-0.027708560119
-339	-0.0277075016852
-338	-0.0277036980041
-337	-0.0277002713131
-336	-0.0276967939971
-335	-0.0276933664863
-334	-0.0276899616516
-333	-0.0276865835123
-332	-0.0276832295131
-331	-0.0276798991394
-330	-0.0276765917067
-329	-0.0276733067709
-328	-0.0276669433154
-327	-0.0276608782686
-326	-0.0276547824992
-325	-0.027648751632
-324	-0.0276427574739
-323	-0.02763680758
-322	-0.0276308992389
-321	-0.0276250326996
-320	-0.0276192073793
-319	-0.0276134229426
-318	-0.0276040750163
-317	-0.0275949329691
-316	-0.0275858050868
-315	-0.0275767607722
-314	-0.0275677781758
-313	-0.02755886556
-312	-0.0275500203615
-311	-0.027541243254
-310	-0.0275325335668
-309	-0.0275238909126
-308	-0.0275115101868
-307	-0.027499312343
-306	-0.0274871732357
-305	-0.027475143669
-304	-0.0274632065912
-303	-0.0274513690894
-302	-0.0274396284854
-301	-0.0274279852003
-300	-0.0274164381957
-299	-0.0274049867688
-298	-0.0273998209861
-297	-0.0273946440136
-296	-0.0273895252702
-295	-0.0273844412119
-294	-0.0273793990739
-293	-0.0273743959303
-292	-0.0273694321979
-291	-0.0273645072038
-290	-0.0273596206359
-289	-0.0273547720708
-288	-0.0273503098622
-287	-0.0273460269462
-286	-0.0273417397936
-285	-0.0273375007337
-284	-0.0273332900491
-283	-0.0273291116668
-282	-0.0273249627883
-281	-0.0273208431642
-280	-0.0273167520307
-279	-0.0273126889685
-278	-0.0273087389152
-277	-0.0273047605996
-276	-0.0273008227234
-275	-0.0272969059758
-274	-0.0272930160961
-273	-0.0272891514717
-272	-0.0272853124762
-271	-0.0272814988481
-270	-0.0272777104609
-269	-0.0272739471217
-268	-0.0272768107136
-267	-0.0272797720529
-266	-0.0272827059051
-265	-0.0272856276496
-264	-0.0272885347395
-263	-0.0272914272017
-262	-0.0272943048774
-261	-0.0272971677274
-260	-0.0273000157592
-259	-0.0273028490138
-258	-0.027306859708
-257	-0.0273107333568
-256	-0.0273145905574
-255	-0.02731843821
-254	-0.0273222780698
-253	-0.0273261111809
-252	-0.0273299382084
-251	-0.027333759574
-250	-0.027337575543
-249	-0.0273413862795
-248	-0.0273450224108
-247	-0.0273486297513
-246	-0.0273522277756
-245	-0.0273558186637
-244	-0.0273594035091
-243	-0.0273629830029
-242	-0.0273665575847
-241	-0.0273701275317
-240	-0.0273736930157
-239	-0.0273772541404
-238	-0.0273787437038
-237	-0.0273802407634
-236	-0.0273817365854
-235	-0.0273832305996
-234	-0.0273847225844
-233	-0.0273862123991
-232	-0.0273876999508
-231	-0.0273891851775
-230	-0.0273906680374
-229	-0.0273921485019
-228	-0.0273964943384
-227	-0.0274007705708
-226	-0.0274050596106
-225	-0.0274093654961
-224	-0.0274136862365
-223	-0.0274180200805
-222	-0.0274223658125
-221	-0.0274267225975
-220	-0.0274310898501
-219	-0.0274354671467
-218	-0.0274399824107
-217	-0.0274445957841
-216	-0.0274492428327
-215	-0.027453912777
-214	-0.0274586017731
-213	-0.0274633076102
-212	-0.0274680288405
-211	-0.0274727644778
-210	-0.0274775138313
-209	-0.0274822764001
-208	-0.0274864018771
-207	-0.0274904271106
-206	-0.0274944353187
-205	-0.0274984425647
-204	-0.0275024551832
-203	-0.027506476788
-202	-0.0275105096094
-201	-0.0275145550222
-200	-0.0275186138519
-199	-0.0275226865697
-198	-0.0275271230718
-197	-0.0275316400813
-196	-0.0275361669732
-195	-0.0275406989774
-194	-0.027545236657
-193	-0.0275497806603
-192	-0.0275543313873
-191	-0.0275588890504
-190	-0.0275634537379
-189	-0.0275680254581
-188	-0.0275748166357
-187	-0.0275815444797
-186	-0.0275882985974
-185	-0.0275950746251
-184	-0.0276018657914
-183	-0.0276086674378
-182	-0.0276154764989
-181	-0.0276222909516
-180	-0.0276291094462
-179	-0.0276359310675
-178	-0.0276422326936
-177	-0.0276483230248
-176	-0.0276544398763
-175	-0.0276605825096
-174	-0.0276667427359
-173	-0.0276729149057
-172	-0.0276790953421
-171	-0.0276852816481
-170	-0.0276914722466
-169	-0.0276976660852
-168	-0.0276995536019
-167	-0.0277014365029
-166	-0.0277033247313
-165	-0.0277052158818
-164	-0.0277071081167
-163	-0.02770900025
-162	-0.0277108915201
-161	-0.0277127814363
-160	-0.0277146696799
-159	-0.0277165560412
-158	-0.0277153554157
-157	-0.0277141549446
-156	-0.0277129572088
-155	-0.0277117622746
-154	-0.0277105701522
-153	-0.0277093808469
-152	-0.0277081943617
-151	-0.027707010698
-150	-0.0277058298559
-149	-0.0277046518353
-148	-0.0277048962041
-147	-0.0277051396531
-146	-0.0277053825645
-145	-0.0277056250192
-144	-0.0277058670602
-143	-0.0277061087143
-142	-0.0277063499983
-141	-0.0277065909227
-140	-0.0277068314939
-139	-0.0277070717158
-138	-0.0277044735991
-137	-0.027701892644
-136	-0.0276993216929
-135	-0.0276967607698
-134	-0.027694209829
-133	-0.027691434023
-132	-0.0276886185256
-131	-0.0276857882359
-130	-0.0276829534311
-129	-0.0276801205973
-128	-0.0276792545409
-127	-0.0276783821661
-126	-0.0276775111633
-125	-0.0276766427774
-124	-0.0276757778986
-123	-0.027674926592
-122	-0.0276740826371
-121	-0.0276732438284
-120	-0.027672409995
-119	-0.0276715809774
-118	-0.0276644136274
-117	-0.0276572841158
-116	-0.0276501939096
-115	-0.027643145155
-114	-0.0276361389562
-113	-0.0276290420575
-112	-0.0276219439028
-111	-0.0276148821082
-110	-0.0276078594489
-109	-0.0276008783748
-108	-0.0275890508925
-107	-0.0275772721318
-106	-0.0275655646688
-105	-0.0275539300681
-104	-0.0275423694546
-103	-0.0275312215142
-102	-0.0275202488769
-101	-0.0275093712534
-100	-0.0274985788136
-99	-0.0274878640033
-98	-0.02748328992
-97	-0.0274787833001
-96	-0.0274743174779
-95	-0.0274698855922
-94	-0.0274654831818
-93	-0.0274613027013
-92	-0.0274572011362
-91	-0.0274531390892
-90	-0.0274491092257
-89	-0.0274451065107
-88	-0.0274417321058
-87	-0.0274383930041
-86	-0.0274350780957
-85	-0.0274317837507
-84	-0.0274285075966
-83	-0.0274251883982
-82	-0.0274218785422
-81	-0.0274185809815
-80	-0.0274152965143
-79	-0.02741202605
-78	-0.0274037617287
-77	-0.0273955441418
-76	-0.0273873571732
-75	-0.0273792056942
-74	-0.0273710922968
-73	-0.0273629328929
-72	-0.0273548385831
-71	-0.0273467909142
-70	-0.0273387882925
-69	-0.0273308293799
-68	-0.0273279802603
-67	-0.0273251701131
-66	-0.0273223787522
-65	-0.0273196045639
-64	-0.0273168462155
-63	-0.0273140865601
-62	-0.0273113268983
-61	-0.0273085768643
-60	-0.0273058378731
-59	-0.027303110902
-58	-0.0273051396721
-57	-0.0273071699342
-56	-0.0273091964676
-55	-0.02731121748
-54	-0.0273132318451
-53	-0.0273152681454
-52	-0.0273173040225
-51	-0.0273193352413
-50	-0.0273213602576
-49	-0.0273233781129
-48	-0.0273211666313
-47	-0.027318972521
-46	-0.0273167918318
-45	-0.0273146231613
-44	-0.0273124656096
-43	-0.0273104394422
-42	-0.0273084526192
-41	-0.0273064891384
-40	-0.0273045433256
-39	-0.0273026115633
-38	-0.0273006193637
-37	-0.0272986614952
-36	-0.0272967226813
-35	-0.0272947990014
-34	-0.0272928878598
-33	-0.0272909603681
-32	-0.0272890575675
-31	-0.027287169785
-30	-0.0272852944648
-29	-0.0272834298944
-28	-0.0272744900373
-27	-0.0272656044184
-26	-0.0272567700745
-25	-0.0272479819824
-24	-0.0272392367892
-23	-0.0272302373207
-22	-0.0272212972713
-21	-0.0272124160244
-20	-0.0272035863629
-19	-0.0271948034633
-18	-0.0271783427469
-17	-0.0271618973305
-16	-0.0271455328361
-15	-0.0271292493158
-14	-0.027113045208
-13	-0.027096774974
-12	-0.0270805743793
-11	-0.0270644514978
-10	-0.0270484059389
-9	-0.0270324371098
-8	-0.0270022490862
-7	-0.0269720834856
-6	-0.0269420835259
-5	-0.0269122559401
-4	-0.026882599756
-3	-0.0268521449707
-2	-0.0268217899072
-1	-0.0267915769522
0	-0.0267615190073