-570	1.12
-569	1.064
-568	1.064
-567	1.064
-566	1.064
-565	1.064
-564	1.064
-563	1.064
-562	1.064
-561	1.064
-560	1.064
-559	1.0080000000000002
-558	1.0080000000000002
-557	1.0080000000000002
-556	1.0080000000000002
-555	1.0080000000000002
-554	1.0080000000000002
-553	1.0080000000000002
-552	1.0080000000000002
-551	1.0080000000000002
-550	1.0080000000000002
-549	0.9520000000000001
-548	0.9520000000000001
-547	0.9520000000000001
-546	0.9520000000000001
-545	0.9520000000000001
-544	0.9520000000000001
-543	0.9520000000000001
-542	0.9520000000000001
-541	0.9520000000000001
-540	0.9520000000000001
-539	0.7392000000000001
-538	0.7392000000000001
-537	0.7392000000000001
-536	0.7392000000000001
-535	0.7392000000000001
-534	0.7392000000000001
-533	0.7392000000000001
-532	0.7392000000000001
-531	0.7392000000000001
-530	0.7392000000000001
-529	0.7168000000000001
-528	0.7168000000000001
-527	0.7168000000000001
-526	0.7168000000000001
-525	0.7168000000000001
-524	0.7168000000000001
-523	0.7168000000000001
-522	0.7168000000000001
-521	0.7168000000000001
-520	0.7168000000000001
-519	0.7260000000000001
-518	0.7260000000000001
-517	0.7260000000000001
-516	0.7260000000000001
-515	0.7260000000000001
-514	0.7260000000000001
-513	0.7260000000000001
-512	0.7260000000000001
-511	0.7260000000000001
-510	0.7260000000000001
-509	0.6955000000000001
-508	0.6955000000000001
-507	0.6955000000000001
-506	0.6955000000000001
-505	0.6955000000000001
-504	0.6955000000000001
-503	0.6955000000000001
-502	0.6955000000000001
-501	0.6955000000000001
-500	0.6955000000000001
-499	0.6695000000000001
-498	0.6695000000000001
-497	0.6695000000000001
-496	0.6695000000000001
-495	0.6695000000000001
-494	0.6695000000000001
-493	0.6695000000000001
-492	0.6695000000000001
-491	0.6695000000000001
-490	0.6695000000000001
-489	0.5952
-488	0.5952
-487	0.5952
-486	0.5952
-485	0.5952
-484	0.5952
-483	0.5952
-482	0.5952
-481	0.5952
-480	0.5952
-479	0.5704
-478	0.5704
-477	0.5704
-476	0.5704
-475	0.5704
-474	0.5704
-473	0.5704
-472	0.5704
-471	0.5704
-470	0.5704
-469	0.558
-468	0.558
-467	0.558
-466	0.558
-465	0.558
-464	0.558
-463	0.558
-462	0.558
-461	0.558
-460	0.558
-459	0.67
-458	0.67
-457	0.67
-456	0.67
-455	0.67
-454	0.67
-453	0.67
-452	0.67
-451	0.67
-450	0.67
-449	0.6930000000000001
-448	0.6930000000000001
-447	0.6930000000000001
-446	0.6930000000000001
-445	0.6930000000000001
-444	0.6930000000000001
-443	0.6930000000000001
-442	0.6930000000000001
-441	0.6930000000000001
-440	0.6930000000000001
-439	0.8122
-438	0.8122
-437	0.8122
-436	0.8122
-435	0.8122
-434	0.8122
-433	0.8122
-432	0.8122
-431	0.8122
-430	0.8122
-429	0.9472
-428	0.9472
-427	0.9472
-426	0.9472
-425	0.9472
-424	0.9472
-423	0.9472
-422	0.9472
-421	0.9472
-420	0.9472
-419	0.925
-418	0.925
-417	0.925
-416	0.925
-415	0.925
-414	0.925
-413	0.925
-412	0.925
-411	0.925
-410	0.925
-409	0.9102
-408	0.9102
-407	0.9102
-406	0.9102
-405	0.9102
-404	0.9102
-403	0.9102
-402	0.9102
-401	0.9102
-400	0.9102
-399	0.8784
-398	0.8784
-397	0.8784
-396	0.8784
-395	0.8784
-394	0.8784
-393	0.8784
-392	0.8784
-391	0.8784
-390	0.8784
-389	0.8348999999999999
-388	0.8348999999999999
-387	0.8348999999999999
-386	0.8348999999999999
-385	0.8348999999999999
-384	0.8348999999999999
-383	0.8348999999999999
-382	0.8348999999999999
-381	0.8348999999999999
-380	0.8348999999999999
-379	0.8348999999999999
-378	0.8348999999999999
-377	0.8348999999999999
-376	0.8348999999999999
-375	0.8348999999999999
-374	0.8348999999999999
-373	0.8348999999999999
-372	0.8348999999999999
-371	0.8348999999999999
-370	0.8348999999999999
-369	0.847
-368	0.847
-367	0.847
-366	0.847
-365	0.847
-364	0.847
-363	0.847
-362	0.847
-361	0.847
-360	0.847
-359	0.8833
-358	0.8833
-357	0.8833
-356	0.8833
-355	0.8833
-354	0.8833
-353	0.8833
-352	0.8833
-351	0.8833
-350	0.8833
-349	0.9196
-348	0.9196
-347	0.9196
-346	0.9196
-345	0.9196
-344	0.9196
-343	0.9196
-342	0.9196
-341	0.9196
-340	0.9196
-339	0.9163
-338	0.9163
-337	0.9163
-336	0.9163
-335	0.9163
-334	0.9163
-333	0.9163
-332	0.9163
-331	0.9163
-330	0.9163
-329	0.9085
-328	0.9085
-327	0.9085
-326	0.9085
-325	0.9085
-324	0.9085
-323	0.9085
-322	0.9085
-321	0.9085
-320	0.9085
-319	0.9119999999999999
-318	0.9119999999999999
-317	0.9119999999999999
-316	0.9119999999999999
-315	0.9119999999999999
-314	0.9119999999999999
-313	0.9119999999999999
-312	0.9119999999999999
-311	0.9119999999999999
-310	0.9119999999999999
-309	0.9039999999999999
-308	0.9039999999999999
-307	0.9039999999999999
-306	0.9039999999999999
-305	0.9039999999999999
-304	0.9039999999999999
-303	0.9039999999999999
-302	0.9039999999999999
-301	0.9039999999999999
-300	0.9039999999999999
-299	0.8800000000000001
-298	0.8800000000000001
-297	0.8800000000000001
-296	0.8800000000000001
-295	0.8800000000000001
-294	0.8800000000000001
-293	0.8800000000000001
-292	0.8800000000000001
-291	0.8800000000000001
-290	0.8800000000000001
-289	0.8748000000000001
-288	0.8748000000000001
-287	0.8748000000000001
-286	0.8748000000000001
-285	0.8748000000000001
-284	0.8748000000000001
-283	0.8748000000000001
-282	0.8748000000000001
-281	0.8748000000000001
-280	0.8748000000000001
-279	0.8262
-278	0.8262
-277	0.8262
-276	0.8262
-275	0.8262
-274	0.8262
-273	0.8262
-272	0.8262
-271	0.8262
-270	0.8262
-269	0.8148
-268	0.8148
-267	0.8148
-266	0.8148
-265	0.8148
-264	0.8148
-263	0.8148
-262	0.8148
-261	0.8148
-260	0.8148
-259	0.8256
-258	0.8256
-257	0.8256
-256	0.8256
-255	0.8256
-254	0.8256
-253	0.8256
-252	0.8256
-251	0.8256
-250	0.8256
-249	0.8366
-248	0.8366
-247	0.8366
-246	0.8366
-245	0.8366
-244	0.8366
-243	0.8366
-242	0.8366
-241	0.8366
-240	0.8366
-239	0.8448
-238	0.8448
-237	0.8448
-236	0.8448
-235	0.8448
-234	0.8448
-233	0.8448
-232	0.8448
-231	0.8448
-230	0.8448
-229	0.882
-228	0.882
-227	0.882
-226	0.882
-225	0.882
-224	0.882
-223	0.882
-222	0.882
-221	0.882
-220	0.882
-219	0.909
-218	0.909
-217	0.909
-216	0.909
-215	0.909
-214	0.909
-213	0.909
-212	0.909
-211	0.909
-210	0.909
-209	0.9282
-208	0.9282
-207	0.9282
-206	0.9282
-205	0.9282
-204	0.9282
-203	0.9282
-202	0.9282
-201	0.9282
-200	0.9282
-199	0.9373
-198	0.9373
-197	0.9373
-196	0.9373
-195	0.9373
-194	0.9373
-193	0.9373
-192	0.9373
-191	0.9373
-190	0.9373
-189	0.9345000000000001
-188	0.9345000000000001
-187	0.9345000000000001
-186	0.9345000000000001
-185	0.9345000000000001
-184	0.9345000000000001
-183	0.9345000000000001
-182	0.9345000000000001
-181	0.9345000000000001
-180	0.9345000000000001
-179	0.9570000000000001
-178	0.9570000000000001
-177	0.9570000000000001
-176	0.9570000000000001
-175	0.9570000000000001
-174	0.9570000000000001
-173	0.9570000000000001
-172	0.9570000000000001
-171	0.9570000000000001
-170	0.9570000000000001
-169	0.9520000000000001
-168	0.9520000000000001
-167	0.9520000000000001
-166	0.9520000000000001
-165	0.9520000000000001
-164	0.9520000000000001
-163	0.9520000000000001
-162	0.9520000000000001
-161	0.9520000000000001
-160	0.9520000000000001
-159	0.9378999999999998
-158	0.9378999999999998
-157	0.9378999999999998
-156	0.9378999999999998
-155	0.9378999999999998
-154	0.9378999999999998
-153	0.9378999999999998
-152	0.9378999999999998
-151	0.9378999999999998
-150	0.9378999999999998
-149	0.9659999999999999
-148	0.9659999999999999
-147	0.9659999999999999
-146	0.9659999999999999
-145	0.9659999999999999
-144	0.9659999999999999
-143	0.9659999999999999
-142	0.9659999999999999
-141	0.9659999999999999
-140	0.9659999999999999
-139	1.0062
-138	1.0062
-137	1.0062
-136	1.0062
-135	1.0062
-134	1.0062
-133	1.0062
-132	1.0062
-131	1.0062
-130	1.0062
-129	1.0384
-128	1.0384
-127	1.0384
-126	1.0384
-125	1.0384
-124	1.0384
-123	1.0384
-122	1.0384
-121	1.0384
-120	1.0384
-119	1.003
-118	1.003
-117	1.003
-116	1.003
-115	1.003
-114	1.003
-113	1.003
-112	1.003
-111	1.003
-110	1.003
-109	0.9675999999999999
-108	0.9675999999999999
-107	0.9675999999999999
-106	0.9675999999999999
-105	0.9675999999999999
-104	0.9675999999999999
-103	0.9675999999999999
-102	0.9675999999999999
-101	0.9675999999999999
-100	0.9675999999999999
-99	0.9639
-98	0.9639
-97	0.9639
-96	0.9639
-95	0.9639
-94	0.9639
-93	0.9639
-92	0.9639
-91	0.9639
-90	0.9639
-89	0.9401
-88	0.9401
-87	0.9401
-86	0.9401
-85	0.9401
-84	0.9401
-83	0.9401
-82	0.9401
-81	0.9401
-80	0.9401
-79	1.044
-78	1.044
-77	1.044
-76	1.044
-75	1.044
-74	1.044
-73	1.044
-72	1.044
-71	1.044
-70	1.044
-69	1.081
-68	1.081
-67	1.081
-66	1.081
-65	1.081
-64	1.081
-63	1.081
-62	1.081
-61	1.081
-60	1.081
-59	1.0120000000000002
-58	1.0120000000000002
-57	1.0120000000000002
-56	1.0120000000000002
-55	1.0120000000000002
-54	1.0120000000000002
-53	1.0120000000000002
-52	1.0120000000000002
-51	1.0120000000000002
-50	1.0120000000000002
-49	0.9828000000000001
-48	0.9828000000000001
-47	0.9828000000000001
-46	0.9828000000000001
-45	0.9828000000000001
-44	0.9828000000000001
-43	0.9828000000000001
-42	0.9828000000000001
-41	0.9828000000000001
-40	0.9828000000000001
-39	1.06
-38	1.06
-37	1.06
-36	1.06
-35	1.06
-34	1.06
-33	1.06
-32	1.06
-31	1.06
-30	1.06
-29	1.04
-28	1.04
-27	1.04
-26	1.04
-25	1.04
-24	1.04
-23	1.04
-22	1.04
-21	1.04
-20	1.04
-19	1.02
-18	1.02
-17	1.02
-16	1.02
-15	1.02
-14	1.02
-13	1.02
-12	1.02
-11	1.02
-10	1.02
-9	1.0
-8	1.0
-7	1.0
-6	1.0
-5	1.0
-4	1.0
-3	1.0
-2	1.0
-1	1.0
0	1.0