-570	-1.1091548231828572e+18
-569	-2.198088465440684e+18
-568	-2.468056848866254e+18
-567	-2.5167086107292943e+18
-566	-2.524510122391777e+18
-565	-2.522897709451672e+18
-564	-2.518009309640681e+18
-563	-2.511468946843442e+18
-562	-2.5039436894448727e+18
-561	-2.495804802685849e+18
-560	-2.4872842658859515e+18
-559	-2.4322997471328333e+18
-558	-2.5798263204812616e+18
-557	-2.5752469419560074e+18
-556	-2.5549979777045893e+18
-555	-2.5367455076960195e+18
-554	-2.5214800354169083e+18
-553	-2.508362878652092e+18
-552	-2.496658354626324e+18
-551	-2.4858727122899773e+18
-550	-2.4756890227571487e+18
-549	-2.49761886180002e+18
-548	-2.513460294123846e+18
-547	-2.4927419302005765e+18
-546	-2.4732753852829517e+18
-545	-2.45743608975438e+18
-544	-2.4441916789630623e+18
-543	-2.4326147161578235e+18
-542	-2.4220977863703245e+18
-541	-2.412259487509926e+18
-540	-2.4028614063937157e+18
-539	-2.58833932564531e+18
-538	-2.9535313790011914e+18
-537	-2.9594753426845215e+18
-536	-2.9331905361595955e+18
-535	-2.9096372361905746e+18
-534	-2.890310692028036e+18
-533	-2.873847920290892e+18
-532	-2.859174789398397e+18
-531	-2.8456157274524585e+18
-530	-2.83275898800584e+18
-529	-2.799893960688623e+18
-528	-2.867790384674177e+18
-527	-2.8534381570845363e+18
-526	-2.8349587509342484e+18
-525	-2.8186881001605484e+18
-524	-2.80423507532578e+18
-523	-2.790942221313176e+18
-522	-2.77837406511803e+18
-521	-2.7662655099618673e+18
-520	-2.7544569644802294e+18
-519	-2.684085400222554e+18
-518	-2.5651960552227415e+18
-517	-2.551248471088005e+18
-516	-2.544725719564754e+18
-515	-2.537459933511211e+18
-514	-2.529260726232409e+18
-513	-2.5204633127857516e+18
-512	-2.5113150507476603e+18
-511	-2.5019708266666993e+18
-510	-2.492525322556934e+18
-509	-2.4336651775057126e+18
-508	-2.3027186642594627e+18
-507	-2.290531088937356e+18
-506	-2.2862144959970962e+18
-505	-2.280976447623247e+18
-504	-2.27466288419349e+18
-503	-2.2676513271082358e+18
-502	-2.2602181989787105e+18
-501	-2.2525383023376492e+18
-500	-2.2447198890188736e+18
-499	-2.2276948784878267e+18
-498	-2.1809956035719726e+18
-497	-2.1714461347922289e+18
-496	-2.164555017807577e+18
-495	-2.1575810951061302e+18
-494	-2.1504196958815306e+18
-493	-2.143142064540555e+18
-492	-2.1358037838344064e+18
-491	-2.128440115330122e+18
-490	-2.121072851163141e+18
-489	-1.962086694471818e+18
-488	-1.9690533249815406e+18
-487	-1.964300283999609e+18
-486	-1.9584509158409193e+18
-485	-1.9523953218232238e+18
-484	-1.9462562786662141e+18
-483	-1.9400775745778542e+18
-482	-1.9338838441844188e+18
-481	-1.9276900947409777e+18
-480	-1.9215055435902129e+18
-479	-1.9707979946420173e+18
-478	-1.9948386163185523e+18
-477	-1.989853064167271e+18
-476	-1.9828620321686638e+18
-475	-1.9759016315402473e+18
-474	-1.9690696578923835e+18
-473	-1.9623351629883948e+18
-472	-1.9556718433329434e+18
-471	-1.9490628533703552e+18
-470	-1.9424976963203151e+18
-469	-1.9463460812827807e+18
-468	-1.9100726080548634e+18
-467	-1.9005468806129667e+18
-466	-1.8933713386656049e+18
-465	-1.8866673420472873e+18
-464	-1.8801942914466227e+18
-463	-1.8738677585203172e+18
-462	-1.8676401902675487e+18
-461	-1.861482593288022e+18
-460	-1.8553770986986212e+18
-459	-2.0575026638777252e+18
-458	-2.1189484270618396e+18
-457	-2.1167078764937385e+18
-456	-2.1088221118805304e+18
-455	-2.100476172786751e+18
-454	-2.092129525915818e+18
-453	-2.0838218190212746e+18
-452	-2.0755558078744e+18
-451	-2.0673311788172413e+18
-450	-2.059147464104333e+18
-449	-1.0993201377880064e+18
-448	-1.1239479533132027e+18
-447	-1.1197365968403692e+18
-446	-1.1145897881738184e+18
-445	-1.1096699415257979e+18
-444	-1.1049337755800008e+18
-443	-1.1003194214983142e+18
-442	-1.0957873765089828e+18
-441	-1.0913133561219988e+18
-440	-1.0868824472957676e+18
-439	-8.471425111968e+17
-438	-8.662778782089892e+17
-437	-8.634350433539149e+17
-436	-8.598242647521894e+17
-435	-8.562030479302738e+17
-434	-8.525977898208676e+17
-433	-8.490090532011699e+17
-432	-8.454365994053673e+17
-431	-8.418802315628242e+17
-430	-8.383397974324009e+17
-429	-1.493312416860114e+17
-428	-1.3708019983672166e+17
-427	-1.3649319601341082e+17
-426	-1.3597708644977818e+17
-425	-1.354144209830487e+17
-424	-1.3482318983525018e+17
-423	-1.3421561921126298e+17
-422	-1.3359923934587904e+17
-421	-1.3297867487565875e+17
-420	-1.3235676260501094e+17
-419	6.356103899151473e+17
-418	5.75478101982911e+17
-417	5.748649934600581e+17
-416	5.7248336476102144e+17
-415	5.70064010282731e+17
-414	5.6759656880869274e+17
-413	5.651043878175104e+17
-412	5.626012192957409e+17
-411	5.6009562448650394e+17
-410	5.5759290061718784e+17
-409	-5.46390029805804e+17
-408	-5.677393733127521e+17
-407	-5.7049032458341734e+17
-406	-5.706388289751711e+17
-405	-5.696394731075497e+17
-404	-5.679498531033528e+17
-403	-5.658343170112722e+17
-402	-5.634579619381366e+17
-401	-5.609243727248635e+17
-400	-5.5829845787601e+17
-399	-9.269684584415135e+17
-398	-9.648869226135823e+17
-397	-9.641811086819917e+17
-396	-9.605105195184087e+17
-395	-9.564063994074655e+17
-394	-9.521338783572214e+17
-393	-9.477714673543158e+17
-392	-9.433625776156022e+17
-391	-9.389339981211039e+17
-390	-9.345024382119521e+17
-389	-6.725379249076956e+17
-388	-6.936448889153341e+17
-387	-6.910197472163e+17
-386	-6.876637975038259e+17
-385	-6.844260670004838e+17
-384	-6.812903866867277e+17
-383	-6.782247547905725e+17
-382	-6.752083000057431e+17
-381	-6.722279242926981e+17
-380	-6.69275412316e+17
-379	-1.83203653166e+17
-378	-1.8262346268e+17
-377	-1.86202199418e+17
-376	-1.88660453845e+17
-375	-1.90147770495e+17
-374	-1.90880588548e+17
-373	-1.91027890857e+17
-372	-1.90719451028e+17
-371	-1.90055746113e+17
-370	-1.89115387581e+17
-369	2.63354797664e+17
-368	2.47205775589e+17
-367	2.42381020245e+17
-366	2.37068763595e+17
-365	2.31766853474e+17
-364	2.26422980594e+17
-363	2.21042223006e+17
-362	2.15642864286e+17
-361	2.10249755087e+17
-360	2.04889602974e+17
-359	1.29690669269e+18
-358	1.2018990433e+18
-357	1.19708060035e+18
-356	1.17886683854e+18
-355	1.16292974493e+18
-354	1.14707289038e+18
-353	1.13164014488e+18
-352	1.11662620093e+18
-351	1.1020656467e+18
-350	1.08865105225e+18
-349	1.59788607537e+18
-348	1.45113246134e+18
-347	1.48724992402e+18
-346	1.48469238121e+18
-345	1.48548674902e+18
-344	1.48340786248e+18
-343	1.4804015541e+18
-342	1.47664939506e+18
-341	1.47245562889e+18
-340	1.46798006561e+18
-339	1.85637673916e+18
-338	1.42002374691e+18
-337	1.54762408492e+18
-336	1.52664577544e+18
-335	1.53578532447e+18
-334	1.5345784729e+18
-333	1.53374777227e+18
-332	1.53147207071e+18
-331	1.52865773383e+18
-330	1.52539944776e+18
-329	1.93016615868e+18
-328	1.71496528998e+18
-327	1.77356857679e+18
-326	1.75140072042e+18
-325	1.75263273714e+18
-324	1.74703106262e+18
-323	1.74337696784e+18
-322	1.73914666434e+18
-321	1.73507297235e+18
-320	1.73095056715e+18
-319	2.20606872539e+18
-318	2.10240683828e+18
-317	2.12269766212e+18
-316	2.10320049949e+18
-315	2.09949569751e+18
-314	2.09175637428e+18
-313	2.08626614108e+18
-312	2.08058312929e+18
-311	2.07533197514e+18
-310	2.07017421893e+18
-309	2.49653719211e+18
-308	2.43436675954e+18
-307	2.44033976069e+18
-306	2.42397190918e+18
-305	2.41836543406e+18
-304	2.4102041796e+18
-303	2.40394520493e+18
-302	2.39758822852e+18
-301	2.39165749688e+18
-300	2.38582087807e+18
-299	2.1766397975e+18
-298	2.23154315541e+18
-297	2.20609210798e+18
-296	2.2075174226e+18
-295	2.20001840881e+18
-294	2.19549862855e+18
-293	2.19000927777e+18
-292	2.1848491839e+18
-291	2.17958924055e+18
-290	2.17436828356e+18
-289	1.98543633486e+18
-288	1.83001261596e+18
-287	1.89029731971e+18
-286	1.87683181228e+18
-285	1.88283114444e+18
-284	1.88022888595e+18
-283	1.87874374814e+18
-282	1.87586579114e+18
-281	1.87274952917e+18
-280	1.86926880423e+18
-279	1.8344825598e+18
-278	1.89712239566e+18
-277	1.87033193649e+18
-276	1.87061074037e+18
-275	1.86382256214e+18
-274	1.85955393125e+18
-273	1.85488236312e+18
-272	1.85053276667e+18
-271	1.84622729942e+18
-270	1.84199845149e+18
-269	8.98055393763e+17
-268	1.05681253868e+18
-267	1.02954397209e+18
-266	1.02764089155e+18
-265	1.02310438839e+18
-264	1.01936784474e+18
-263	1.0158231579e+18
-262	1.01244680136e+18
-261	1.00917576467e+18
-260	1.00597563448e+18
-259	-4.29087418161e+17
-258	-5.06560830859e+17
-257	-5.07801334718e+17
-256	-5.06014076054e+17
-255	-5.04031532758e+17
-254	-5.01979878261e+17
-253	-4.9988899108e+17
-252	-4.97776607825e+17
-251	-4.95654116462e+17
-250	-4.935288446e+17
-249	-4.79599223387e+17
-248	-4.89528112172e+17
-247	-4.88076542142e+17
-246	-4.86170129891e+17
-245	-4.8417904152e+17
-244	-4.82143029699e+17
-243	-4.80081912888e+17
-242	-4.78008326132e+17
-241	-4.75930416583e+17
-240	-4.73853430302e+17
-239	-4.00908194501e+17
-238	-3.83846026066e+17
-237	-3.81383242959e+17
-236	-3.79431569824e+17
-235	-3.77550175776e+17
-234	-3.75709647293e+17
-233	-3.73898528331e+17
-232	-3.72109628042e+17
-231	-3.70338291821e+17
-230	-3.68581495673e+17
-229	-1.4919430983e+18
-228	-1.52276291389e+18
-227	-1.51738089975e+18
-226	-1.50919401636e+18
-225	-1.50111474579e+18
-224	-1.49329473755e+18
-223	-1.48567312177e+18
-222	-1.47819613004e+18
-221	-1.47082772224e+18
-220	-1.46354446232e+18
-219	-1.77717179497e+18
-218	-1.74112447105e+18
-217	-1.72800539689e+18
-216	-1.71785357572e+18
-215	-1.70841778954e+18
-214	-1.69933683125e+18
-213	-1.69048980861e+18
-212	-1.6818103259e+18
-211	-1.67325676389e+18
-210	-1.66480236617e+18
-209	-1.62014755375e+18
-208	-1.64824455213e+18
-207	-1.64605187446e+18
-206	-1.63954276273e+18
-205	-1.63187930997e+18
-204	-1.62366239075e+18
-203	-1.61512873387e+18
-202	-1.60641532177e+18
-201	-1.59760879234e+18
-200	-1.58876470543e+18
-199	-1.38911289026e+18
-198	-1.34818465476e+18
-197	-1.3386186249e+18
-196	-1.33168198454e+18
-195	-1.32486655185e+18
-194	-1.31800188406e+18
-193	-1.31110863526e+18
-192	-1.3042117885e+18
-191	-1.29732840545e+18
-190	-1.29046946962e+18
-189	-1.08735752251e+18
-188	-1.11520204935e+18
-187	-1.11012944751e+18
-186	-1.10372961129e+18
-185	-1.09773087777e+18
-184	-1.09207592476e+18
-183	-1.0866557351e+18
-182	-1.08139604069e+18
-181	-1.07624893707e+18
-180	-1.07118363081e+18
-179	-8.71464346949e+17
-178	-9.55453411623e+17
-177	-9.52626914392e+17
-176	-9.46416287986e+17
-175	-9.40657951841e+17
-174	-9.3531777296e+17
-173	-9.30258223581e+17
-172	-9.25386796211e+17
-171	-9.20644521994e+17
-170	-9.15993877432e+17
-169	-5.54071744862e+17
-168	-5.67646655613e+17
-167	-5.63262574368e+17
-166	-5.58990262145e+17
-165	-5.55187215905e+17
-164	-5.51699946756e+17
-163	-5.48418949359e+17
-162	-5.45274706892e+17
-161	-5.42223270669e+17
-160	-5.39236822811e+17
-159	-2.27058154227e+17
-158	-2.19486126687e+17
-157	-2.18090657664e+17
-156	-2.16831240696e+17
-155	-2.15584872159e+17
-154	-2.14347861789e+17
-153	-2.13119339986e+17
-152	-2.11898769483e+17
-151	-2.10685794761e+17
-150	-2.09480175e+17
-149	-7.15678559729e+17
-148	-7.1713548481e+17
-147	-7.1540626453e+17
-146	-7.13353799381e+17
-145	-7.11180736798e+17
-144	-7.08936059006e+17
-143	-7.06646978326e+17
-142	-7.04330597609e+17
-141	-7.01997780173e+17
-140	-6.99655436176e+17
-139	1.89728634482e+17
-138	1.79276846895e+17
-137	1.78828964535e+17
-136	1.78280953125e+17
-135	1.77734247713e+17
-134	1.89662139014e+17
-133	2.0010870599e+17
-132	1.98600884276e+17
-131	1.97463306385e+17
-130	1.96497208409e+17
-129	6.67224315086e+17
-128	6.83807075249e+17
-127	6.74781609746e+17
-126	6.69299128818e+17
-125	6.6521459402e+17
-124	6.57588950642e+17
-123	6.47104463363e+17
-122	6.46485733374e+17
-121	6.45143490317e+17
-120	6.43613834134e+17
-119	1.0202297385e+18
-118	1.01368089067e+18
-117	1.00953431758e+18
-116	1.00583093849e+18
-115	1.00244333749e+18
-114	1.01306200382e+18
-113	1.02772338028e+18
-112	1.02104699125e+18
-111	1.01645038814e+18
-110	1.01241068205e+18
-109	1.03404165069e+18
-108	1.037886189e+18
-107	1.03362794963e+18
-106	1.02991543899e+18
-105	1.02633020292e+18
-104	9.9893863391e+17
-103	9.72067297988e+17
-102	9.72406584415e+17
-101	9.70746921186e+17
-100	9.68574230014e+17
-99	5.86567678366e+17
-98	5.73999999952e+17
-97	5.7530717049e+17
-96	5.75335839267e+17
-95	5.74821748399e+17
-94	5.53374496506e+17
-93	5.29329390606e+17
-92	5.31653570613e+17
-91	5.32187586738e+17
-90	5.32098672942e+17
-89	4.1367712139e+17
-88	4.08349946965e+17
-87	4.08691588807e+17
-86	4.08503666967e+17
-85	4.08065206896e+17
-84	4.11707273004e+17
-83	4.12306927896e+17
-82	4.11077767624e+17
-81	4.09989600834e+17
-80	4.08440529083e+17
-79	6.25063095845e+17
-78	6.09621570213e+17
-77	6.0759144374e+17
-76	6.05384708624e+17
-75	6.03282390302e+17
-74	6.02805671273e+17
-73	5.92283139005e+17
-72	5.90740069436e+17
-71	5.88931361981e+17
-70	5.87099571622e+17
-69	4.2290481391e+17
-68	3.9540461296e+17
-67	3.95363385488e+17
-66	3.94281970246e+17
-65	3.93024461525e+17
-64	3.94710330139e+17
-63	4.03473984108e+17
-62	4.00735289214e+17
-61	3.98572086707e+17
-60	3.96579982097e+17
-59	8.507373232e+16
-58	8.82748471414e+16
-57	8.70932361918e+16
-56	8.62606038312e+16
-55	8.56140993129e+16
-54	8.54546655357e+16
-53	8.76573060448e+16
-52	8.65931330512e+16
-51	8.58201667702e+16
-50	8.52055505652e+16
-49	2.28308713731e+17
-48	2.24481064287e+17
-47	2.23880794106e+17
-46	2.23154627875e+17
-45	2.22370499595e+17
-44	2.12101921409e+17
-43	1.99292003771e+17
-42	1.99757684469e+17
-41	1.9971357384e+17
-40	1.99432473346e+17
-39	2.33856212044e+17
-38	2.15995561912e+17
-37	2.16248691432e+17
-36	2.15935839745e+17
-35	2.15421755426e+17
-34	2.13905577096e+17
-33	2.02165518806e+17
-32	2.02068064078e+17
-31	2.01631208684e+17
-30	2.01077563937e+17
-29	2.48711355223e+17
-28	2.48897248652e+17
-27	2.47265688699e+17
-26	2.45848103879e+17
-25	2.44581532316e+17
-24	2.54712889339e+17
-23	2.57159082517e+17
-22	2.55193768048e+17
-21	2.53520823927e+17
-20	2.5206248628e+17
-19	2.8358318848e+17
-18	3.00438408686e+17
-17	2.98896073778e+17
-16	2.96844232445e+17
-15	2.94853268683e+17
-14	2.98203354012e+17
-13	2.98781099123e+17
-12	2.9694340475e+17
-11	2.95051614549e+17
-10	2.93179114087e+17
-9	6.6698268207e+17
-8	6.87324976601e+17
-7	6.84371873601e+17
-6	6.80125082616e+17
-5	6.75837404942e+17
-4	7.05188859585e+17
-3	7.07841552576e+17
-2	7.05503278981e+17
-1	7.02279314245e+17
0	6.98616009757e+17