-570	0.25
-569	0.25
-568	0.25
-567	0.25
-566	0.25
-565	0.25
-564	0.25
-563	0.25
-562	0.25
-561	0.25
-560	0.25
-559	0.25
-558	0.25
-557	0.25
-556	0.25
-555	0.25
-554	0.25
-553	0.25
-552	0.25
-551	0.25
-550	0.25
-549	0.25
-548	0.25
-547	0.25
-546	0.25
-545	0.25
-544	0.25
-543	0.25
-542	0.25
-541	0.25
-540	0.25
-539	0.25
-538	0.25
-537	0.25
-536	0.25
-535	0.25
-534	0.25
-533	0.25
-532	0.25
-531	0.25
-530	0.25
-529	0.25
-528	0.25
-527	0.25
-526	0.25
-525	0.25
-524	0.25
-523	0.25
-522	0.25
-521	0.25
-520	0.25
-519	0.25
-518	0.25
-517	0.25
-516	0.25
-515	0.25
-514	0.25
-513	0.25
-512	0.25
-511	0.25
-510	0.25
-509	0.25
-508	0.25
-507	0.25
-506	0.25
-505	0.25
-504	0.25
-503	0.25
-502	0.25
-501	0.25
-500	0.25
-499	0.25
-498	0.25
-497	0.25
-496	0.25
-495	0.25
-494	0.25
-493	0.25
-492	0.25
-491	0.25
-490	0.25
-489	0.25
-488	0.25
-487	0.25
-486	0.25
-485	0.25
-484	0.25
-483	0.25
-482	0.25
-481	0.25
-480	0.25
-479	0.25
-478	0.25
-477	0.25
-476	0.25
-475	0.25
-474	0.25
-473	0.25
-472	0.25
-471	0.25
-470	0.25
-469	0.25
-468	0.25
-467	0.25
-466	0.25
-465	0.25
-464	0.25
-463	0.25
-462	0.25
-461	0.25
-460	0.25
-459	0.25
-458	0.25
-457	0.25
-456	0.25
-455	0.25
-454	0.25
-453	0.25
-452	0.25
-451	0.25
-450	0.25
-449	0.25
-448	0.25
-447	0.25
-446	0.25
-445	0.25
-444	0.25
-443	0.25
-442	0.25
-441	0.25
-440	0.25
-439	0.25
-438	0.25
-437	0.25
-436	0.25
-435	0.25
-434	0.25
-433	0.25
-432	0.25
-431	0.25
-430	0.25
-429	0.25
-428	0.25
-427	0.25
-426	0.25
-425	0.25
-424	0.25
-423	0.25
-422	0.25
-421	0.25
-420	0.25
-419	0.25
-418	0.25
-417	0.25
-416	0.25
-415	0.25
-414	0.25
-413	0.25
-412	0.25
-411	0.25
-410	0.25
-409	0.25
-408	0.25
-407	0.25
-406	0.25
-405	0.25
-404	0.25
-403	0.25
-402	0.25
-401	0.25
-400	0.25
-399	0.25
-398	0.25
-397	0.25
-396	0.25
-395	0.25
-394	0.25
-393	0.25
-392	0.25
-391	0.25
-390	0.25
-389	0.25
-388	0.25
-387	0.25
-386	0.25
-385	0.25
-384	0.25
-383	0.25
-382	0.25
-381	0.25
-380	0.25
-379	0.27155172413793105
-378	0.293103448275862
-377	0.31465517241379304
-376	0.3362068965517241
-375	0.35775862068965514
-374	0.3793103448275862
-373	0.40086206896551724
-372	0.42241379310344823
-371	0.4439655172413793
-370	0.46551724137931033
-369	0.4870689655172413
-368	0.5086206896551724
-367	0.5301724137931034
-366	0.5517241379310345
-365	0.5732758620689655
-364	0.5948275862068966
-363	0.6163793103448276
-362	0.6379310344827587
-361	0.6594827586206896
-360	0.6810344827586207
-359	0.7025862068965517
-358	0.7241379310344828
-357	0.7456896551724138
-356	0.7672413793103449
-355	0.7887931034482758
-354	0.8103448275862069
-353	0.8318965517241379
-352	0.853448275862069
-351	0.875
-350	0.875
-349	0.875
-348	0.875
-347	0.875
-346	0.875
-345	0.875
-344	0.875
-343	0.875
-342	0.875
-341	0.875
-340	0.875
-339	0.875
-338	0.875
-337	0.875
-336	0.875
-335	0.875
-334	0.875
-333	0.875
-332	0.875
-331	0.875
-330	0.875
-329	0.875
-328	0.875
-327	0.875
-326	0.875
-325	0.875
-324	0.875
-323	0.875
-322	0.875
-321	0.875
-320	0.875
-319	0.875
-318	0.875
-317	0.875
-316	0.875
-315	0.875
-314	0.875
-313	0.875
-312	0.875
-311	0.875
-310	0.875
-309	0.875
-308	0.875
-307	0.875
-306	0.875
-305	0.875
-304	0.875
-303	0.875
-302	0.875
-301	0.875
-300	0.875
-299	0.875
-298	0.875
-297	0.875
-296	0.875
-295	0.875
-294	0.875
-293	0.875
-292	0.875
-291	0.875
-290	0.875
-289	0.875
-288	0.875
-287	0.875
-286	0.875
-285	0.875
-284	0.875
-283	0.875
-282	0.875
-281	0.875
-280	0.875
-279	0.875
-278	0.875
-277	0.875
-276	0.875
-275	0.875
-274	0.875
-273	0.875
-272	0.875
-271	0.875
-270	0.875
-269	0.875
-268	0.875
-267	0.875
-266	0.875
-265	0.875
-264	0.875
-263	0.875
-262	0.875
-261	0.875
-260	0.875
-259	0.875
-258	0.875
-257	0.875
-256	0.875
-255	0.875
-254	0.875
-253	0.875
-252	0.875
-251	0.875
-250	0.875
-249	0.875
-248	0.875
-247	0.875
-246	0.875
-245	0.875
-244	0.875
-243	0.875
-242	0.875
-241	0.875
-240	0.875
-239	0.875
-238	0.875
-237	0.875
-236	0.875
-235	0.875
-234	0.875
-233	0.875
-232	0.875
-231	0.875
-230	0.875
-229	0.875
-228	0.875
-227	0.875
-226	0.875
-225	0.875
-224	0.875
-223	0.875
-222	0.875
-221	0.875
-220	0.875
-219	0.875
-218	0.875
-217	0.875
-216	0.875
-215	0.875
-214	0.875
-213	0.875
-212	0.875
-211	0.875
-210	0.875
-209	0.875
-208	0.875
-207	0.875
-206	0.875
-205	0.875
-204	0.875
-203	0.875
-202	0.875
-201	0.875
-200	0.875
-199	0.875
-198	0.875
-197	0.875
-196	0.875
-195	0.875
-194	0.875
-193	0.875
-192	0.875
-191	0.875
-190	0.875
-189	0.875
-188	0.875
-187	0.875
-186	0.875
-185	0.875
-184	0.875
-183	0.875
-182	0.875
-181	0.875
-180	0.875
-179	0.875
-178	0.875
-177	0.875
-176	0.875
-175	0.875
-174	0.875
-173	0.875
-172	0.875
-171	0.875
-170	0.875
-169	0.875
-168	0.875
-167	0.875
-166	0.875
-165	0.875
-164	0.875
-163	0.875
-162	0.875
-161	0.875
-160	0.875
-159	0.875
-158	0.875
-157	0.875
-156	0.875
-155	0.875
-154	0.875
-153	0.875
-152	0.875
-151	0.875
-150	0.875
-149	0.875
-148	0.875
-147	0.875
-146	0.875
-145	0.875
-144	0.875
-143	0.875
-142	0.875
-141	0.875
-140	0.875
-139	0.875
-138	0.875
-137	0.875
-136	0.875
-135	0.875
-134	0.875
-133	0.875
-132	0.875
-131	0.875
-130	0.875
-129	0.8775510204081632
-128	0.8801020408163265
-127	0.8826530612244898
-126	0.8852040816326531
-125	0.8877551020408163
-124	0.8903061224489796
-123	0.8928571428571429
-122	0.8954081632653061
-121	0.8979591836734694
-120	0.9005102040816326
-119	0.903061224489796
-118	0.9056122448979592
-117	0.9081632653061225
-116	0.9107142857142857
-115	0.9132653061224489
-114	0.9158163265306123
-113	0.9183673469387755
-112	0.9209183673469388
-111	0.923469387755102
-110	0.9260204081632653
-109	0.9285714285714286
-108	0.9311224489795918
-107	0.9336734693877551
-106	0.9362244897959183
-105	0.9387755102040817
-104	0.9413265306122449
-103	0.9438775510204082
-102	0.9464285714285714
-101	0.9489795918367347
-100	0.951530612244898
-99	0.9540816326530612
-98	0.9566326530612245
-97	0.9591836734693877
-96	0.9617346938775511
-95	0.9642857142857143
-94	0.9668367346938775
-93	0.9693877551020408
-92	0.9719387755102041
-91	0.9744897959183674
-90	0.9770408163265306
-89	0.9795918367346939
-88	0.9821428571428571
-87	0.9846938775510204
-86	0.9872448979591837
-85	0.9897959183673469
-84	0.9923469387755102
-83	0.9948979591836735
-82	0.9974489795918368
-81	1.0
-80	1.0
-79	1.0
-78	1.0
-77	1.0
-76	1.0
-75	1.0
-74	1.0
-73	1.0
-72	1.0
-71	1.0
-70	1.0
-69	1.0
-68	1.0
-67	1.0
-66	1.0
-65	1.0
-64	1.0
-63	1.0
-62	1.0
-61	1.0
-60	1.0
-59	1.0
-58	1.0
-57	1.0
-56	1.0
-55	1.0
-54	1.0
-53	1.0
-52	1.0
-51	1.0
-50	1.0
-49	1.0
-48	1.0
-47	1.0
-46	1.0
-45	1.0
-44	1.0
-43	1.0
-42	1.0
-41	1.0
-40	1.0
-39	1.0
-38	1.0
-37	1.0
-36	1.0
-35	1.0
-34	1.0
-33	1.0
-32	1.0
-31	1.0
-30	1.0
-29	1.0
-28	1.0
-27	1.0
-26	1.0
-25	1.0
-24	1.0
-23	1.0
-22	1.0
-21	1.0
-20	1.0
-19	1.0
-18	1.0
-17	1.0
-16	1.0
-15	1.0
-14	1.0
-13	1.0
-12	1.0
-11	1.0
-10	1.0
-9	1.0
-8	1.0
-7	1.0
-6	1.0
-5	1.0
-4	1.0
-3	1.0
-2	1.0
-1	1.0
0	1.0