-579	0.63
-578	0.63
-577	0.63
-576	0.63
-575	0.63
-574	0.63
-573	0.63
-572	0.63
-571	0.63
-570	0.63
-569	0.63
-568	0.63
-567	0.63
-566	0.63
-565	0.63
-564	0.63
-563	0.63
-562	0.63
-561	0.63
-560	0.63
-559	0.63
-558	0.63
-557	0.63
-556	0.63
-555	0.63
-554	0.63
-553	0.63
-552	0.63
-551	0.63
-550	0.63
-549	0.63
-548	0.63
-547	0.63
-546	0.63
-545	0.63
-544	0.63
-543	0.63
-542	0.63
-541	0.63
-540	0.63
-539	1.05
-538	1.05
-537	1.05
-536	1.05
-535	1.05
-534	1.05
-533	1.05
-532	1.05
-531	1.05
-530	1.05
-529	1.05
-528	1.05
-527	1.05
-526	1.05
-525	1.05
-524	1.05
-523	1.05
-522	1.05
-521	1.05
-520	1.05
-519	0.97
-518	0.97
-517	0.97
-516	0.97
-515	0.97
-514	0.97
-513	0.97
-512	0.97
-511	0.97
-510	0.97
-509	0.99
-508	0.99
-507	0.99
-506	0.99
-505	0.99
-504	0.99
-503	0.99
-502	0.99
-501	0.99
-500	0.99
-499	0.99
-498	0.99
-497	0.99
-496	0.99
-495	0.99
-494	0.99
-493	0.99
-492	0.99
-491	0.99
-490	0.99
-489	0.99
-488	0.99
-487	0.99
-486	0.99
-485	0.99
-484	0.99
-483	0.99
-482	0.99
-481	0.99
-480	0.99
-479	1.07
-478	1.07
-477	1.07
-476	1.07
-475	1.07
-474	1.07
-473	1.07
-472	1.07
-471	1.07
-470	1.07
-469	1.07
-468	1.07
-467	1.07
-466	1.07
-465	1.07
-464	1.07
-463	1.07
-462	1.07
-461	1.07
-460	1.07
-459	1.15
-458	1.15
-457	1.15
-456	1.15
-455	1.15
-454	1.15
-453	1.15
-452	1.15
-451	1.15
-450	1.15
-449	1.43
-448	1.43
-447	1.43
-446	1.43
-445	1.43
-444	1.43
-443	1.43
-442	1.43
-441	1.43
-440	1.43
-439	1.43
-438	1.43
-437	1.43
-436	1.43
-435	1.43
-434	1.43
-433	1.43
-432	1.43
-431	1.43
-430	1.43
-429	1.54
-428	1.54
-427	1.54
-426	1.54
-425	1.54
-424	1.54
-423	1.54
-422	1.54
-421	1.54
-420	1.54
-419	1.63
-418	1.63
-417	1.63
-416	1.63
-415	1.63
-414	1.63
-413	1.63
-412	1.63
-411	1.63
-410	1.63
-409	1.63
-408	1.63
-407	1.63
-406	1.63
-405	1.63
-404	1.63
-403	1.63
-402	1.63
-401	1.63
-400	1.63
-399	1.47
-398	1.47
-397	1.47
-396	1.47
-395	1.47
-394	1.47
-393	1.47
-392	1.47
-391	1.47
-390	1.47
-389	1.47
-388	1.47
-387	1.47
-386	1.47
-385	1.47
-384	1.47
-383	1.47
-382	1.47
-381	1.47
-380	1.47
-379	1.47
-378	1.47
-377	1.47
-376	1.47
-375	1.47
-374	1.47
-373	1.47
-372	1.47
-371	1.47
-370	1.47
-369	1.40
-368	1.40
-367	1.40
-366	1.40
-365	1.40
-364	1.40
-363	1.40
-362	1.40
-361	1.40
-360	1.40
-359	1.41
-358	1.41
-357	1.41
-356	1.41
-355	1.41
-354	1.41
-353	1.41
-352	1.41
-351	1.41
-350	1.41
-349	1.41
-348	1.41
-347	1.41
-346	1.41
-345	1.41
-344	1.41
-343	1.41
-342	1.41
-341	1.41
-340	1.41
-339	1.41
-338	1.41
-337	1.41
-336	1.41
-335	1.41
-334	1.41
-333	1.41
-332	1.41
-331	1.41
-330	1.41
-329	1.41
-328	1.41
-327	1.41
-326	1.41
-325	1.41
-324	1.41
-323	1.41
-322	1.41
-321	1.41
-320	1.41
-319	1.45
-318	1.45
-317	1.45
-316	1.45
-315	1.45
-314	1.45
-313	1.45
-312	1.45
-311	1.45
-310	1.45
-309	1.45
-308	1.45
-307	1.45
-306	1.45
-305	1.45
-304	1.45
-303	1.45
-302	1.45
-301	1.45
-300	1.45
-299	1.45
-298	1.45
-297	1.45
-296	1.45
-295	1.45
-294	1.45
-293	1.45
-292	1.45
-291	1.45
-290	1.45
-289	1.31
-288	1.31
-287	1.31
-286	1.31
-285	1.31
-284	1.31
-283	1.31
-282	1.31
-281	1.31
-280	1.31
-279	1.31
-278	1.31
-277	1.31
-276	1.31
-275	1.31
-274	1.31
-273	1.31
-272	1.31
-271	1.31
-270	1.31
-269	1.31
-268	1.31
-267	1.31
-266	1.31
-265	1.31
-264	1.31
-263	1.31
-262	1.31
-261	1.31
-260	1.31
-259	1.43
-258	1.43
-257	1.43
-256	1.43
-255	1.43
-254	1.43
-253	1.43
-252	1.43
-251	1.43
-250	1.43
-249	1.36
-248	1.36
-247	1.36
-246	1.36
-245	1.36
-244	1.36
-243	1.36
-242	1.36
-241	1.36
-240	1.36
-239	1.39
-238	1.39
-237	1.39
-236	1.39
-235	1.39
-234	1.39
-233	1.39
-232	1.39
-231	1.39
-230	1.39
-229	1.23
-228	1.23
-227	1.23
-226	1.23
-225	1.23
-224	1.23
-223	1.23
-222	1.23
-221	1.23
-220	1.23
-219	1.23
-218	1.23
-217	1.23
-216	1.23
-215	1.23
-214	1.23
-213	1.23
-212	1.23
-211	1.23
-210	1.23
-209	1.36
-208	1.36
-207	1.36
-206	1.36
-205	1.36
-204	1.36
-203	1.36
-202	1.36
-201	1.36
-200	1.36
-199	1.36
-198	1.36
-197	1.36
-196	1.36
-195	1.36
-194	1.36
-193	1.36
-192	1.36
-191	1.36
-190	1.36
-189	1.25
-188	1.25
-187	1.25
-186	1.25
-185	1.25
-184	1.25
-183	1.25
-182	1.25
-181	1.25
-180	1.25
-179	1.25
-178	1.25
-177	1.25
-176	1.25
-175	1.25
-174	1.25
-173	1.25
-172	1.25
-171	1.25
-170	1.25
-169	1.25
-168	1.25
-167	1.25
-166	1.25
-165	1.25
-164	1.25
-163	1.25
-162	1.25
-161	1.25
-160	1.25
-159	1.24
-158	1.24
-157	1.24
-156	1.24
-155	1.24
-154	1.24
-153	1.24
-152	1.24
-151	1.24
-150	1.24
-149	1.04
-148	1.04
-147	1.04
-146	1.04
-145	1.04
-144	1.04
-143	1.04
-142	1.04
-141	1.04
-140	1.04
-139	1.04
-138	1.04
-137	1.04
-136	1.04
-135	1.04
-134	1.04
-133	1.04
-132	1.04
-131	1.04
-130	1.04
-129	1.04
-128	1.04
-127	1.04
-126	1.04
-125	1.04
-124	1.04
-123	1.04
-122	1.04
-121	1.04
-120	1.04
-119	1.04
-118	1.04
-117	1.04
-116	1.04
-115	1.04
-114	1.04
-113	1.04
-112	1.04
-111	1.04
-110	1.04
-109	1.04
-108	1.04
-107	1.04
-106	1.04
-105	1.04
-104	1.04
-103	1.04
-102	1.04
-101	1.04
-100	1.04
-99	0.88
-98	0.88
-97	0.88
-96	0.88
-95	0.88
-94	0.88
-93	0.88
-92	0.88
-91	0.88
-90	0.88
-89	0.88
-88	0.88
-87	0.88
-86	0.88
-85	0.88
-84	0.88
-83	0.88
-82	0.88
-81	0.88
-80	0.88
-79	0.88
-78	0.88
-77	0.88
-76	0.88
-75	0.88
-74	0.88
-73	0.88
-72	0.88
-71	0.88
-70	0.88
-69	1.26
-68	1.26
-67	1.26
-66	1.26
-65	1.26
-64	1.26
-63	1.26
-62	1.26
-61	1.26
-60	1.26
-59	1.10
-58	1.10
-57	1.10
-56	1.10
-55	1.10
-54	1.10
-53	1.10
-52	1.10
-51	1.10
-50	1.10
-49	1.10
-48	1.10
-47	1.10
-46	1.10
-45	1.10
-44	1.10
-43	1.10
-42	1.10
-41	1.10
-40	1.10
-39	1.29
-38	1.29
-37	1.29
-36	1.29
-35	1.29
-34	1.29
-33	1.29
-32	1.29
-31	1.29
-30	1.29
-29	0.99
-28	0.99
-27	0.99
-26	0.99
-25	0.99
-24	0.99
-23	0.99
-22	0.99
-21	0.99
-20	0.99
-19	1.00
-18	1.00
-17	1.00
-16	1.00
-15	1.00
-14	1.00
-13	1.00
-12	1.00
-11	1.00
-10	1.00
-9	1.00
-8	1.00
-7	1.00
-6	1.00
-5	1.00
-4	1.00
-3	1.00
-2	1.00
-1	1.00
0	1.00