-570	-0.0008
-569	-0.0008
-568	-0.0008
-567	-0.0008
-566	-0.0008
-565	-0.0008
-564	-0.0008
-563	-0.0008
-562	-0.0008
-561	-0.0008
-560	-0.0008
-559	-0.0008
-558	-0.0008
-557	-0.0008
-556	-0.0008
-555	-0.0008
-554	-0.0008
-553	-0.0008
-552	-0.0008
-551	-0.0008
-550	-0.0008
-549	-0.0008
-548	-0.0008
-547	-0.0008
-546	-0.0008
-545	-0.0008
-544	-0.0008
-543	-0.0008
-542	-0.0008
-541	-0.0008
-540	-0.0008
-539	-0.0008
-538	-0.0008
-537	-0.0008
-536	-0.0008
-535	-0.0008
-534	-0.0008
-533	-0.0008
-532	-0.0008
-531	-0.0008
-530	-0.0008
-529	-0.0008
-528	-0.0008
-527	-0.0008
-526	-0.0008
-525	-0.0008
-524	-0.0008
-523	-0.0008
-522	-0.0008
-521	-0.0008
-520	-0.0008
-519	-0.0008
-518	-0.0008
-517	-0.0008
-516	-0.0008
-515	-0.0008
-514	-0.0008
-513	-0.0008
-512	-0.0008
-511	-0.0008
-510	-0.0008
-509	-0.0008
-508	-0.0008
-507	-0.0008
-506	-0.0008
-505	-0.0008
-504	-0.0008
-503	-0.0008
-502	-0.0008
-501	-0.0008
-500	-0.0008
-499	-0.0008
-498	-0.0008
-497	-0.0008
-496	-0.0008
-495	-0.0008
-494	-0.0008
-493	-0.0008
-492	-0.0008
-491	-0.0008
-490	-0.0008
-489	-0.0008
-488	-0.0008
-487	-0.0008
-486	-0.0008
-485	-0.0008
-484	-0.0008
-483	-0.0008
-482	-0.0008
-481	-0.0008
-480	-0.0008
-479	-0.0008
-478	-0.0008
-477	-0.0008
-476	-0.0008
-475	-0.0008
-474	-0.0008
-473	-0.0008
-472	-0.0008
-471	-0.0008
-470	-0.0008
-469	-0.0007
-468	-0.0007
-467	-0.0007
-466	-0.0007
-465	-0.0007
-464	-0.0007
-463	-0.0007
-462	-0.0007
-461	-0.0007
-460	-0.0007
-459	-0.0006
-458	-0.0006
-457	-0.0006
-456	-0.0006
-455	-0.0006
-454	-0.0006
-453	-0.0006
-452	-0.0006
-451	-0.0006
-450	-0.0006
-449	0.0007
-448	0.0007
-447	0.0007
-446	0.0007
-445	0.0007
-444	0.0007
-443	0.0007
-442	0.0007
-441	0.0007
-440	0.0007
-439	0.001
-438	0.001
-437	0.001
-436	0.001
-435	0.001
-434	0.001
-433	0.001
-432	0.001
-431	0.001
-430	0.001
-429	0.0015
-428	0.0015
-427	0.0015
-426	0.0015
-425	0.0015
-424	0.0015
-423	0.0015
-422	0.0015
-421	0.0015
-420	0.0015
-419	0.002
-418	0.002
-417	0.002
-416	0.002
-415	0.002
-414	0.002
-413	0.002
-412	0.002
-411	0.002
-410	0.002
-409	0.001
-408	0.001
-407	0.001
-406	0.001
-405	0.001
-404	0.001
-403	0.001
-402	0.001
-401	0.001
-400	0.001
-399	0.0007
-398	0.0007
-397	0.0007
-396	0.0007
-395	0.0007
-394	0.0007
-393	0.0007
-392	0.0007
-391	0.0007
-390	0.0007
-389	0.001
-388	0.001
-387	0.001
-386	0.001
-385	0.001
-384	0.001
-383	0.001
-382	0.001
-381	0.001
-380	0.001
-379	0.0015
-378	0.0015
-377	0.0015
-376	0.0015
-375	0.0015
-374	0.0015
-373	0.0015
-372	0.0015
-371	0.0015
-370	0.0015
-369	0.002
-368	0.002
-367	0.002
-366	0.002
-365	0.002
-364	0.002
-363	0.002
-362	0.002
-361	0.002
-360	0.002
-359	0.003
-358	0.003
-357	0.003
-356	0.003
-355	0.003
-354	0.003
-353	0.003
-352	0.003
-351	0.003
-350	0.003
-349	0.0035
-348	0.0035
-347	0.0035
-346	0.0035
-345	0.0035
-344	0.0035
-343	0.0035
-342	0.0035
-341	0.0035
-340	0.0035
-339	0.004
-338	0.004
-337	0.004
-336	0.004
-335	0.004
-334	0.004
-333	0.004
-332	0.004
-331	0.004
-330	0.004
-329	0.0045
-328	0.0045
-327	0.0045
-326	0.0045
-325	0.0045
-324	0.0045
-323	0.0045
-322	0.0045
-321	0.0045
-320	0.0045
-319	0.005
-318	0.005
-317	0.005
-316	0.005
-315	0.005
-314	0.005
-313	0.005
-312	0.005
-311	0.005
-310	0.005
-309	0.0055
-308	0.0055
-307	0.0055
-306	0.0055
-305	0.0055
-304	0.0055
-303	0.0055
-302	0.0055
-301	0.0055
-300	0.0055
-299	0.0055
-298	0.0055
-297	0.0055
-296	0.0055
-295	0.0055
-294	0.0055
-293	0.0055
-292	0.0055
-291	0.0055
-290	0.0055
-289	0.0055
-288	0.0055
-287	0.0055
-286	0.0055
-285	0.0055
-284	0.0055
-283	0.0055
-282	0.0055
-281	0.0055
-280	0.0055
-279	0.0055
-278	0.0055
-277	0.0055
-276	0.0055
-275	0.0055
-274	0.0055
-273	0.0055
-272	0.0055
-271	0.0055
-270	0.0055
-269	0.004
-268	0.004
-267	0.004
-266	0.004
-265	0.004
-264	0.004
-263	0.004
-262	0.004
-261	0.004
-260	0.004
-259	0.002
-258	0.002
-257	0.002
-256	0.002
-255	0.002
-254	0.002
-253	0.002
-252	0.002
-251	0.002
-250	0.002
-249	0.002
-248	0.002
-247	0.002
-246	0.002
-245	0.002
-244	0.002
-243	0.002
-242	0.002
-241	0.002
-240	0.002
-239	0.002
-238	0.002
-237	0.002
-236	0.002
-235	0.002
-234	0.002
-233	0.002
-232	0.002
-231	0.002
-230	0.002
-229	0.001
-228	0.001
-227	0.001
-226	0.001
-225	0.001
-224	0.001
-223	0.001
-222	0.001
-221	0.001
-220	0.001
-219	0.00076
-218	0.00076
-217	0.00076
-216	0.00076
-215	0.00076
-214	0.00076
-213	0.00076
-212	0.00076
-211	0.00076
-210	0.00076
-209	0.0009
-208	0.0009
-207	0.0009
-206	0.0009
-205	0.0009
-204	0.0009
-203	0.0009
-202	0.0009
-201	0.0009
-200	0.0009
-199	0.00106
-198	0.00106
-197	0.00106
-196	0.00106
-195	0.00106
-194	0.00106
-193	0.00106
-192	0.00106
-191	0.00106
-190	0.00106
-189	0.00122
-188	0.00122
-187	0.00122
-186	0.00122
-185	0.00122
-184	0.00122
-183	0.00122
-182	0.00122
-181	0.00122
-180	0.00122
-179	0.00138
-178	0.00138
-177	0.00138
-176	0.00138
-175	0.00138
-174	0.00138
-173	0.00138
-172	0.00138
-171	0.00138
-170	0.00138
-169	0.00154
-168	0.00154
-167	0.00154
-166	0.00154
-165	0.00154
-164	0.00154
-163	0.00154
-162	0.00154
-161	0.00154
-160	0.00154
-159	0.0017
-158	0.0017
-157	0.0017
-156	0.0017
-155	0.0017
-154	0.0017
-153	0.0017
-152	0.0017
-151	0.0017
-150	0.0017
-149	0.0012
-148	0.0012
-147	0.0012
-146	0.0012
-145	0.0012
-144	0.0012
-143	0.0012
-142	0.0012
-141	0.0012
-140	0.0012
-139	0.002
-138	0.002
-137	0.002
-136	0.002
-135	0.002
-134	0.002
-133	0.002
-132	0.002
-131	0.002
-130	0.002
-129	0.0025
-128	0.0025
-127	0.0025
-126	0.0025
-125	0.0025
-124	0.0025
-123	0.0025
-122	0.0025
-121	0.0025
-120	0.0025
-119	0.0027
-118	0.0027
-117	0.0027
-116	0.0027
-115	0.0027
-114	0.0027
-113	0.0027
-112	0.0027
-111	0.0027
-110	0.0027
-109	0.0026
-108	0.0026
-107	0.0026
-106	0.0026
-105	0.0026
-104	0.0026
-103	0.0026
-102	0.0026
-101	0.0026
-100	0.0026
-99	0.0025
-98	0.0025
-97	0.0025
-96	0.0025
-95	0.0025
-94	0.0025
-93	0.0025
-92	0.0025
-91	0.0025
-90	0.0025
-89	0.0024
-88	0.0024
-87	0.0024
-86	0.0024
-85	0.0024
-84	0.0024
-83	0.0024
-82	0.0024
-81	0.0024
-80	0.0024
-79	0.0024
-78	0.0024
-77	0.0024
-76	0.0024
-75	0.0024
-74	0.0024
-73	0.0024
-72	0.0024
-71	0.0024
-70	0.0024
-69	0.0023
-68	0.0023
-67	0.0023
-66	0.0023
-65	0.0023
-64	0.0023
-63	0.0023
-62	0.0023
-61	0.0023
-60	0.0023
-59	0.0022
-58	0.0022
-57	0.0022
-56	0.0022
-55	0.0022
-54	0.0022
-53	0.0022
-52	0.0022
-51	0.0022
-50	0.0022
-49	0.0022
-48	0.0022
-47	0.0022
-46	0.0022
-45	0.0022
-44	0.0022
-43	0.0022
-42	0.0022
-41	0.0022
-40	0.0022
-39	0.0022
-38	0.0022
-37	0.0022
-36	0.0022
-35	0.0022
-34	0.0022
-33	0.0022
-32	0.0022
-31	0.0022
-30	0.0022
-29	0.002
-28	0.002
-27	0.002
-26	0.002
-25	0.002
-24	0.002
-23	0.002
-22	0.002
-21	0.002
-20	0.002
-19	0.0017
-18	0.0017
-17	0.0017
-16	0.0017
-15	0.0017
-14	0.0017
-13	0.0017
-12	0.0017
-11	0.0017
-10	0.0017
-9	0.0015
-8	0.0015
-7	0.0015
-6	0.0015
-5	0.0015
-4	0.0015
-3	0.0015
-2	0.0015
-1	0.0015
0	0.0015