{
  "hosting": [{
    "target": "prod",
    "public": "website",
    "ignore": [
      "firebase.json",
      "**/.*",
      "**/node_modules/**"
    ]
  },
  {
    "target": "dev",
    "public": "website",
    "ignore": [
      "firebase.json",
      "**/.*",
      "**/node_modules/**"
    ]
  }]
}
