<?xml version="1.0" encoding="utf-8"?>
<!-- Generator: Adobe Illustrator 22.1.0, SVG Export Plug-In . SVG Version: 6.00 Build 0)  -->
<svg version="1.1" id="Layer_1" xmlns="http://www.w3.org/2000/svg" xmlns:xlink="http://www.w3.org/1999/xlink" x="0px" y="0px"
	 viewBox="0 0 129.3 123.3" style="enable-background:new 0 0 129.3 123.3;" xml:space="preserve">
<style type="text/css">
	.st0{fill:#00C000;}
	.st1{fill:#FFFFFF;}
</style>
<polygon class="st0" points="16,96.3 115,117.3 115,10.3 16,10.3 "/>
<g>
	<g>
		<path class="st1" d="M69.5,58.5H54.5c-0.3,0-0.4-0.2-0.4-0.4V47.7c0-0.2,0.1-0.3,0.3-0.4l9.9-4.5c0.1,0,0.2,0,0.3,0l5.2,1.8
			c0.2,0,0.3,0.2,0.3,0.4v13C70,58.3,69.8,58.5,69.5,58.5z M54.9,57.6h14.2V45.3l-4.8-1.6l-9.4,4.2V57.6z"/>
		<path class="st1" d="M64.3,58.5c-0.3,0-0.4-0.2-0.4-0.4V43.5c0-0.3,0.2-0.4,0.4-0.4c0.3,0,0.4,0.2,0.4,0.4v14.5
			C64.7,58.3,64.6,58.5,64.3,58.5z"/>
		<g>
			<path class="st1" d="M56,49.8c-0.2,0-0.3-0.1-0.4-0.3c-0.1-0.2,0-0.5,0.3-0.6L62,47c0.2-0.1,0.5,0,0.6,0.3c0.1,0.2,0,0.5-0.3,0.6
				l-6.2,1.9C56.1,49.8,56,49.8,56,49.8z"/>
			<path class="st1" d="M56,52.1c-0.2,0-0.4-0.1-0.4-0.3c0-0.2,0.1-0.5,0.3-0.5L62,50c0.2,0,0.5,0.1,0.5,0.3c0,0.2-0.1,0.5-0.3,0.5
				L56,52.1C56,52.1,56,52.1,56,52.1z"/>
			<path class="st1" d="M56,54.4c-0.2,0-0.4-0.2-0.4-0.4c0-0.2,0.1-0.4,0.4-0.5l6.2-0.6c0.2,0,0.4,0.1,0.5,0.4
				c0,0.2-0.1,0.4-0.4,0.5L56,54.4L56,54.4z"/>
			<path class="st1" d="M62.1,56.7H56c-0.3,0-0.4-0.2-0.4-0.4c0-0.3,0.2-0.4,0.4-0.4h6.2c0.3,0,0.4,0.2,0.4,0.4
				C62.6,56.5,62.4,56.7,62.1,56.7z"/>
		</g>
		<path class="st1" d="M74.4,58.5h-6.6c-0.3,0-0.4-0.2-0.4-0.4c0-0.3,0.2-0.4,0.4-0.4H74V40.5l-5.9-1.9l-5.6,2.5V44
			c0,0.3-0.2,0.4-0.4,0.4c-0.3,0-0.4-0.2-0.4-0.4v-3.2c0-0.2,0.1-0.3,0.3-0.4l6-2.7c0.1,0,0.2,0,0.3,0l6.4,2.1
			c0.2,0.1,0.3,0.3,0.3,0.4v17.9C74.8,58.3,74.7,58.5,74.4,58.5z"/>
		<path class="st1" d="M71.8,43.6c-0.3,0-0.4-0.2-0.4-0.4v-1.7c0-0.3,0.2-0.4,0.4-0.4c0.3,0,0.4,0.2,0.4,0.4v1.7
			C72.2,43.5,72.1,43.6,71.8,43.6z"/>
		<path class="st1" d="M71.8,46.7c-0.3,0-0.4-0.2-0.4-0.4v-1.7c0-0.3,0.2-0.4,0.4-0.4c0.3,0,0.4,0.2,0.4,0.4v1.7
			C72.2,46.5,72.1,46.7,71.8,46.7z"/>
		<path class="st1" d="M71.8,49.7c-0.3,0-0.4-0.2-0.4-0.4v-1.7c0-0.3,0.2-0.4,0.4-0.4c0.3,0,0.4,0.2,0.4,0.4v1.7
			C72.2,49.6,72.1,49.7,71.8,49.7z"/>
		<path class="st1" d="M71.8,52.8c-0.3,0-0.4-0.2-0.4-0.4v-1.7c0-0.3,0.2-0.4,0.4-0.4c0.3,0,0.4,0.2,0.4,0.4v1.7
			C72.2,52.6,72.1,52.8,71.8,52.8z"/>
		<path class="st1" d="M71.8,55.8c-0.3,0-0.4-0.2-0.4-0.4v-1.7c0-0.3,0.2-0.4,0.4-0.4c0.3,0,0.4,0.2,0.4,0.4v1.7
			C72.2,55.6,72.1,55.8,71.8,55.8z"/>
	</g>
	<g>
		<path class="st1" d="M58,71.7h-1.7v-1c-0.6,0.8-1.6,1.2-2.8,1.2c-2.6,0-4.6-2.2-4.6-5c0-2.8,2-5,4.6-5c2.1,0,3.7,1.2,4.3,3.2h-2
			c-0.4-0.8-1.3-1.5-2.4-1.5c-1.6,0-2.8,1.5-2.8,3.3c0,1.8,1.3,3.3,2.9,3.3c1.4,0,2.4-0.9,2.8-2.1h-2.6v-1.7H58V71.7z"/>
		<path class="st1" d="M61.4,71.7h-1.8v-9.5h1.8V71.7z"/>
		<path class="st1" d="M70.2,71.7h-1.8v-2.5c0-0.8-0.4-1.2-1.2-1.2h-2.5v3.7h-1.8v-9.5h4.4c2,0,3.3,1.1,3.3,2.8
			c0,1.1-0.5,1.8-1.3,2.2c0.7,0.4,1,1,1,2V71.7z M67.3,66.3c0.2,0,1.4-0.1,1.4-1.3c0-0.3,0-1.3-1.5-1.3h-2.5v2.5H67.3z"/>
		<path class="st1" d="M80.5,66c0-0.1,0-0.1,0-0.2l-0.1-0.3c-0.1-0.5-0.6-0.8-1.1-0.7c-0.5,0.1-0.8,0.6-0.7,1.1l0.1,0.3
			c0,0,0,0,0,0.1c0,0.2,0,0.4,0,0.6c0,1.8-1.3,3.3-2.8,3.3c-1.6,0-2.8-1.5-2.8-3.3c0-1.8,1.3-3.2,2.8-3.2c0.1,0,0.2,0,0.3,0L76,64.1
			c-0.1,0.1,0,0.2,0.1,0.2H79c0.1,0,0.2-0.1,0.1-0.2l-1.5-2.5c-0.1-0.1-0.2-0.1-0.2,0L77.2,62c-0.4-0.1-0.8-0.2-1.2-0.2
			c-2.7,0-4.7,2.2-4.7,5c0,2.8,2,5,4.7,5c2.7,0,4.7-2.2,4.7-5C80.6,66.5,80.6,66.3,80.5,66z"/>
	</g>
	<g>
		<path class="st1" d="M39.2,63.8c0.1,0,0.4-0.1,0.3-0.6l-0.2-0.9l-0.9,0.2l0.2,0.9C38.7,63.5,38.8,63.9,39.2,63.8z"/>
		<path class="st1" d="M79.5,81.1c-0.5,0.3-0.6,0.9-0.3,1.5c0.3,0.5,0.9,0.7,1.4,0.5c0.5-0.3,0.6-0.9,0.3-1.5
			C80.6,81,80,80.8,79.5,81.1z"/>
		<path class="st1" d="M55.5,82.5c-0.5-0.2-1.1,0.1-1.4,0.6c-0.2,0.6,0,1.2,0.5,1.4c0.5,0.2,1.1-0.1,1.4-0.6
			C56.2,83.3,56,82.7,55.5,82.5z"/>
		<path class="st1" d="M67.7,84.7l-0.6,0l0.1,2.1l0.6,0c0.8,0,0.8-0.7,0.8-1.1C68.6,85.2,68.4,84.6,67.7,84.7z"/>
		<path class="st1" d="M47,76.9l-1.5,1.5l0.4,0.4c0.6,0.5,1.1,0.1,1.4-0.2c0.3-0.4,0.6-0.9,0.1-1.4L47,76.9z"/>
		<polygon class="st1" points="90,40 88.6,40.3 89.1,41.1 		"/>
		<polygon class="st1" points="93.9,60.7 92.5,61.1 93.8,61.7 		"/>
		<path class="st1" d="M87.3,36.8c0.1-0.1,0.3-0.3,0-0.7l-0.6-0.6l-0.6,0.6l0.6,0.7C86.7,36.8,87,37,87.3,36.8z"/>
		<path class="st1" d="M55.1,30c0.5-0.2,0.7-0.8,0.5-1.4c-0.2-0.6-0.8-0.9-1.3-0.7c-0.5,0.2-0.7,0.8-0.5,1.4
			C54,29.9,54.6,30.2,55.1,30z"/>
		<path class="st1" d="M65.6,23c-18.3,0-33.2,14.9-33.2,33.2s14.9,33.2,33.2,33.2c18.3,0,33.2-14.9,33.2-33.2S83.9,23,65.6,23z
			 M92.6,43.5l-2.5,1l0.6,1.5l-0.5,0.2l-0.9-2.1l3-1.3L92.6,43.5z M90.4,39.3l0.4,0.7l-2.2,2.7l-0.3-0.6l0.4-0.5l-0.7-1.1l-0.7,0.2
			L87,40L90.4,39.3z M87.7,35.8c0.4,0.5,0.5,1.1,0,1.5c-0.3,0.2-0.6,0.3-0.9,0.1c0.1,0.3,0,0.5-0.3,0.7L86,38.6l-0.4-0.5l0.6-0.6
			c0.2-0.2,0.2-0.4,0-0.6l-0.6-0.6l-0.9,0.8l-0.4-0.5l2.4-2.1L87.7,35.8z M81.5,32.2c0.6-0.7,1.6-0.9,2.3-0.3
			c0.6,0.4,0.7,1.1,0.5,1.8l-0.5-0.4c0.1-0.3,0-0.7-0.3-0.9C83,32,82.4,32.1,82,32.6c-0.4,0.5-0.4,1.1,0.1,1.5
			c0.4,0.3,0.8,0.3,1.2,0l-0.7-0.5l0.4-0.4l1.1,0.9l-1.1,1.4l-0.4-0.4l0.2-0.3c-0.3,0.1-0.7,0-1-0.3C81,34,80.9,33,81.5,32.2z
			 M78.6,28.6l2.1,1.1l-0.3,0.5l-1.5-0.8L78.5,30l1.3,0.7l-0.3,0.5l-1.3-0.7l-0.4,0.7l1.6,0.9l-0.3,0.5L77,31.4L78.6,28.6z
			 M74.1,27.4l0.2-0.5l2.2,0.8l-0.2,0.5l-0.8-0.3l-0.9,2.5L74,30.2l0.9-2.5L74.1,27.4z M69.4,25.7l0.7,0.1l0.9,2.5l0.4-2.3l0.6,0.1
			l-0.6,3.2l-0.7-0.1l-0.9-2.5L69.4,29l-0.6-0.1L69.4,25.7z M66.3,25.4l0.6,0l-0.2,3.2l-0.6,0L66.3,25.4z M58.7,26.1l1.7,2L60,25.8
			l0.6-0.1l0.6,3.2L60.5,29l-1.7-2l0.4,2.3l-0.6,0.1L58,26.2L58.7,26.1z M54,26.5l0.6-0.3l-0.4,0.9l-0.4,0.2L54,26.5z M54.1,27.4
			c0.9-0.3,1.7,0.1,2.1,1c0.3,0.9,0,1.8-0.9,2.1c-0.9,0.3-1.7-0.1-2.1-1C52.9,28.6,53.3,27.7,54.1,27.4z M50.6,29.1l1.6,2.8
			l-0.5,0.3L50,29.4L50.6,29.1z M48.1,30.6l0.3,0.5l-0.7,0.5l1.6,2.1l-0.5,0.4l-1.6-2.1l-0.7,0.5L46.2,32L48.1,30.6z M43.7,34.2
			c0.6-0.6,1.3-0.5,1.6-0.1l-0.4,0.4c-0.2-0.2-0.5-0.2-0.8,0.1c-0.2,0.2-0.4,0.5-0.2,0.7c0.2,0.2,0.4,0.1,0.8-0.2
			c0.7-0.4,1.1-0.6,1.6-0.2c0.4,0.4,0.4,1.1-0.2,1.7c-0.4,0.4-1.2,0.7-1.7,0.1l0.4-0.4c0.3,0.3,0.7,0.1,0.9-0.1
			c0.3-0.3,0.4-0.6,0.2-0.8c-0.1-0.1-0.4-0.1-0.9,0.2c-0.5,0.3-1.1,0.6-1.5,0.2C43.1,35.3,43.1,34.7,43.7,34.2z M41.3,36.9l0.5,0.3
			l-1,1.4l0.6,0.4l0.9-1.2l0.5,0.3l-0.9,1.2l0.7,0.5l1-1.4l0.5,0.3l-1.4,1.9l-2.6-1.9L41.3,36.9z M37.9,42.3c0.3-0.6,0.9-1,1.6-0.9
			l-0.3,0.6c-0.3,0-0.7,0.2-0.8,0.5c-0.2,0.5,0,1.1,0.6,1.4c0.5,0.3,1.2,0.1,1.4-0.4c0.2-0.4,0.1-0.9-0.2-1.2l-0.4,0.8l-0.5-0.2
			l0.6-1.3l1.6,0.8l-0.2,0.5L41,42.7c0.1,0.3,0.1,0.7-0.1,1c-0.4,0.8-1.3,1.1-2.2,0.7C37.9,44.1,37.5,43.1,37.9,42.3z M36.4,55.8
			C36.4,55.8,36.4,55.8,36.4,55.8L36.4,55.8c-0.3,0.1-0.6,0.2-0.8,0.2l-0.9,0l-0.4,0c-0.2,0-0.4-0.2-0.4-0.5l0-2.3
			c0-0.2,0.2-0.5,0.5-0.4l1.2,0c0.3,0,0.5,0.1,0.7,0.2c0.2,0.1,0.4,0.4,0.4,0.7c0,0.3-0.1,0.5-0.3,0.6c0.2,0.1,0.3,0.2,0.4,0.4
			l0.8-1.6c0.1-0.2,0.3-0.3,0.5-0.3h0l0,0c0.2,0,0.4,0.1,0.5,0.3l1.1,2.2c0,0.1,0.1,0.1,0.1,0.2c0,0.2-0.2,0.4-0.5,0.4
			c-0.2,0-0.3-0.1-0.4-0.3c0-0.1-0.1-0.1-0.2-0.1l-1.4,0c-0.1,0-0.2,0.1-0.2,0.1C37.2,55.9,37,56,36.8,56
			C36.7,56,36.5,55.9,36.4,55.8z M37,64.1l0.8-0.2c0.3-0.1,0.4-0.2,0.3-0.5L38,62.6l-1.2,0.3l-0.1-0.6l3.2-0.6l0.3,1.5
			c0.1,0.7-0.1,1.2-0.7,1.3c-0.4,0.1-0.6-0.1-0.8-0.3c-0.1,0.3-0.3,0.4-0.6,0.5l-0.8,0.2L37,64.1z M39.4,67.4l-0.8,0.3l0.7,1.7
			l-0.5,0.2l-0.9-2.3l3.1-1.2l0.9,2.3l-0.5,0.2l-0.7-1.7l-0.7,0.3l0.6,1.4L40,68.8L39.4,67.4z M42,73.5c-0.5,0.3-1.2,0.1-1.6-0.7
			c-0.3-0.6-0.4-1.4,0.3-1.8l0.3,0.6c-0.3,0.2-0.3,0.6-0.1,0.9c0.2,0.3,0.5,0.6,0.8,0.4c0.2-0.1,0.2-0.3,0-0.9
			c-0.2-0.6-0.4-1.2,0.2-1.6c0.5-0.3,1.1-0.1,1.5,0.6c0.5,0.8,0.2,1.4-0.3,1.7l-0.3-0.6c0.2-0.1,0.3-0.5,0.1-0.8
			c-0.2-0.3-0.4-0.5-0.7-0.4c-0.2,0.1-0.1,0.4,0,0.8C42.5,72.7,42.6,73.2,42,73.5z M42.6,76l2.6-2.1l0.4,0.5L43,76.5L42.6,76z
			 M47.8,79.1c-0.7,0.7-1.6,0.8-2.2,0.2l-0.9-0.9l2.3-2.4l0.9,0.9C48.5,77.5,48.5,78.3,47.8,79.1z M51.5,82.1
			c-0.5,0.7-1.1,0.9-1.8,0.4c-0.7-0.5-0.8-1.1-0.3-1.8l1.1-1.7l0.5,0.4L49.8,81c-0.3,0.4-0.2,0.7,0.1,1c0.4,0.2,0.7,0.2,0.9-0.3
			l1.1-1.7l0.5,0.4L51.5,82.1z M56.6,84.1c-0.4,0.9-1.3,1.3-2.2,0.9c-0.9-0.4-1.2-1.3-0.8-2.2c0.4-0.9,1.3-1.3,2.2-0.9
			C56.6,82.3,56.9,83.3,56.6,84.1z M61.2,84.7l-0.6-0.1c0.1-0.3-0.1-0.5-0.5-0.6c-0.3-0.1-0.7,0-0.7,0.2c-0.1,0.2,0.2,0.4,0.6,0.6
			c0.7,0.3,1.2,0.6,1,1.3c-0.1,0.6-0.8,0.9-1.6,0.7c-0.6-0.1-1.3-0.7-1.1-1.4l0.6,0.1c-0.1,0.4,0.3,0.6,0.6,0.7
			c0.4,0.1,0.8,0,0.8-0.3c0-0.2-0.1-0.4-0.7-0.6c-0.6-0.3-1.2-0.6-1-1.3c0.1-0.5,0.7-0.8,1.5-0.6C61.1,83.6,61.4,84.2,61.2,84.7z
			 M40.9,56.2c0-13.6,11.1-24.7,24.7-24.7c13.6,0,24.7,11.1,24.7,24.7c0,13.6-11.1,24.7-24.7,24.7C52,80.9,40.9,69.8,40.9,56.2z
			 M67.9,87.4l-1.2,0.1l-0.2-3.3l1.2-0.1c0.9-0.1,1.6,0.5,1.6,1.5C69.3,86.6,68.8,87.3,67.9,87.4z M71.8,86.9L71,83.7l2.4-0.6
			l0.1,0.6l-1.8,0.4l0.2,0.7l1.5-0.4l0.1,0.6l-1.5,0.4l0.2,0.8l1.8-0.4l0.1,0.6L71.8,86.9z M80.9,83.5c-0.8,0.5-1.8,0.2-2.3-0.7
			c-0.5-0.8-0.3-1.8,0.6-2.3c0.8-0.5,1.8-0.2,2.3,0.7C82,82,81.7,83,80.9,83.5z M84.8,80.8l-0.5,0.4l-2.1-2.5l1.8-1.6l0.4,0.4
			L83,78.7l0.5,0.6l1.2-1l0.4,0.4l-1.2,1L84.8,80.8z M87.8,77.9l-2.5-2.2l0.4-0.5l2.5,2.2L87.8,77.9z M90.7,74.2
			c-0.5,0.8-1.5,1-2.3,0.4c-0.8-0.5-1.1-1.5-0.6-2.3c0.4-0.6,1.1-0.9,1.8-0.7l-0.4,0.6c-0.3,0-0.7,0.1-0.9,0.4
			c-0.3,0.5-0.1,1.1,0.4,1.5c0.5,0.3,1.2,0.3,1.5-0.2c0.2-0.3,0.2-0.7,0-1l0.4-0.6C91,72.9,91.1,73.6,90.7,74.2z M92.5,70.8l-3-1.4
			l0.3-0.6l3,1.4L92.5,70.8z M94.3,65.9l-2.6,0.7l2.3,0.6l-0.2,0.6L90.6,67l0.2-0.7l2.6-0.7l-2.3-0.6l0.2-0.6l3.2,0.9L94.3,65.9z
			 M95.2,60.4l-0.7,0.2l-0.1,1.3l0.6,0.3l-0.1,0.7l-3.2-1.5l0.1-0.8l3.4-0.9L95.2,60.4z M96.9,56c-0.2,0-0.3-0.1-0.4-0.3
			c0-0.1-0.1-0.1-0.2-0.1l-1.4,0c-0.1,0-0.2,0.1-0.2,0.1c-0.1,0.2-0.2,0.3-0.4,0.3c-0.2,0-0.3-0.1-0.4-0.2c0,0,0,0,0,0l-0.1,0
			c-0.2,0.1-0.5,0.1-0.7,0.1l-0.9,0l-0.4,0c-0.2,0-0.4-0.2-0.4-0.5l0-2.3c0-0.2,0.2-0.5,0.5-0.4l1.2,0c0.3,0,0.5,0.1,0.7,0.2
			c0.2,0.1,0.4,0.4,0.4,0.7c0,0.3-0.1,0.5-0.3,0.6c0.2,0.1,0.3,0.2,0.4,0.4l0.8-1.6c0.1-0.2,0.3-0.3,0.5-0.3l0,0
			c0.2,0,0.4,0.1,0.5,0.3l1.1,2.2c0,0.1,0.1,0.1,0.1,0.2C97.3,55.8,97.1,56,96.9,56z"/>
	</g>
</g>
</svg>
