<?xml version="1.0" encoding="UTF-8" standalone="no"?>
<!-- Created with Inkscape (http://www.inkscape.org/) -->

<svg
   width="100mm"
   height="100mm"
   viewBox="0 0 100 100"
   version="1.1"
   id="svg1"
   inkscape:version="1.3 (0e150ed, 2023-07-21)"
   sodipodi:docname="amps.svg"
   xmlns:inkscape="http://www.inkscape.org/namespaces/inkscape"
   xmlns:sodipodi="http://sodipodi.sourceforge.net/DTD/sodipodi-0.dtd"
   xmlns:xlink="http://www.w3.org/1999/xlink"
   xmlns="http://www.w3.org/2000/svg"
   xmlns:svg="http://www.w3.org/2000/svg">
  <sodipodi:namedview
     id="namedview1"
     pagecolor="#ffffff"
     bordercolor="#000000"
     borderopacity="0.25"
     inkscape:showpageshadow="2"
     inkscape:pageopacity="0.0"
     inkscape:pagecheckerboard="0"
     inkscape:deskcolor="#d1d1d1"
     inkscape:document-units="mm"
     inkscape:zoom="1.5019781"
     inkscape:cx="170.4419"
     inkscape:cy="183.42478"
     inkscape:window-width="1451"
     inkscape:window-height="991"
     inkscape:window-x="26"
     inkscape:window-y="23"
     inkscape:window-maximized="0"
     inkscape:current-layer="layer1" />
  <defs
     id="defs1">
    <linearGradient
       id="linearGradient43"
       inkscape:collect="always">
      <stop
         style="stop-color:#ffffff;stop-opacity:1;"
         offset="0"
         id="stop43" />
      <stop
         style="stop-color:#fffffb;stop-opacity:1;"
         offset="1"
         id="stop44" />
    </linearGradient>
    <linearGradient
       inkscape:collect="always"
       xlink:href="#linearGradient43"
       id="linearGradient44"
       x1="2.1283295"
       y1="50.296145"
       x2="98.525203"
       y2="50.296145"
       gradientUnits="userSpaceOnUse" />
  </defs>
  <g
     inkscape:label="Layer 1"
     inkscape:groupmode="layer"
     id="layer1">
    <rect
       style="fill:url(#linearGradient44);stroke-width:3.06501;stroke-linejoin:round"
       id="rect43"
       width="96.396873"
       height="97.131088"
       x="2.1283295"
       y="1.7306008" />
    <path
       style="fill:#000000;stroke-width:1.81121;stroke-linejoin:round"
       id="path23"
       d="m 15.655587,9.0781903 c -0.558704,0.018106 -1.127133,0.015695 -1.677691,0.1268053 -0.143972,0.029056 -0.284704,0.072339 -0.427056,0.1085084 -0.520859,0.1757201 -1.010395,0.4548152 -1.27564,0.958649 -0.167426,0.318027 -0.154738,0.438459 -0.207332,0.789673 0.0089,0.574634 0.161113,1.137731 0.408751,1.654907 0.04463,0.0932 0.08801,0.188365 0.148579,0.272091 0.05699,0.07878 0.134073,0.140856 0.20111,0.211283 0.08627,0.04796 0.166346,0.109313 0.258796,0.143882 0.506282,0.189308 1.10353,0.09966 1.615151,-0.0069 0.611721,-0.181036 1.069168,-0.602038 1.491024,-1.059439 0.154489,-0.156805 0.433195,-0.584211 0.02865,-0.670361 -0.129357,-0.02755 -0.289452,0.09299 -0.386084,0.150164 -0.369741,0.262986 -0.547489,0.657817 -0.643675,1.088001 0.0056,0.06302 -0.0041,0.129388 0.01689,0.18905 0.0907,0.257052 0.409598,0.384015 0.662439,0.370381 0.074,-0.004 0.145685,-0.02729 0.218528,-0.04094 0.216919,-0.0743 0.392311,-0.199018 0.555845,-0.356056 0.03499,-0.03359 0.141141,-0.154839 0.196755,-0.192011 0.004,-0.0027 0.0074,0.0059 0.01117,0.0089 0.0068,0.124866 -0.09955,-0.03401 -0.112691,0.0012 -0.01685,0.04512 0.108754,0.191675 0.126439,0.206374 0.0346,0.02875 0.07729,0.04607 0.115937,0.06911 0.24292,0.09147 0.499038,0.109599 0.753645,0.07426 0.465113,-0.158221 0.811193,-0.535464 1.0947,-0.922472 0.40441,-0.598747 0.621436,-1.282502 0.782917,-1.979522 0.118365,-0.6460349 0.217216,-1.3041383 0.161778,-1.9618365 -0.04486,-0.2046809 -0.219376,-0.4734008 -0.474904,-0.4020344 -0.173204,0.048374 -0.226507,0.1551857 -0.332059,0.2840184 -0.30906,0.5595714 -0.385251,1.2010107 -0.480513,1.8227525 -0.06919,0.456559 -0.120591,0.915384 -0.142502,1.37664 -0.0034,0.338052 0.09815,0.659023 0.277339,0.942688 0.193377,0.270107 0.454593,0.449134 0.763693,0.559698 0.38712,0.107691 0.679738,0.09102 1.049864,-0.06166 0.479505,-0.29231 0.768092,-0.776488 1.012644,-1.266273 0.276599,-0.602886 0.379377,-1.261749 0.49578,-1.9092058 0.05882,-0.4525354 0.03372,-0.9173994 -0.146585,-1.3395657 -0.199762,-0.268055 -0.55552,-0.3929521 -0.876781,-0.2614888 -0.06881,0.028157 -0.127916,0.075808 -0.191874,0.1137122 -0.05865,0.069781 -0.126066,0.1330463 -0.175946,0.2093412 -0.323443,0.4947298 -0.395118,1.1394652 -0.472729,1.7100839 -0.0198,0.362365 -0.108965,0.742147 -0.03334,1.104856 0.04366,0.20939 0.09406,0.270302 0.19446,0.456465 0.253935,0.399748 0.562928,0.554433 1.012648,0.644647 0.282554,0.04502 0.568902,0.04975 0.853644,0.02993 0.204325,-0.01484 0.183332,-0.303804 -0.021,-0.288959 v 0 c -0.258932,0.01972 -0.519533,0.01219 -0.776842,-0.02517 -0.363375,-0.06955 -0.606163,-0.176724 -0.816238,-0.499231 -0.07085,-0.125581 -0.128446,-0.204691 -0.160022,-0.346704 -0.07553,-0.339669 0.01225,-0.698123 0.02782,-1.03793 0.07863,-0.5887016 0.155366,-1.2249484 0.522683,-1.71293 0.223768,-0.1586419 0.438617,-0.1719872 0.648034,0.020685 0.168179,0.3642964 0.173297,0.7792611 0.130121,1.1722208 -0.108798,0.6211102 -0.204402,1.2537642 -0.469228,1.8318702 -0.213468,0.428512 -0.461447,0.856906 -0.869808,1.127279 -0.275509,0.120073 -0.550114,0.138631 -0.841501,0.05376 -0.248974,-0.08426 -0.457514,-0.228912 -0.614517,-0.44295 -0.151131,-0.22966 -0.232742,-0.495764 -0.232977,-0.77173 0.02046,-0.451165 0.06716,-0.900388 0.134592,-1.347014 0.08766,-0.573627 0.155672,-1.1642167 0.426358,-1.6869965 0.108517,-0.146833 0.181602,-0.3289527 0.29166,-0.034402 0.06272,0.626764 -0.03768,1.255887 -0.14762,1.8719855 -0.152914,0.660022 -0.35831,1.306746 -0.742025,1.873298 -0.236113,0.326344 -0.524316,0.652253 -0.90571,0.804927 -0.191485,0.03349 -0.388176,0.0091 -0.574367,-0.04642 -0.16113,-0.04803 -0.111433,-0.362926 -0.362318,-0.293988 -0.03638,0.01707 -0.07584,0.02874 -0.109155,0.05123 -0.05128,0.03461 -0.159792,0.158635 -0.197419,0.196255 -0.122609,0.122589 -0.2564,0.221351 -0.419313,0.285282 -0.182535,0.04473 -0.312186,0.04255 -0.480337,-0.04998 -0.01884,-0.01037 -0.0421,-0.01811 -0.0532,-0.03654 -0.01558,-0.02588 -0.0145,-0.05864 -0.02175,-0.08797 0.07255,-0.354179 0.213385,-0.681577 0.512396,-0.902264 0.231563,-0.151169 0.136113,-0.04747 0.138487,-0.200594 1.41e-4,-0.0091 0.02776,-0.01 0.02729,-8.86e-4 -0.0061,0.1175 -0.104789,0.198347 -0.170754,0.281493 -0.37973,0.414712 -0.789267,0.802067 -1.339687,0.973333 -0.451354,0.09736 -0.969549,0.177757 -1.422076,0.03268 -0.06675,-0.0214 -0.125993,-0.06149 -0.188989,-0.09224 -0.05165,-0.04912 -0.11236,-0.09022 -0.154958,-0.147368 -0.05617,-0.07536 -0.09671,-0.161442 -0.138098,-0.245824 -0.229793,-0.468501 -0.372028,-0.980839 -0.389392,-1.503127 0.01572,-0.117775 0.01919,-0.237842 0.04715,-0.353326 0.149413,-0.617192 0.652873,-0.9700494 1.225717,-1.162357 0.132856,-0.034085 0.264115,-0.075144 0.398567,-0.1022581 0.536706,-0.1082353 1.091956,-0.1046631 1.636638,-0.1142734 0.205907,0 0.205907,-0.2911962 0,-0.2911962 z" />
    <path
       style="fill:#000000;stroke-width:1.81121;stroke-linejoin:round"
       id="path24"
       d="M 28.081101,7.9746763 C 27.588629,8.4327409 27.253277,9.0106021 27.15549,9.6828264 27.12793,9.8722922 27.1335,10.065115 27.12251,10.25626 c 0.02628,0.726018 0.158024,1.567349 0.666638,2.131818 0.07602,0.08436 0.172084,0.148214 0.258125,0.222321 0.118565,0.03126 0.233176,0.09864 0.355697,0.09379 0.362351,-0.01437 0.732502,-0.254656 1.004541,-0.456641 0.61253,-0.454794 1.103341,-1.035142 1.589006,-1.615683 0.542534,-0.7454197 0.996969,-1.5194235 0.69862,-2.4736864 C 31.521378,7.6024154 31.317741,7.4540881 30.949892,7.0268545 30.778551,6.89638 30.618706,6.7492356 30.435869,6.635431 29.891735,6.2967457 29.20237,6.1299297 28.570111,6.28409 28.46018,6.310894 28.357499,6.361614 28.251193,6.4003754 c -0.278116,0.1620499 -0.482109,0.3836093 -0.58131,0.6952844 -0.03296,0.1035547 -0.03996,0.2136425 -0.05994,0.3204636 -0.03452,0.1990553 0.246983,0.2478787 0.281507,0.048823 v 0 c 0.06023,-0.3857572 0.124546,-0.5714536 0.460452,-0.7979058 0.08702,-0.034253 0.1707,-0.078664 0.261062,-0.1027586 0.557506,-0.1486555 1.173027,-0.00322 1.657641,0.2905877 0.168039,0.101878 0.315324,0.2345965 0.472986,0.3518949 0.332087,0.3754154 0.515917,0.5067392 0.680337,0.9945284 0.292615,0.8681117 -0.146186,1.5762592 -0.635115,2.257181 -0.467382,0.561114 -0.938365,1.113997 -1.527115,1.555171 -0.178133,0.133482 -0.540774,0.373607 -0.798311,0.411668 -0.07773,0.01149 -0.155515,-0.02255 -0.233273,-0.03382 -0.06988,-0.05613 -0.148589,-0.102761 -0.209642,-0.168382 -0.479874,-0.515776 -0.590682,-1.282228 -0.621389,-1.951802 0.0089,-0.174947 0.0028,-0.3513081 0.02676,-0.5248424 0.08406,-0.609857 0.387987,-1.134854 0.839607,-1.5447137 C 28.426015,8.0713932 28.24166,7.84432 28.081093,7.9746797 Z" />
    <path
       style="fill:#000000;stroke-width:1.81121;stroke-linejoin:round"
       id="path25"
       d="m 31.80869,10.965735 c -0.05301,0.552126 -0.0585,1.107249 -0.101151,1.660059 -0.0076,0.08027 -0.03117,0.346369 -0.04594,0.442204 -0.0033,0.02117 -0.0383,0.06205 -0.01688,0.06199 0.09317,-2.5e-4 0.207526,0.0042 0.27239,-0.06267 0.04519,-0.04659 -0.01758,-0.128649 -0.02422,-0.193219 -0.0107,-0.104027 -0.01852,-0.208328 -0.02778,-0.312492 -0.0303,-0.372673 -0.0476,-0.74789 -0.01856,-1.121339 0.0138,-0.17763 0.02686,-0.348169 0.109595,-0.509347 0.0277,-0.05395 0.07366,-0.09636 0.110482,-0.144546 0.03637,-0.02475 0.06829,-0.05782 0.109092,-0.07426 0.160367,-0.06461 0.284657,0.245102 0.326231,0.344272 -5.6e-5,0.08973 0.01123,0.05199 -0.0218,0.116144 -0.0537,0.199477 0.228398,0.275429 0.282103,0.07595 v 0 c 0.04025,-0.201933 0.03712,-0.09849 0.005,-0.310425 -0.135471,-0.291333 -0.395868,-0.654388 -0.767611,-0.455862 -0.06401,0.03418 -0.112164,0.09209 -0.168245,0.138129 -0.04932,0.07385 -0.110041,0.141246 -0.14795,0.221552 -0.220544,0.467193 -0.113423,1.240733 -0.102117,1.743348 0.0084,0.107401 0.01537,0.214914 0.02504,0.322204 0.0067,0.07395 -0.03157,0.172226 0.02402,0.221467 0.0766,0.06786 0.198019,0.07489 0.29992,0.06552 0.03206,-0.003 0.01421,-0.06288 0.01849,-0.09479 0.01295,-0.0965 0.0363,-0.372196 0.04349,-0.452524 0.04067,-0.560178 0.04615,-1.122848 0.109763,-1.681371 0,-0.207429 -0.293349,-0.207429 -0.293349,0 z" />
    <path
       style="fill:#000000;stroke-width:1.81121;stroke-linejoin:round"
       id="path26"
       d="m 34.449486,10.587299 c -0.184118,0.04462 -0.551089,0.01256 -0.633722,0.241935 -0.02523,0.07002 -0.0012,0.148847 -0.002,0.223271 0.08199,0.250789 0.522413,0.434164 0.553587,0.682155 -0.02892,-0.0333 -0.03028,-0.04852 -0.08493,-0.04358 -0.06001,0.0054 -0.118231,0.02362 -0.177892,0.03202 -0.24106,0.03395 -0.481095,0.05561 -0.721155,0.098 -0.06472,0.01716 -0.129448,0.03432 -0.194175,0.05149 -0.197309,0.05357 -0.121552,0.332603 0.07576,0.279037 v 0 c 0.05643,-0.01573 0.112869,-0.03146 0.169304,-0.04719 0.273638,-0.05003 0.16961,-0.03546 0.464626,-0.06957 0.210858,-0.02438 0.54868,-0.01286 0.701246,-0.201104 0.03959,-0.04885 0.03145,-0.121758 0.04719,-0.182637 -0.01656,-0.04561 -0.0266,-0.09414 -0.04967,-0.136826 -0.115572,-0.213809 -0.342797,-0.346954 -0.499221,-0.526398 -0.0163,0.0054 -0.03243,0.02129 -0.0489,0.01638 -0.01037,-0.0031 -0.01252,-0.02534 -0.0041,-0.0322 0.117807,-0.09648 0.318595,-0.05234 0.453827,-0.09608 0.204139,-0.03519 0.154371,-0.323888 -0.04977,-0.288696 z" />
    <path
       style="fill:#000000;stroke-width:1.81121;stroke-linejoin:round"
       id="path27"
       d="m 32.601864,10.95202 c -0.208631,0.002 -0.417186,0.03583 -0.621327,0.0772 -0.201487,0.04129 -0.143093,0.326237 0.0584,0.284946 v 0 c 0.184566,-0.03832 0.374196,-0.06858 0.562932,-0.0687 0.207495,0 0.207495,-0.293441 0,-0.293441 z" />
    <path
       style="fill:#000000;stroke-width:1.81121;stroke-linejoin:round"
       id="path28"
       d="m 11.982626,18.063562 c 0.08277,1.351842 0.03966,2.709139 0.0551,4.063219 0.106263,2.689217 0.330667,5.373055 0.609586,8.049431 0.05146,0.406551 0.09844,0.813695 0.154395,1.21965 0.04499,0.326377 0.281752,1.877509 0.34164,2.24541 0.110545,0.679095 0.228461,1.34988 0.406763,2.014168 0.05902,0.08886 0.09109,0.203418 0.177044,0.266595 0.0897,0.06593 0.207896,0.09893 0.319213,0.09815 0.32814,-0.0023 0.9897,-0.416165 1.30629,-0.523934 0.338388,-0.115192 0.686571,-0.1993 1.029857,-0.298948 0.646118,-0.110377 1.288342,-0.246657 1.938354,-0.331132 2.015671,-0.261952 4.943031,-0.472193 6.888016,-0.593009 4.196145,-0.260653 8.397777,-0.396297 12.599317,-0.530417 1.036068,-0.0268 2.072137,-0.0536 3.108204,-0.0804 0.13499,-0.004 0.129319,-0.194911 -0.0057,-0.190902 v 0 c -1.036086,0.03474 -2.07217,0.06949 -3.108256,0.104229 -4.202307,0.153743 -8.406159,0.297374 -12.60487,0.533922 -1.88633,0.106273 -4.939877,0.298883 -6.913665,0.530669 -0.66072,0.07759 -1.314582,0.205323 -1.971872,0.307986 -0.356388,0.09825 -0.717753,0.179956 -1.069163,0.294743 -0.251285,0.08208 -0.650147,0.290458 -0.909921,0.402834 -0.05679,0.02457 -0.320868,0.138796 -0.373293,0.10913 -0.06488,-0.03672 -0.09325,-0.116325 -0.139871,-0.174487 -0.187532,-0.651182 -0.307832,-1.310956 -0.420245,-1.979443 -0.07688,-0.457204 -0.286063,-1.809649 -0.345663,-2.237341 -0.0563,-0.404023 -0.104046,-0.809192 -0.15607,-1.213789 -0.282419,-2.667796 -0.506976,-5.343967 -0.604246,-8.025398 -0.0025,-0.391971 -0.0081,-0.783933 -0.0076,-1.175909 0.0014,-0.961318 0.05259,-1.924784 -0.01046,-2.885027 0,-0.207144 -0.292947,-0.207144 -0.292947,0 z" />
    <path
       style="fill:#000000;stroke-width:1.81121;stroke-linejoin:round"
       id="path29"
       d="m 13.183128,21.670467 c 0.723207,-7.68e-4 1.444615,-0.0555 2.167703,-0.06424 0.217384,0.01785 0.350182,0.0049 0.544098,0.09725 0.196311,0.09351 0.30638,0.288486 0.440223,0.447055 0.06263,0.0742 0.130155,0.144122 0.195232,0.216183 0.464532,0.436705 1.089223,0.585308 1.683477,0.760535 1.855041,0.547001 -0.62851,-0.19404 1.079215,0.316761 0.513544,0.188618 1.099364,0.342857 1.45372,0.789303 0.124152,0.219017 0.210136,0.454836 0.372051,0.651469 0.06065,0.07365 0.177759,0.183195 0.249175,0.251992 0.173772,0.153833 0.217611,0.382803 0.279488,0.596429 0.0942,0.32522 0.04802,0.16078 0.134357,0.477084 0.194741,0.612886 0.484861,0.580948 1.050758,0.587765 0.27758,0.0014 0.490968,0.143785 0.721758,0.276932 0.252893,0.145898 0.192646,0.110836 0.455919,0.239871 0.407819,0.197164 0.83739,0.170994 1.27543,0.14884 0.312558,-0.03294 0.622981,-0.0066 0.931985,0.0399 0.0079,0.0011 0.156725,0.01976 0.177148,0.03202 0.02805,0.01684 0.193637,0.403478 0.209847,0.442088 0.205658,0.498892 0.337849,0.589123 0.871392,0.676142 0.12054,0.01795 0.235659,0.02207 0.344591,0.0838 0.20243,0.114698 0.342422,0.347571 0.468566,0.533812 0.243971,0.42249 0.622014,0.725767 1.022201,0.991596 0.266313,0.165391 0.552764,0.285785 0.868186,0.287158 0.278221,-0.03708 0.555743,-0.0659 0.836252,-0.07853 1.074189,-0.103015 2.152175,-0.151493 3.228698,-0.222334 0.792579,-0.07482 1.58323,-0.244982 2.291226,-0.617424 0.361464,-0.178711 0.492545,-0.431257 0.586792,-0.806331 0.04913,-0.199274 -0.232688,-0.268753 -0.281817,-0.06948 v 0 c -0.06739,0.279924 -0.165284,0.49361 -0.440593,0.622278 -0.667636,0.36381 -1.423319,0.518148 -2.174296,0.595663 -1.073551,0.07514 -2.149086,0.121097 -3.221719,0.209479 -0.278072,0.01013 -0.553511,0.03428 -0.828797,0.07504 -0.254233,0.01174 -0.490175,-0.113878 -0.705505,-0.235811 -0.371779,-0.243137 -0.718072,-0.522203 -0.941681,-0.914031 -0.260431,-0.380561 -0.510689,-0.704672 -1.006783,-0.740078 -0.439294,-0.06764 -0.471116,-0.08359 -0.650259,-0.503174 -0.09464,-0.224075 -0.180878,-0.496939 -0.413074,-0.615504 -0.02548,-0.01301 -0.17255,-0.03129 -0.19761,-0.03482 -0.327996,-0.04794 -0.658021,-0.07305 -0.989368,-0.03931 -0.388641,0.01982 -0.770955,0.05098 -1.134778,-0.118883 -0.424896,-0.207008 -0.809885,-0.527885 -1.300276,-0.546797 -0.445886,-0.0053 -0.614908,0.09927 -0.777073,-0.375815 -0.09216,-0.335017 -0.03707,-0.138519 -0.135506,-0.480673 -0.07558,-0.262692 -0.14008,-0.538507 -0.354665,-0.726535 -0.04558,-0.04339 -0.176677,-0.166056 -0.216562,-0.212843 C 21.183357,24.51618 21.113001,24.264524 20.970881,24.049543 20.561369,23.562264 19.95769,23.377787 19.37214,23.178016 19.0131,23.071966 18.652837,22.970073 18.293982,22.8634 17.750675,22.701896 17.173511,22.566153 16.742687,22.175042 16.256722,21.636615 16.168289,21.338081 15.34674,21.324545 c -0.721404,0.01221 -1.441917,0.06603 -2.163612,0.05262 -0.207397,0 -0.207397,0.293305 0,0.293305 z" />
    <path
       style="fill:#000000;stroke-width:1.81121;stroke-linejoin:round"
       id="path30"
       d="m 36.915793,22.52037 c 0.519646,-0.09085 1.044796,-0.133931 1.571127,-0.168583 0.591148,-0.06542 1.184023,-0.106953 1.778121,-0.13224 0.292455,-0.01171 0.585126,-0.01517 0.877773,-0.01749 0.203947,-0.0018 0.201358,-0.290258 -0.0026,-0.288427 v 0 c -0.296069,0.003 -0.592192,0.0059 -0.888016,0.01948 -0.59598,0.02803 -1.191281,0.06705 -1.784186,0.135412 -0.519252,0.0351 -1.038973,0.07101 -1.552228,0.158437 -0.207475,0 -0.207475,0.293415 0,0.293415 z" />
    <path
       style="fill:#000000;stroke-width:1.81121;stroke-linejoin:round"
       id="path31"
       d="m 40.911095,33.722689 c 0.395796,-0.06692 0.795619,-0.10839 1.195203,-0.145676 0.516058,-0.03823 1.033071,-0.04217 1.548986,-0.0826 0.512725,-0.05051 1.027736,-0.07048 1.542677,-0.05812 0.869307,0.06705 1.709084,0.332798 2.556715,0.524504 0.108186,0.02233 0.21637,0.04466 0.324557,0.06699 0.197093,0.04004 0.253708,-0.238698 0.05661,-0.278732 v 0 c -0.106504,-0.02128 -0.21301,-0.04255 -0.319515,-0.06383 -0.86683,-0.191811 -1.72454,-0.461996 -2.611906,-0.534155 -0.52454,-0.01123 -1.049859,0.0021 -1.571978,0.05705 -0.517221,0.04199 -1.035722,0.04421 -1.55319,0.08293 -0.409724,0.03925 -0.81982,0.08084 -1.226547,0.144189 -0.203261,0.04128 -0.144874,0.328738 0.05838,0.287453 z" />
    <path
       style="fill:#000000;stroke-width:1.81121;stroke-linejoin:round"
       id="path33"
       d="m 36.866106,22.704296 c 0.06201,0.424968 0.07606,0.857267 0.06711,1.286201 -0.01733,0.455183 -0.0915,0.901326 -0.09992,1.356918 7.69e-4,0.460519 -0.04128,0.919545 -0.05743,1.37974 -0.02569,0.493795 -0.0011,0.989609 -0.03484,1.482805 -0.01418,0.325211 -0.09181,0.641091 -0.143022,0.961115 -0.04296,0.322419 -0.0482,0.648225 -0.05236,0.972981 0.01958,0.420182 0.111114,0.832477 0.16096,1.249556 0.05142,0.36098 0.153348,0.711666 0.211082,1.071617 0.02303,0.180719 0.01312,0.09299 0.0302,0.263128 0.0042,0.04139 0.06272,0.03549 0.05854,-0.0059 v 0 c -0.01749,-0.172293 -0.0074,-0.08344 -0.03085,-0.266521 -0.05781,-0.359149 -0.159453,-0.70908 -0.211017,-1.069242 -0.04957,-0.414528 -0.140772,-0.824263 -0.160425,-1.24186 0.0043,-0.321913 0.0092,-0.644878 0.05184,-0.964479 0.05142,-0.321775 0.129158,-0.639458 0.143255,-0.966443 0.03304,-0.493894 0.009,-0.990237 0.03439,-1.484695 0.01657,-0.460489 0.059,-0.919858 0.05765,-1.380713 0.0085,-0.455495 0.08355,-0.901616 0.0998,-1.356801 0.0089,-0.43408 -0.0051,-0.871551 -0.06737,-1.301669 -0.01009,-0.04072 -0.06768,-0.02645 -0.05759,0.01428 z" />
    <path
       style="fill:#000000;stroke-width:1.81121;stroke-linejoin:round"
       id="path34"
       d="m 41.290285,15.564967 c 0.07358,0.662368 0.133712,1.326627 0.21594,1.988206 0.02419,0.142628 0.04837,0.285256 0.07255,0.427884 0.03349,0.196329 0.311137,0.148972 0.277649,-0.04736 v 0 c -0.02374,-0.138382 -0.04749,-0.276763 -0.07124,-0.415144 -0.0805,-0.649751 -0.135575,-1.302512 -0.202156,-1.953589 0,-0.207004 -0.292748,-0.207004 -0.292748,0 z" />
    <path
       style="fill:#000000;stroke-width:1.81121;stroke-linejoin:round"
       id="path35"
       d="m 41.765402,20.301417 c 0.0019,0.343632 -4.69e-4,0.686867 0.016,1.030155 0.0097,0.202881 0.296581,0.189217 0.286918,-0.01366 v 0 c -0.01609,-0.338725 -0.01246,-0.677435 -0.0089,-1.016489 0,-0.207904 -0.29402,-0.207904 -0.29402,0 z" />
    <path
       style="fill:#000000;stroke-width:1.81121;stroke-linejoin:round"
       id="path36"
       d="m 42.037481,23.763491 c -0.0085,0.537724 0.02975,1.074082 0.05376,1.610959 0.01376,0.988485 0.08523,1.974028 0.154289,2.959808 0.01401,0.194796 0.289491,0.174988 0.275483,-0.01981 v 0 c -0.07249,-0.982817 -0.140502,-1.965733 -0.148437,-2.951636 -0.02026,-0.533018 -0.05604,-1.065675 -0.04199,-1.599323 0,-0.207263 -0.293112,-0.207263 -0.293112,0 z" />
    <path
       style="fill:#000000;stroke-width:1.81121;stroke-linejoin:round"
       id="path37"
       d="m 42.552696,30.276055 c 0.01102,0.04258 0.02206,0.08516 0.03309,0.127737 0.05152,0.199977 0.334326,0.127122 0.28281,-0.07286 v 0 c -0.0088,-0.03438 -0.01759,-0.06876 -0.02638,-0.103133 -0.03412,-0.204717 -0.323631,-0.156465 -0.289512,0.04825 z" />
    <path
       style="fill:#000000;stroke-width:1.79931;stroke-linejoin:round"
       id="path38"
       d="m 68.83742,13.248654 c 0.02273,0.906934 -0.0089,1.813004 -0.04114,2.719188 -0.01673,1.025721 -0.07376,2.049904 -0.116842,3.074684 -0.02123,0.912743 -0.178228,1.811137 -0.314726,2.711318 -0.121886,0.743944 -0.197172,1.492546 -0.240871,2.244781 -0.03269,0.775298 -0.03542,1.550858 -0.0675,2.326243 -0.0071,0.400988 -0.05188,0.801808 -0.0513,1.203031 6.45e-4,0.385794 0.04084,0.772391 0.07247,1.156468 0.0459,0.499418 0.08228,0.999538 0.09799,1.50083 0.0014,0.06824 0.0027,0.136475 0.004,0.204713 0.0042,0.203017 0.2913,0.197087 0.287108,-0.0059 v 0 c -0.0015,-0.0692 -0.003,-0.138401 -0.0045,-0.207601 -0.01529,-0.506404 -0.05596,-1.011249 -0.103741,-1.515577 -0.03183,-0.372717 -0.07171,-0.748364 -0.07234,-1.122864 -6.46e-4,-0.400564 0.04236,-0.80095 0.04843,-1.201332 0.0333,-0.77386 0.04161,-1.547834 0.07055,-2.321793 0.04242,-0.743816 0.119118,-1.483469 0.23621,-2.219484 0.135057,-0.910443 0.296138,-1.818586 0.316427,-2.74139 0.04102,-1.025357 0.0959,-2.050135 0.116019,-3.07623 0.03236,-0.909541 0.05889,-1.81879 0.05252,-2.729057 0,-0.204246 -0.288849,-0.204246 -0.288849,0 z" />
    <path
       style="fill:#000000;stroke-width:1.79931;stroke-linejoin:round"
       id="path39"
       d="m 65.506173,29.014984 c 1.746799,-0.03405 3.493381,-0.07802 5.240524,-0.103077 3.117719,-0.01702 6.23479,0.03552 9.35087,0.131279 1.292695,0.04412 2.585309,0.08116 3.878763,0.08633 1.533485,0.03967 3.066402,0.09375 4.60012,0.12541 0.190924,0.0037 0.196171,-0.266296 0.0052,-0.270007 v 0 c -1.534934,-0.02797 -3.069097,-0.07995 -4.603488,-0.12842 -1.291419,-0.01261 -2.582638,-0.03687 -3.873676,-0.07112 -3.119689,-0.0727 -6.239925,-0.114149 -9.360542,-0.111297 -1.745954,0.01471 -3.491982,0.04482 -5.237816,0.05022 -0.205546,0 -0.205546,0.290686 0,0.290686 z" />
    <path
       style="fill:#000000;stroke-width:1.79931;stroke-linejoin:round"
       id="path40"
       d="m 68.801959,28.53663 c 1.281506,-0.86586 2.613151,-1.654084 3.940427,-2.446981 0.496603,-0.287426 0.993818,-0.573795 1.489805,-0.86228 1.465952,-0.852654 1.822135,-1.05773 3.276336,-1.947061 1.540862,-0.94233 3.064907,-1.911327 4.605245,-2.854559 1.673989,-1.034956 3.397248,-1.99791 4.978898,-3.173624 0.156816,-0.117829 -0.0098,-0.3396 -0.166635,-0.221773 v 0 c -1.562749,1.187079 -3.271327,2.159827 -4.935628,3.19425 -3.109081,1.909777 -6.173,3.89591 -9.373556,5.652895 -1.341996,0.786543 -2.682833,1.576182 -3.987306,2.423971 -0.166284,0.121915 0.0061,0.357077 0.172414,0.235162 z" />
    <path
       style="fill:#000000;stroke-width:1.79931;stroke-linejoin:round"
       id="path41"
       d="m 72.503325,28.48393 c 0.614833,-0.68782 1.187919,-1.410813 1.753308,-2.139406 0.66193,-0.88203 1.290808,-1.788208 1.822025,-2.755852 0.380002,-0.692198 0.455379,-0.881685 0.786659,-1.588471 0.606011,-1.360865 1.269341,-2.695584 1.940682,-4.025179 0.409534,-0.708968 0.766486,-1.454832 1.240837,-2.124244 0.257621,-0.35986 0.568042,-0.677281 0.852765,-1.015139 0.147474,-0.169763 0.289702,-0.342363 0.426545,-0.520766 0.123147,-0.160437 -0.103745,-0.334592 -0.22689,-0.174156 v 0 c -0.134358,0.174914 -0.275131,0.343179 -0.419646,0.509824 -0.289416,0.344545 -0.60496,0.66844 -0.865864,1.036046 -0.478609,0.683219 -0.836305,1.444196 -1.251392,2.165908 -0.668171,1.334047 -1.332058,2.671352 -1.937192,4.035404 -0.326749,0.700404 -0.398217,0.88325 -0.775094,1.568464 -0.526107,0.956535 -1.150685,1.85116 -1.806907,2.722133 -0.559705,0.718017 -1.127962,1.430082 -1.746116,2.099153 -0.145862,0.145861 0.06042,0.352142 0.20628,0.206281 z" />
    <text
       xml:space="preserve"
       style="font-size:1.86388px;fill:#000000;stroke-width:1.79931;stroke-linejoin:round"
       x="54.478214"
       y="18.383755"
       id="text42"><tspan
         sodipodi:role="line"
         id="tspan42"
         style="stroke-width:1.79931"
         x="54.478214"
         y="18.383755">multipliers</tspan></text>
    <text
       xml:space="preserve"
       style="font-size:3.175px;fill:#000000;stroke-width:3.06501;stroke-linejoin:round"
       x="12.076899"
       y="64.202995"
       id="text42-9"><tspan
         sodipodi:role="line"
         id="tspan42-2"
         style="stroke-width:3.065"
         x="12.076899"
         y="64.202995">vote price</tspan></text>
    <text
       xml:space="preserve"
       style="font-size:2.98373px;fill:#000000;stroke-width:2.88037;stroke-linejoin:round"
       x="7.2536025"
       y="51.671627"
       id="text42-9-6"><tspan
         sodipodi:role="line"
         id="tspan42-2-1"
         style="stroke-width:2.88036"
         x="7.2536025"
         y="51.671627">current vote price = 28 (4/7)</tspan></text>
    <text
       xml:space="preserve"
       style="font-size:3.175px;fill:#000000;stroke-width:3.06501;stroke-linejoin:round"
       x="36.050522"
       y="64.154808"
       id="text42-9-7"><tspan
         sodipodi:role="line"
         id="tspan42-2-5"
         style="stroke-width:3.065"
         x="36.050522"
         y="64.154808">vote amplifier</tspan></text>
    <text
       xml:space="preserve"
       style="font-size:3.175px;fill:#000000;stroke-width:3.06501;stroke-linejoin:round"
       x="67.449348"
       y="64.440086"
       id="text42-9-7-8"><tspan
         sodipodi:role="line"
         id="tspan42-2-5-9"
         style="stroke-width:3.065"
         x="67.449348"
         y="64.440086">op amplifier</tspan></text>
    <text
       xml:space="preserve"
       style="font-size:3.175px;fill:#000000;stroke-width:3.06501;stroke-linejoin:round"
       x="42.012264"
       y="71.225342"
       id="text43"><tspan
         sodipodi:role="line"
         id="tspan43"
         style="stroke-width:3.065"
         x="42.012264"
         y="71.225342">* 1.4</tspan></text>
    <text
       xml:space="preserve"
       style="font-size:3.175px;fill:#000000;stroke-width:3.06501;stroke-linejoin:round"
       x="73.052795"
       y="71.512329"
       id="text43-0"><tspan
         sodipodi:role="line"
         id="tspan43-6"
         style="stroke-width:3.065"
         x="73.052795"
         y="71.512329">* 1.7</tspan></text>
    <text
       xml:space="preserve"
       style="font-size:3.175px;fill:#000000;stroke-width:3.06501;stroke-linejoin:round"
       x="15.735809"
       y="71.475838"
       id="text43-1"><tspan
         sodipodi:role="line"
         id="tspan43-2"
         style="stroke-width:3.065"
         x="15.735809"
         y="71.475838">40</tspan></text>
    <text
       xml:space="preserve"
       style="font-size:3.175px;fill:#000000;stroke-width:3.06501;stroke-linejoin:round"
       x="15.856743"
       y="77.21788"
       id="text43-1-9"><tspan
         sodipodi:role="line"
         id="tspan43-2-4"
         style="stroke-width:3.065"
         x="15.856743"
         y="77.21788">45</tspan></text>
    <text
       xml:space="preserve"
       style="font-size:3.175px;fill:#000000;stroke-width:3.06501;stroke-linejoin:round"
       x="15.470251"
       y="83.944061"
       id="text43-1-9-5"><tspan
         sodipodi:role="line"
         id="tspan43-2-4-0"
         style="stroke-width:3.065"
         x="15.470251"
         y="83.944061">50</tspan></text>
  </g>
</svg>
