{
    "discontinuedDate": "",
    "foodComponents": [],
    "foodAttributes": [
        {
            "id": 3252957,
            "value": 5,
            "name": "Nutrient Added"
        },
        {
            "id": 3252958,
            "value": 6,
            "name": "Nutrient Removed"
        }
    ],
    "foodPortions": [],
    "fdcId": 2664238,
    "description": "BEEF MADE FROM PLANTS",
    "publicationDate": "11/16/2023",
    "foodNutrients": [
        {
            "type": "FoodNutrient",
            "nutrient": {
                "id": 1095,
                "number": "309",
                "name": "Zinc, Zn",
                "rank": 5900,
                "unitName": "mg"
            },
            "foodNutrientDerivation": {
                "id": 75,
                "code": "LCCD",
                "description": "Calculated from a daily value percentage per serving size measure"
            },
            "id": 33705506,
            "amount": 6.64
        },
        {
            "type": "FoodNutrient",
            "nutrient": {
                "id": 1079,
                "number": "291",
                "name": "Fiber, total dietary",
                "rank": 1200,
                "unitName": "g"
            },
            "foodNutrientDerivation": {
                "id": 70,
                "code": "LCCS",
                "description": "Calculated from value per serving size measure"
            },
            "id": 33705500,
            "amount": 4.4
        },
        {
            "type": "FoodNutrient",
            "nutrient": {
                "id": 1091,
                "number": "305",
                "name": "Phosphorus, P",
                "rank": 5600,
                "unitName": "mg"
            },
            "foodNutrientDerivation": {
                "id": 75,
                "code": "LCCD",
                "description": "Calculated from a daily value percentage per serving size measure"
            },
            "id": 33705503,
            "amount": 133.0
        },
        {
            "type": "FoodNutrient",
            "nutrient": {
                "id": 1003,
                "number": "203",
                "name": "Protein",
                "rank": 600,
                "unitName": "g"
            },
            "foodNutrientDerivation": {
                "id": 70,
                "code": "LCCS",
                "description": "Calculated from value per serving size measure"
            },
            "id": 33705495,
            "amount": 16.81
        },
        {
            "type": "FoodNutrient",
            "nutrient": {
                "id": 1004,
                "number": "204",
                "name": "Total lipid (fat)",
                "rank": 800,
                "unitName": "g"
            },
            "foodNutrientDerivation": {
                "id": 70,
                "code": "LCCS",
                "description": "Calculated from value per serving size measure"
            },
            "id": 33705496,
            "amount": 11.5
        },
        {
            "type": "FoodNutrient",
            "nutrient": {
                "id": 1087,
                "number": "301",
                "name": "Calcium, Ca",
                "rank": 5300,
                "unitName": "mg"
            },
            "foodNutrientDerivation": {
                "id": 70,
                "code": "LCCS",
                "description": "Calculated from value per serving size measure"
            },
            "id": 33705501,
            "amount": 159.0
        },
        {
            "type": "FoodNutrient",
            "nutrient": {
                "id": 1175,
                "number": "415",
                "name": "Vitamin B-6",
                "rank": 6800,
                "unitName": "mg"
            },
            "foodNutrientDerivation": {
                "id": 75,
                "code": "LCCD",
                "description": "Calculated from a daily value percentage per serving size measure"
            },
            "id": 33705511,
            "amount": 0.354
        },
        {
            "type": "FoodNutrient",
            "nutrient": {
                "id": 1008,
                "number": "208",
                "name": "Energy",
                "rank": 300,
                "unitName": "kcal"
            },
            "foodNutrientDerivation": {
                "id": 70,
                "code": "LCCS",
                "description": "Calculated from value per serving size measure"
            },
            "id": 33705498,
            "amount": 204.0
        },
        {
            "type": "FoodNutrient",
            "nutrient": {
                "id": 1167,
                "number": "406",
                "name": "Niacin",
                "rank": 6600,
                "unitName": "mg"
            },
            "foodNutrientDerivation": {
                "id": 75,
                "code": "LCCD",
                "description": "Calculated from a daily value percentage per serving size measure"
            },
            "id": 33705510,
            "amount": 10.619
        },
        {
            "type": "FoodNutrient",
            "nutrient": {
                "id": 1253,
                "number": "601",
                "name": "Cholesterol",
                "rank": 15700,
                "unitName": "mg"
            },
            "foodNutrientDerivation": {
                "id": 70,
                "code": "LCCS",
                "description": "Calculated from value per serving size measure"
            },
            "id": 33705515,
            "amount": 0.0
        },
        {
            "type": "FoodNutrient",
            "nutrient": {
                "id": 1178,
                "number": "418",
                "name": "Vitamin B-12",
                "rank": 7300,
                "unitName": "\u00b5g"
            },
            "foodNutrientDerivation": {
                "id": 75,
                "code": "LCCD",
                "description": "Calculated from a daily value percentage per serving size measure"
            },
            "id": 33705513,
            "amount": 6.9
        },
        {
            "type": "FoodNutrient",
            "nutrient": {
                "id": 1258,
                "number": "606",
                "name": "Fatty acids, total saturated",
                "rank": 9700,
                "unitName": "g"
            },
            "foodNutrientDerivation": {
                "id": 70,
                "code": "LCCS",
                "description": "Calculated from value per serving size measure"
            },
            "id": 33705517,
            "amount": 5.31
        },
        {
            "type": "FoodNutrient",
            "nutrient": {
                "id": 1257,
                "number": "605",
                "name": "Fatty acids, total trans",
                "rank": 15400,
                "unitName": "g"
            },
            "foodNutrientDerivation": {
                "id": 70,
                "code": "LCCS",
                "description": "Calculated from value per serving size measure"
            },
            "id": 33705516,
            "amount": 0.0
        },
        {
            "type": "FoodNutrient",
            "nutrient": {
                "id": 1165,
                "number": "404",
                "name": "Thiamin",
                "rank": 6400,
                "unitName": "mg"
            },
            "foodNutrientDerivation": {
                "id": 75,
                "code": "LCCD",
                "description": "Calculated from a daily value percentage per serving size measure"
            },
            "id": 33705508,
            "amount": 1.0
        },
        {
            "type": "FoodNutrient",
            "nutrient": {
                "id": 1235,
                "number": "539",
                "name": "Sugars, added",
                "rank": 1540,
                "unitName": "g"
            },
            "foodNutrientDerivation": {
                "id": 73,
                "code": "LCSL",
                "description": "Calculated from a less than value per serving size measure"
            },
            "id": 33705514,
            "amount": 0.9
        },
        {
            "type": "FoodNutrient",
            "nutrient": {
                "id": 2000,
                "number": "269",
                "name": "Sugars, total including NLEA",
                "rank": 1510,
                "unitName": "g"
            },
            "foodNutrientDerivation": {
                "id": 73,
                "code": "LCSL",
                "description": "Calculated from a less than value per serving size measure"
            },
            "id": 33705499,
            "amount": 0.88
        },
        {
            "type": "FoodNutrient",
            "nutrient": {
                "id": 1114,
                "number": "328",
                "name": "Vitamin D (D2 + D3)",
                "rank": 8700,
                "unitName": "\u00b5g"
            },
            "foodNutrientDerivation": {
                "id": 70,
                "code": "LCCS",
                "description": "Calculated from value per serving size measure"
            },
            "id": 33705507,
            "amount": 0.0
        },
        {
            "type": "FoodNutrient",
            "nutrient": {
                "id": 1177,
                "number": "417",
                "name": "Folate, total",
                "rank": 6900,
                "unitName": "\u00b5g"
            },
            "foodNutrientDerivation": {
                "id": 75,
                "code": "LCCD",
                "description": "Calculated from a daily value percentage per serving size measure"
            },
            "id": 33705512,
            "amount": 71.0
        },
        {
            "type": "FoodNutrient",
            "nutrient": {
                "id": 1005,
                "number": "205",
                "name": "Carbohydrate, by difference",
                "rank": 1110,
                "unitName": "g"
            },
            "foodNutrientDerivation": {
                "id": 70,
                "code": "LCCS",
                "description": "Calculated from value per serving size measure"
            },
            "id": 33705497,
            "amount": 7.96
        },
        {
            "type": "FoodNutrient",
            "nutrient": {
                "id": 1089,
                "number": "303",
                "name": "Iron, Fe",
                "rank": 5400,
                "unitName": "mg"
            },
            "foodNutrientDerivation": {
                "id": 70,
                "code": "LCCS",
                "description": "Calculated from value per serving size measure"
            },
            "id": 33705502,
            "amount": 3.72
        },
        {
            "type": "FoodNutrient",
            "nutrient": {
                "id": 1093,
                "number": "307",
                "name": "Sodium, Na",
                "rank": 5800,
                "unitName": "mg"
            },
            "foodNutrientDerivation": {
                "id": 70,
                "code": "LCCS",
                "description": "Calculated from value per serving size measure"
            },
            "id": 33705505,
            "amount": 327.0
        },
        {
            "type": "FoodNutrient",
            "nutrient": {
                "id": 1166,
                "number": "405",
                "name": "Riboflavin",
                "rank": 6500,
                "unitName": "mg"
            },
            "foodNutrientDerivation": {
                "id": 75,
                "code": "LCCD",
                "description": "Calculated from a daily value percentage per serving size measure"
            },
            "id": 33705509,
            "amount": 0.226
        },
        {
            "type": "FoodNutrient",
            "nutrient": {
                "id": 1092,
                "number": "306",
                "name": "Potassium, K",
                "rank": 5700,
                "unitName": "mg"
            },
            "foodNutrientDerivation": {
                "id": 70,
                "code": "LCCS",
                "description": "Calculated from value per serving size measure"
            },
            "id": 33705504,
            "amount": 619.0
        }
    ],
    "dataType": "Branded",
    "foodClass": "Branded",
    "shortDescription": "",
    "modifiedDate": "11/4/2022",
    "availableDate": "11/4/2022",
    "brandOwner": "Impossible Foods Inc.",
    "brandName": "IMPOSSIBLE",
    "dataSource": "LI",
    "brandedFoodCategory": "Other Meats",
    "gtinUpc": "816697021002",
    "householdServingFullText": "4 oz",
    "ingredients": "WATER, SOY PROTEIN CONCENTRATE, SUNFLOWER OIL, COCONUT OIL, NATURAL FLAVORS, 2% OR LESS OF: METHYLCELLULOSE, CULTURED DEXTROSE, FOOD STARCH MODIFIED, YEAST EXTRACT, SOY LEGHEMOGLOBIN, SALT, MIXED TOCOPHEROLS (ANTIOXIDANT), L-TRYPTOPHAN, SOY PROTEIN ISOLATE, VITAMINS AND MINERALS (ZINC GLUCONATE, NIACIN (VITAMIN B3), THIAMINE HYDROCHLORIDE (VITAMIN B1), PYRIDOXINE HYDROCHLORIDE (VITAMIN B6), RIBOFLAVIN (VITAMIN B2), VITAMIN B12).",
    "marketCountry": "United States",
    "servingSize": 113.0,
    "servingSizeUnit": "GRM",
    "packageWeight": "12 oz/340 g",
    "foodUpdateLog": [
        {
            "discontinuedDate": "",
            "foodAttributes": [],
            "fdcId": 2664238,
            "description": "BEEF MADE FROM PLANTS",
            "publicationDate": "11/16/2023",
            "dataType": "Branded",
            "foodClass": "Branded",
            "shortDescription": "",
            "modifiedDate": "11/4/2022",
            "availableDate": "11/4/2022",
            "brandOwner": "Impossible Foods Inc.",
            "brandName": "IMPOSSIBLE",
            "dataSource": "LI",
            "brandedFoodCategory": "Other Meats",
            "gtinUpc": "816697021002",
            "householdServingFullText": "4 oz",
            "ingredients": "WATER, SOY PROTEIN CONCENTRATE, SUNFLOWER OIL, COCONUT OIL, NATURAL FLAVORS, 2% OR LESS OF: METHYLCELLULOSE, CULTURED DEXTROSE, FOOD STARCH MODIFIED, YEAST EXTRACT, SOY LEGHEMOGLOBIN, SALT, MIXED TOCOPHEROLS (ANTIOXIDANT), L-TRYPTOPHAN, SOY PROTEIN ISOLATE, VITAMINS AND MINERALS (ZINC GLUCONATE, NIACIN (VITAMIN B3), THIAMINE HYDROCHLORIDE (VITAMIN B1), PYRIDOXINE HYDROCHLORIDE (VITAMIN B6), RIBOFLAVIN (VITAMIN B2), VITAMIN B12).",
            "marketCountry": "United States",
            "servingSize": 113.0,
            "servingSizeUnit": "GRM",
            "packageWeight": "12 oz/340 g",
            "foodVersions": [
                {
                    "discontinuedDate": "",
                    "foodComponents": [],
                    "foodAttributes": [],
                    "foodPortions": [],
                    "modifiedDate": "7/24/2020",
                    "availableDate": "7/24/2020",
                    "brandOwner": "Impossible Foods Inc.",
                    "dataSource": "LI",
                    "gpcCategoryGroup": "Other Meats",
                    "gtinUpc": "816697021002",
                    "householdServingFullText": "4 ONZ",
                    "ingredients": "WATER, SOY PROTEIN CONCENTRATE, COCONUT OIL, SUNFLOWER OIL, NATURAL FLAVORS, 2% OR LESS OF: POTATO PROTEIN, METHYLCELLULOSE, YEAST EXTRACT, CULTURED DEXTROSE, FOOD STARCH MODIFIED, SOY LEGHEMOGLOBIN, SALT, SOY PROTEIN ISOLATE, MIXED TOCOPHEROLS (VITAMIN E), ZINC GLUCONATE, THIAMIN HYDROCHLORIDE (VITAMIN B1), SODIUM ASCORBATE (VITAMIN C), NIACIN, PYRIDOXINE HYDROCHLORIDE (VITAMIN B6), RIBOFLAVIN (VITAMIN B2), VITAMIN B12",
                    "marketCountry": "United States",
                    "servingSize": 113.0,
                    "servingSizeUnit": "g",
                    "fdcId": 1082279,
                    "description": "BURGER MADE FROM PLANTS",
                    "publicationDate": "8/27/2020",
                    "dataType": "Branded",
                    "foodClass": "Branded"
                },
                {
                    "discontinuedDate": "",
                    "foodComponents": [],
                    "foodAttributes": [],
                    "foodPortions": [],
                    "modifiedDate": "10/12/2020",
                    "availableDate": "10/12/2020",
                    "brandOwner": "Impossible Foods Inc.",
                    "dataSource": "LI",
                    "gpcCategoryGroup": "Other Meats",
                    "gtinUpc": "816697021002",
                    "ingredients": "WATER, SOY PROTEIN CONCENTRATE, COCONUT OIL, SUNFLOWER OIL, NATURAL FLAVORS, 2% OR LESS OF: POTATO PROTEIN, METHYLCELLULOSE, YEAST EXTRACT, CULTURED DEXTROSE, FOOD STARCH MODIFIED, SOY LEGHEMOGLOBIN, SALT, SOY PROTEIN ISOLATE, MIXED TOCOPHEROLS (VITAMIN E), ZINC GLUCONATE, THIAMIN HYDROCHLORIDE (VITAMIN B1), SODIUM ASCORBATE (VITAMIN C), NIACIN, PYRIDOXINE HYDROCHLORIDE (VITAMIN B6), RIBOFLAVIN (VITAMIN B2), VITAMIN B12",
                    "marketCountry": "United States",
                    "servingSize": 113.0,
                    "servingSizeUnit": "g",
                    "fdcId": 1440417,
                    "description": "BURGER MADE FROM PLANTS",
                    "publicationDate": "2/26/2021",
                    "dataType": "Branded",
                    "foodClass": "Branded"
                },
                {
                    "discontinuedDate": "",
                    "foodComponents": [],
                    "foodAttributes": [],
                    "foodPortions": [],
                    "modifiedDate": "10/12/2020",
                    "availableDate": "10/12/2020",
                    "brandOwner": "Impossible Foods Inc.",
                    "dataSource": "LI",
                    "gpcCategoryGroup": "Other Meats",
                    "gtinUpc": "816697021002",
                    "ingredients": "WATER, SOY PROTEIN CONCENTRATE, COCONUT OIL, SUNFLOWER OIL, NATURAL FLAVORS, 2% OR LESS OF: POTATO PROTEIN, METHYLCELLULOSE, YEAST EXTRACT, CULTURED DEXTROSE, FOOD STARCH MODIFIED, SOY LEGHEMOGLOBIN, SALT, SOY PROTEIN ISOLATE, MIXED TOCOPHEROLS (VITAMIN E), ZINC GLUCONATE, THIAMIN HYDROCHLORIDE (VITAMIN B1), SODIUM ASCORBATE (VITAMIN C), NIACIN, PYRIDOXINE HYDROCHLORIDE (VITAMIN B6), RIBOFLAVIN (VITAMIN B2), VITAMIN B12",
                    "marketCountry": "United States",
                    "servingSize": 113.0,
                    "servingSizeUnit": "g",
                    "fdcId": 1732721,
                    "description": "BURGER MADE FROM PLANTS",
                    "publicationDate": "3/19/2021",
                    "dataType": "Branded",
                    "foodClass": "Branded"
                },
                {
                    "discontinuedDate": "",
                    "foodComponents": [],
                    "foodAttributes": [],
                    "foodPortions": [],
                    "modifiedDate": "10/12/2020",
                    "availableDate": "10/12/2020",
                    "brandOwner": "Impossible Foods Inc.",
                    "dataSource": "LI",
                    "gpcCategoryGroup": "Other Meats",
                    "gtinUpc": "816697021002",
                    "ingredients": "WATER, SOY PROTEIN CONCENTRATE, COCONUT OIL, SUNFLOWER OIL, NATURAL FLAVORS, 2% OR LESS OF: POTATO PROTEIN, METHYLCELLULOSE, YEAST EXTRACT, CULTURED DEXTROSE, FOOD STARCH MODIFIED, SOY LEGHEMOGLOBIN, SALT, SOY PROTEIN ISOLATE, MIXED TOCOPHEROLS (VITAMIN E), ZINC GLUCONATE, THIAMIN HYDROCHLORIDE (VITAMIN B1), SODIUM ASCORBATE (VITAMIN C), NIACIN, PYRIDOXINE HYDROCHLORIDE (VITAMIN B6), RIBOFLAVIN (VITAMIN B2), VITAMIN B12",
                    "marketCountry": "United States",
                    "servingSize": 113.0,
                    "servingSizeUnit": "g",
                    "fdcId": 2162493,
                    "description": "BURGER MADE FROM PLANTS",
                    "publicationDate": "10/28/2021",
                    "dataType": "Branded",
                    "foodClass": "Branded"
                },
                {
                    "discontinuedDate": "",
                    "foodComponents": [],
                    "foodAttributes": [],
                    "foodPortions": [],
                    "modifiedDate": "11/4/2022",
                    "availableDate": "11/4/2022",
                    "brandOwner": "Impossible Foods Inc.",
                    "dataSource": "LI",
                    "gpcCategoryGroup": "Other Meats",
                    "gtinUpc": "816697021002",
                    "householdServingFullText": "4 ONZ",
                    "ingredients": "WATER, SOY PROTEIN CONCENTRATE, SUNFLOWER OIL, COCONUT OIL, NATURAL FLAVORS, 2% OR LESS OF: METHYLCELLULOSE, CULTURED DEXTROSE, FOOD STARCH MODIFIED, YEAST EXTRACT, SOY LEGHEMOGLOBIN, SALT, MIXED TOCOPHEROLS (ANTIOXIDANT), L-TRYPTOPHAN, SOY PROTEIN ISOLATE, VITAMINS AND MINERALS (ZINC GLUCONATE, NIACIN (VITAMIN B3), THIAMINE HYDROCHLORIDE (VITAMIN B1), PYRIDOXINE HYDROCHLORIDE (VITAMIN B6), RIBOFLAVIN (VITAMIN B2), VITAMIN B12).",
                    "marketCountry": "United States",
                    "servingSize": 113.0,
                    "servingSizeUnit": "g",
                    "fdcId": 2444859,
                    "description": "BEEF MADE FROM PLANTS",
                    "publicationDate": "1/26/2023",
                    "dataType": "Branded",
                    "foodClass": "Branded"
                },
                {
                    "discontinuedDate": "",
                    "foodComponents": [],
                    "foodAttributes": [],
                    "foodPortions": [],
                    "modifiedDate": "11/4/2022",
                    "availableDate": "11/4/2022",
                    "brandOwner": "Impossible Foods Inc.",
                    "dataSource": "LI",
                    "gpcCategoryGroup": "Other Meats",
                    "gtinUpc": "816697021002",
                    "householdServingFullText": "4 ONZ",
                    "ingredients": "WATER, SOY PROTEIN CONCENTRATE, SUNFLOWER OIL, COCONUT OIL, NATURAL FLAVORS, 2% OR LESS OF: METHYLCELLULOSE, CULTURED DEXTROSE, FOOD STARCH MODIFIED, YEAST EXTRACT, SOY LEGHEMOGLOBIN, SALT, MIXED TOCOPHEROLS (ANTIOXIDANT), L-TRYPTOPHAN, SOY PROTEIN ISOLATE, VITAMINS AND MINERALS (ZINC GLUCONATE, NIACIN (VITAMIN B3), THIAMINE HYDROCHLORIDE (VITAMIN B1), PYRIDOXINE HYDROCHLORIDE (VITAMIN B6), RIBOFLAVIN (VITAMIN B2), VITAMIN B12).",
                    "marketCountry": "United States",
                    "servingSize": 113.0,
                    "servingSizeUnit": "g",
                    "fdcId": 2468423,
                    "description": "BEEF MADE FROM PLANTS",
                    "publicationDate": "2/16/2023",
                    "dataType": "Branded",
                    "foodClass": "Branded"
                },
                {
                    "discontinuedDate": "",
                    "foodComponents": [],
                    "foodAttributes": [],
                    "foodPortions": [],
                    "modifiedDate": "11/4/2022",
                    "availableDate": "11/4/2022",
                    "brandOwner": "Impossible Foods Inc.",
                    "dataSource": "LI",
                    "gpcCategoryGroup": "Other Meats",
                    "gtinUpc": "816697021002",
                    "householdServingFullText": "4 ONZ",
                    "ingredients": "WATER, SOY PROTEIN CONCENTRATE, SUNFLOWER OIL, COCONUT OIL, NATURAL FLAVORS, 2% OR LESS OF: METHYLCELLULOSE, CULTURED DEXTROSE, FOOD STARCH MODIFIED, YEAST EXTRACT, SOY LEGHEMOGLOBIN, SALT, MIXED TOCOPHEROLS (ANTIOXIDANT), L-TRYPTOPHAN, SOY PROTEIN ISOLATE, VITAMINS AND MINERALS (ZINC GLUCONATE, NIACIN (VITAMIN B3), THIAMINE HYDROCHLORIDE (VITAMIN B1), PYRIDOXINE HYDROCHLORIDE (VITAMIN B6), RIBOFLAVIN (VITAMIN B2), VITAMIN B12).",
                    "marketCountry": "United States",
                    "servingSize": 113.0,
                    "servingSizeUnit": "g",
                    "fdcId": 2415308,
                    "description": "BEEF MADE FROM PLANTS",
                    "publicationDate": "12/22/2022",
                    "dataType": "Branded",
                    "foodClass": "Branded"
                }
            ]
        },
        {
            "discontinuedDate": "",
            "foodAttributes": [],
            "fdcId": 2468423,
            "description": "BEEF MADE FROM PLANTS",
            "publicationDate": "2/16/2023",
            "dataType": "Branded",
            "foodClass": "Branded",
            "shortDescription": "",
            "modifiedDate": "11/4/2022",
            "availableDate": "11/4/2022",
            "brandOwner": "Impossible Foods Inc.",
            "brandName": "IMPOSSIBLE",
            "dataSource": "LI",
            "brandedFoodCategory": "Other Meats",
            "gtinUpc": "816697021002",
            "householdServingFullText": "4 ONZ",
            "ingredients": "WATER, SOY PROTEIN CONCENTRATE, SUNFLOWER OIL, COCONUT OIL, NATURAL FLAVORS, 2% OR LESS OF: METHYLCELLULOSE, CULTURED DEXTROSE, FOOD STARCH MODIFIED, YEAST EXTRACT, SOY LEGHEMOGLOBIN, SALT, MIXED TOCOPHEROLS (ANTIOXIDANT), L-TRYPTOPHAN, SOY PROTEIN ISOLATE, VITAMINS AND MINERALS (ZINC GLUCONATE, NIACIN (VITAMIN B3), THIAMINE HYDROCHLORIDE (VITAMIN B1), PYRIDOXINE HYDROCHLORIDE (VITAMIN B6), RIBOFLAVIN (VITAMIN B2), VITAMIN B12).",
            "marketCountry": "United States",
            "servingSize": 113.0,
            "servingSizeUnit": "g",
            "packageWeight": "12 oz/340 g"
        },
        {
            "discontinuedDate": "",
            "foodAttributes": [],
            "fdcId": 2444859,
            "description": "BEEF MADE FROM PLANTS",
            "publicationDate": "1/26/2023",
            "dataType": "Branded",
            "foodClass": "Branded",
            "shortDescription": "",
            "modifiedDate": "11/4/2022",
            "availableDate": "11/4/2022",
            "brandOwner": "Impossible Foods Inc.",
            "brandName": "IMPOSSIBLE",
            "dataSource": "LI",
            "brandedFoodCategory": "Other Meats",
            "gtinUpc": "816697021002",
            "householdServingFullText": "4 ONZ",
            "ingredients": "WATER, SOY PROTEIN CONCENTRATE, SUNFLOWER OIL, COCONUT OIL, NATURAL FLAVORS, 2% OR LESS OF: METHYLCELLULOSE, CULTURED DEXTROSE, FOOD STARCH MODIFIED, YEAST EXTRACT, SOY LEGHEMOGLOBIN, SALT, MIXED TOCOPHEROLS (ANTIOXIDANT), L-TRYPTOPHAN, SOY PROTEIN ISOLATE, VITAMINS AND MINERALS (ZINC GLUCONATE, NIACIN (VITAMIN B3), THIAMINE HYDROCHLORIDE (VITAMIN B1), PYRIDOXINE HYDROCHLORIDE (VITAMIN B6), RIBOFLAVIN (VITAMIN B2), VITAMIN B12).",
            "marketCountry": "United States",
            "servingSize": 113.0,
            "servingSizeUnit": "g",
            "packageWeight": "12 oz/340 g"
        },
        {
            "discontinuedDate": "",
            "foodAttributes": [],
            "fdcId": 2415308,
            "description": "BEEF MADE FROM PLANTS",
            "publicationDate": "12/22/2022",
            "dataType": "Branded",
            "foodClass": "Branded",
            "shortDescription": "",
            "modifiedDate": "11/4/2022",
            "availableDate": "11/4/2022",
            "brandOwner": "Impossible Foods Inc.",
            "brandName": "IMPOSSIBLE",
            "dataSource": "LI",
            "brandedFoodCategory": "Other Meats",
            "gtinUpc": "816697021002",
            "householdServingFullText": "4 ONZ",
            "ingredients": "WATER, SOY PROTEIN CONCENTRATE, SUNFLOWER OIL, COCONUT OIL, NATURAL FLAVORS, 2% OR LESS OF: METHYLCELLULOSE, CULTURED DEXTROSE, FOOD STARCH MODIFIED, YEAST EXTRACT, SOY LEGHEMOGLOBIN, SALT, MIXED TOCOPHEROLS (ANTIOXIDANT), L-TRYPTOPHAN, SOY PROTEIN ISOLATE, VITAMINS AND MINERALS (ZINC GLUCONATE, NIACIN (VITAMIN B3), THIAMINE HYDROCHLORIDE (VITAMIN B1), PYRIDOXINE HYDROCHLORIDE (VITAMIN B6), RIBOFLAVIN (VITAMIN B2), VITAMIN B12).",
            "marketCountry": "United States",
            "servingSize": 113.0,
            "servingSizeUnit": "g",
            "packageWeight": "12 oz/340 g"
        },
        {
            "discontinuedDate": "",
            "foodAttributes": [],
            "fdcId": 2162493,
            "description": "BURGER MADE FROM PLANTS",
            "publicationDate": "10/28/2021",
            "dataType": "Branded",
            "foodClass": "Branded",
            "modifiedDate": "10/12/2020",
            "availableDate": "10/12/2020",
            "brandOwner": "Impossible Foods Inc.",
            "brandName": "IMPOSSIBLE",
            "dataSource": "LI",
            "brandedFoodCategory": "Other Meats",
            "gtinUpc": "816697021002",
            "ingredients": "WATER, SOY PROTEIN CONCENTRATE, COCONUT OIL, SUNFLOWER OIL, NATURAL FLAVORS, 2% OR LESS OF: POTATO PROTEIN, METHYLCELLULOSE, YEAST EXTRACT, CULTURED DEXTROSE, FOOD STARCH MODIFIED, SOY LEGHEMOGLOBIN, SALT, SOY PROTEIN ISOLATE, MIXED TOCOPHEROLS (VITAMIN E), ZINC GLUCONATE, THIAMIN HYDROCHLORIDE (VITAMIN B1), SODIUM ASCORBATE (VITAMIN C), NIACIN, PYRIDOXINE HYDROCHLORIDE (VITAMIN B6), RIBOFLAVIN (VITAMIN B2), VITAMIN B12",
            "marketCountry": "United States",
            "servingSize": 113.0,
            "servingSizeUnit": "g",
            "packageWeight": "12 oz/0.75 lbs/340 g"
        },
        {
            "discontinuedDate": "",
            "foodAttributes": [],
            "fdcId": 1732721,
            "description": "BURGER MADE FROM PLANTS",
            "publicationDate": "3/19/2021",
            "dataType": "Branded",
            "foodClass": "Branded",
            "modifiedDate": "10/12/2020",
            "availableDate": "10/12/2020",
            "brandOwner": "Impossible Foods Inc.",
            "brandName": "IMPOSSIBLE",
            "dataSource": "LI",
            "brandedFoodCategory": "Other Meats",
            "gtinUpc": "816697021002",
            "ingredients": "WATER, SOY PROTEIN CONCENTRATE, COCONUT OIL, SUNFLOWER OIL, NATURAL FLAVORS, 2% OR LESS OF: POTATO PROTEIN, METHYLCELLULOSE, YEAST EXTRACT, CULTURED DEXTROSE, FOOD STARCH MODIFIED, SOY LEGHEMOGLOBIN, SALT, SOY PROTEIN ISOLATE, MIXED TOCOPHEROLS (VITAMIN E), ZINC GLUCONATE, THIAMIN HYDROCHLORIDE (VITAMIN B1), SODIUM ASCORBATE (VITAMIN C), NIACIN, PYRIDOXINE HYDROCHLORIDE (VITAMIN B6), RIBOFLAVIN (VITAMIN B2), VITAMIN B12",
            "marketCountry": "United States",
            "servingSize": 113.0,
            "servingSizeUnit": "g"
        },
        {
            "discontinuedDate": "",
            "foodAttributes": [],
            "fdcId": 1440417,
            "description": "BURGER MADE FROM PLANTS",
            "publicationDate": "2/26/2021",
            "dataType": "Branded",
            "foodClass": "Branded",
            "modifiedDate": "10/12/2020",
            "availableDate": "10/12/2020",
            "brandOwner": "Impossible Foods Inc.",
            "brandName": "IMPOSSIBLE",
            "subbrandName": "",
            "dataSource": "LI",
            "brandedFoodCategory": "Other Meats",
            "gtinUpc": "816697021002",
            "ingredients": "WATER, SOY PROTEIN CONCENTRATE, COCONUT OIL, SUNFLOWER OIL, NATURAL FLAVORS, 2% OR LESS OF: POTATO PROTEIN, METHYLCELLULOSE, YEAST EXTRACT, CULTURED DEXTROSE, FOOD STARCH MODIFIED, SOY LEGHEMOGLOBIN, SALT, SOY PROTEIN ISOLATE, MIXED TOCOPHEROLS (VITAMIN E), ZINC GLUCONATE, THIAMIN HYDROCHLORIDE (VITAMIN B1), SODIUM ASCORBATE (VITAMIN C), NIACIN, PYRIDOXINE HYDROCHLORIDE (VITAMIN B6), RIBOFLAVIN (VITAMIN B2), VITAMIN B12",
            "marketCountry": "United States",
            "servingSize": 113.0,
            "servingSizeUnit": "g",
            "packageWeight": "",
            "notaSignificantSourceOf": ""
        },
        {
            "discontinuedDate": "",
            "foodAttributes": [],
            "modifiedDate": "7/24/2020",
            "availableDate": "7/24/2020",
            "brandOwner": "Impossible Foods Inc.",
            "dataSource": "LI",
            "gpcCategoryGroup": "Other Meats",
            "gtinUpc": "816697021002",
            "householdServingFullText": "4 ONZ",
            "ingredients": "WATER, SOY PROTEIN CONCENTRATE, COCONUT OIL, SUNFLOWER OIL, NATURAL FLAVORS, 2% OR LESS OF: POTATO PROTEIN, METHYLCELLULOSE, YEAST EXTRACT, CULTURED DEXTROSE, FOOD STARCH MODIFIED, SOY LEGHEMOGLOBIN, SALT, SOY PROTEIN ISOLATE, MIXED TOCOPHEROLS (VITAMIN E), ZINC GLUCONATE, THIAMIN HYDROCHLORIDE (VITAMIN B1), SODIUM ASCORBATE (VITAMIN C), NIACIN, PYRIDOXINE HYDROCHLORIDE (VITAMIN B6), RIBOFLAVIN (VITAMIN B2), VITAMIN B12",
            "marketCountry": "United States",
            "servingSize": 113.0,
            "servingSizeUnit": "g",
            "fdcId": 1082279,
            "description": "BURGER MADE FROM PLANTS",
            "publicationDate": "8/27/2020",
            "dataType": "Branded",
            "foodClass": "Branded"
        }
    ],
    "labelNutrients": {
        "fat": {
            "value": 13.0
        },
        "saturatedFat": {
            "value": 6.0
        },
        "transFat": {
            "value": 0.0
        },
        "cholesterol": {
            "value": 0.0
        },
        "sodium": {
            "value": 370
        },
        "carbohydrates": {
            "value": 9.0
        },
        "fiber": {
            "value": 4.97
        },
        "sugars": {
            "value": 0.994
        },
        "protein": {
            "value": 19.0
        },
        "vitaminD": {
            "value": 0.0
        },
        "calcium": {
            "value": 180
        },
        "iron": {
            "value": 4.2
        },
        "potassium": {
            "value": 699
        },
        "addedSugar": {
            "value": 1.02
        },
        "calories": {
            "value": 231
        }
    }
}