<?xml version="1.0" encoding="UTF-8" standalone="no"?>
<!-- Created with Inkscape (http://www.inkscape.org/) -->

<svg
   width="99mm"
   height="99mm"
   viewBox="0 0 99 99"
   version="1.1"
   id="svg1"
   inkscape:version="1.3 (0e150ed, 2023-07-21)"
   sodipodi:docname="beauty.svg"
   xmlns:inkscape="http://www.inkscape.org/namespaces/inkscape"
   xmlns:sodipodi="http://sodipodi.sourceforge.net/DTD/sodipodi-0.dtd"
   xmlns="http://www.w3.org/2000/svg"
   xmlns:svg="http://www.w3.org/2000/svg">
  <sodipodi:namedview
     id="namedview1"
     pagecolor="#ffffff"
     bordercolor="#000000"
     borderopacity="0.25"
     inkscape:showpageshadow="2"
     inkscape:pageopacity="0.0"
     inkscape:pagecheckerboard="0"
     inkscape:deskcolor="#d1d1d1"
     inkscape:document-units="mm"
     inkscape:zoom="1.4538721"
     inkscape:cx="199.12344"
     inkscape:cy="196.71607"
     inkscape:window-width="1452"
     inkscape:window-height="888"
     inkscape:window-x="26"
     inkscape:window-y="23"
     inkscape:window-maximized="0"
     inkscape:current-layer="layer1" />
  <defs
     id="defs1" />
  <g
     inkscape:label="Layer 1"
     inkscape:groupmode="layer"
     id="layer1">
    <path
       style="fill:#000000;fill-opacity:1;stroke:#000000;stroke-width:0.264583"
       id="path8"
       d="m 34.213514,16.926004 c -1.25794,0.0668 -2.517143,0.03489 -3.774742,-0.01741 -1.2109,-0.04923 -2.414823,-0.172549 -3.622151,-0.03421 -1.543683,0.247019 -3.053397,0.683267 -4.54512,1.144314 -0.831278,0.297436 -1.693881,0.518163 -2.50144,0.880628 -0.35845,0.160887 -0.516429,0.265646 -0.854516,0.463654 -0.965897,0.550696 -1.586816,1.280765 -2.220658,2.17033 -0.635592,1.019716 -0.688519,1.797584 -0.479484,2.954142 0.316758,1.077165 1.048166,1.655468 2.003235,2.190983 4.305594,2.414188 2.825961,1.815523 5.565016,2.776773 4.334841,1.147876 8.77651,1.842151 13.221336,2.39718 3.869496,0.438698 7.765285,0.518137 11.653435,0.650762 3.021033,0.129548 6.041054,0.280802 9.06205,0.409977 2.576484,0.140679 5.152332,0.199258 7.732067,0.17463 2.813185,-0.03257 5.627288,-0.0054 8.438078,-0.13684 1.476876,-0.12042 2.96114,-0.237109 4.418621,-0.513231 1.151015,-0.208507 2.303582,-0.404423 3.446598,-0.654325 1.071364,-0.216503 2.085708,-0.59268 3.067111,-1.064474 0.732263,-0.326155 1.317365,-0.84841 1.850734,-1.432986 0.44727,-0.533217 0.676124,-0.845301 0.757261,-1.548051 0.03756,-0.67969 -0.28176,-1.241866 -0.677119,-1.764676 -0.800976,-0.904958 -1.802313,-1.614301 -2.7744,-2.32375 -1.638773,-1.061989 -3.375554,-2.013557 -5.082804,-2.935531 -0.284255,-0.153508 -0.592199,-0.258538 -0.891228,-0.3808 -0.882618,-0.36087 -1.159089,-0.451452 -2.053442,-0.776619 -1.926288,-0.714563 -3.936537,-1.135152 -5.951884,-1.504018 -1.871186,-0.389312 -3.770283,-0.613984 -5.667581,-0.830248 -1.462582,-0.157396 -2.924419,-0.319489 -4.385776,-0.487805 -1.597152,-0.121966 -3.178876,-0.426884 -4.779359,-0.512096 -0.306107,-0.0163 -0.612928,-0.01368 -0.919393,-0.02052 -1.587322,-0.04381 -3.173806,-0.109624 -4.761687,-0.127905 -1.408502,-0.0065 -2.816979,8e-6 -4.225486,-0.009 -1.01368,-0.05452 -2.022279,0.05461 -3.033067,0.110964 -0.924793,0.07357 -1.857462,-0.0082 -2.780334,0.07834 -0.640837,0.04869 -1.271196,0.167006 -1.909069,0.239095 -0.655873,0.03325 -1.303685,0.09558 -1.953115,0.189616 -0.373502,0.05601 -0.751065,0.06679 -1.127985,0.07294 -0.322519,0.0033 -0.64503,-0.002 -0.967539,-0.0037 -0.360291,-0.02312 -0.707903,0.01981 -1.062344,0.07221 0,0 3.214201,2.276336 3.214201,2.276336 v 0 c 0.350485,-0.03355 0.701595,-0.02182 1.053396,-0.01899 0.320532,-6.35e-4 0.641075,-0.0049 0.961466,-0.01468 0.385091,-0.0144 0.768387,-0.04855 1.147689,-0.119602 0.632888,-0.103012 1.270971,-0.144281 1.909313,-0.201264 0.637166,-0.07154 1.272291,-0.161192 1.910921,-0.220028 0.906838,-0.05047 1.815825,-0.05984 2.722938,-0.106418 1.000935,-0.03994 2.000176,-0.120504 3.002717,-0.110393 1.407554,-0.0092 2.815055,-0.0046 4.222548,0.01228 1.56694,0.01775 3.134257,0.02837 4.700159,0.09374 1.905482,0.08862 3.797835,0.326445 5.689063,0.569326 1.450959,0.206402 2.905765,0.339417 4.365519,0.46731 1.877441,0.22659 3.754874,0.469902 5.613614,0.821503 2.009482,0.385286 3.999265,0.869584 5.92722,1.563107 0.893985,0.333294 1.176499,0.423974 2.058786,0.813473 0.30811,0.13602 1.196422,0.613863 0.914554,0.429518 -0.819857,-0.536197 -1.691071,-0.989448 -2.533973,-1.488638 -0.191836,-0.113612 0.388432,0.219038 0.580729,0.331871 0.180758,0.106062 0.358902,0.216512 0.538353,0.324767 0.957892,0.65947 1.911487,1.361456 2.728076,2.19142 0.374896,0.426802 0.768586,0.892745 0.795245,1.485946 -0.0077,0.132193 -0.0097,0.327219 -0.05062,0.458663 -0.104225,0.334352 -0.37066,0.596925 -0.566256,0.87624 -0.497375,0.545732 -1.057048,1.018392 -1.735474,1.327428 -0.956125,0.448186 -1.948354,0.801145 -2.986122,1.010655 -1.147611,0.23685 -2.30492,0.419434 -3.456365,0.636281 -1.418556,0.263252 -2.854571,0.441685 -4.293836,0.540377 -2.763438,0.166957 -5.531757,0.295979 -8.301093,0.208574 -2.581767,-0.05954 -5.164365,-0.09757 -7.744836,-0.200753 -3.011138,-0.141695 -6.023911,-0.242152 -9.035126,-0.382807 -3.828259,-0.08425 -7.663918,-0.110112 -11.472751,-0.558104 -4.508019,-0.548082 -9.020653,-1.256353 -13.366452,-2.609996 -2.33483,-0.910942 -1.41041,-0.646554 0.75749,0.790173 0.264643,0.175387 -0.563605,-0.294658 -0.829232,-0.46855 -0.389038,-0.254683 -0.70658,-0.520351 -0.957074,-0.911694 -0.09384,-0.146611 -0.148577,-0.31485 -0.222866,-0.472275 -0.24864,-1.057553 -0.244573,-1.719786 0.335111,-2.673781 0.619057,-0.893195 1.171291,-1.486337 2.135383,-2.023243 1.019895,-0.566327 2.109941,-0.976632 3.219557,-1.333445 1.493767,-0.451933 3.012724,-0.862233 4.567969,-1.031526 1.184767,-0.07295 2.370074,5.29e-4 3.555,0.04677 1.299686,0.05423 2.599269,0.04673 3.899149,0.08825 z" />
    <path
       style="fill:#000000;fill-opacity:1;stroke:#000000;stroke-width:0.264583"
       id="path9"
       d="m 14.82623,22.608488 c 0.201846,1.401971 0.211569,2.823822 0.238125,4.237475 6.35e-4,1.652427 0.02709,3.304604 0.134407,4.953778 0.161638,1.71373 0.633819,3.374306 1.05605,5.036714 0.278092,1.200034 0.661252,2.373569 0.91863,3.578657 0.03773,0.176683 0.350633,1.864336 0.375958,2.000371 0.550785,2.514217 0.901545,5.064255 1.371509,7.593462 0.633039,2.609813 0.92637,5.279128 1.369487,7.9227 0.403568,2.135444 0.922966,4.245779 1.451938,6.352704 0.295751,1.094374 0.54535,2.200521 0.855599,3.290924 0.322517,1.112681 0.584894,2.241764 0.850875,3.369032 0.260336,1.287598 0.508848,2.577616 0.85091,3.846589 0.179339,0.495007 0.477528,0.948831 0.940202,1.226794 2.913802,1.750541 2.864886,1.91466 5.063624,2.598219 2.227892,0.640564 4.530442,0.957051 6.825448,1.243668 2.729868,0.247637 5.471186,0.338498 8.20711,0.497631 2.733363,0.205235 5.473473,0.158359 8.211484,0.137044 2.323412,0.06508 4.632854,-0.187113 6.942995,-0.385284 0.463256,-0.05165 0.928552,-0.08746 1.389766,-0.154955 0.795353,-0.116391 2.41998,-0.455925 3.174328,-0.589598 1.881838,-0.33347 3.777588,-0.558467 5.671772,-0.807252 2.066573,-0.296987 4.140277,-0.569013 6.187898,-0.981146 0.532196,-0.198422 1.105053,-0.247518 1.646343,-0.402228 0.05782,-0.02959 0.124421,-0.04617 0.173445,-0.08877 0.406591,-0.35329 0.34448,-1.110668 0.380783,-1.580919 0.01963,-0.254477 0.04107,-0.508813 0.0616,-0.763218 0.149063,-2.316392 0.208912,-4.637907 0.26617,-6.95812 0.01834,-1.982365 0.182208,-3.958987 0.319149,-5.935658 0.114421,-2.260306 0.536109,-4.486126 0.846812,-6.723372 0.251597,-1.886553 0.530627,-3.768203 0.86941,-5.641056 0.194265,-1.233385 0.349496,-2.470809 0.599673,-3.69475 0.287668,-1.440532 0.492236,-2.895545 0.751123,-4.34112 0.26711,-1.459735 0.5554,-2.915605 0.8079,-4.37797 0.220427,-1.410118 0.604157,-2.789497 0.992902,-4.160996 0.23832,-0.827649 0.556903,-1.630754 0.924761,-2.408936 0.16628,-0.336852 0.308946,-0.685234 0.512283,-1.001824 0,0 -3.402912,-1.981954 -3.402912,-1.981954 v 0 c -0.208986,0.338061 -0.37438,0.69619 -0.532119,1.060646 -0.322146,0.821671 -0.630642,1.651204 -0.865873,2.502432 -0.373208,1.390568 -0.723955,2.791007 -0.982787,4.207507 -0.2624,1.461267 -0.525735,2.922405 -0.800819,4.381304 -0.252175,1.439312 -0.475779,2.883368 -0.778883,4.313412 -0.260906,1.232136 -0.442185,2.473397 -0.575948,3.725669 -0.280609,1.896174 -0.530913,3.795948 -0.786588,5.695699 -0.307493,2.240796 -0.696208,4.471612 -0.891415,6.726367 -0.158584,1.988595 -0.301332,3.981929 -0.281599,5.978133 -0.0302,2.294975 -0.0676,4.59581 -0.351449,6.876381 -0.05428,0.394676 -0.123005,0.907674 -0.184547,1.311452 -0.04103,0.269166 -0.01318,0.572791 -0.321185,0.640554 -0.531813,0.118581 -1.051277,0.277249 -1.570321,0.442751 -1.930932,0.501015 -3.898725,0.848987 -5.86708,1.165654 -1.901168,0.272991 -3.807526,0.504176 -5.7053,0.800602 -0.554149,0.08656 -2.603492,0.437722 -3.232843,0.515663 -0.46859,0.05803 -0.940382,0.0864 -1.410573,0.129603 -2.301013,0.161234 -4.601562,0.37623 -6.910028,0.378145 -2.733021,0.02648 -5.468236,0.03952 -8.196405,-0.154887 -2.749315,-0.14601 -5.504519,-0.240054 -8.241575,-0.554839 -2.319166,-0.294693 -4.651288,-0.605671 -6.872012,-1.371592 -0.235067,-0.08368 -0.472985,-0.159745 -0.7052,-0.251045 -1.183941,-0.465492 -2.730581,-1.50654 2.224773,1.399466 0.150008,0.08797 -0.305975,-0.167674 -0.445516,-0.271449 -0.391181,-0.290909 -0.349345,-0.311203 -0.578921,-0.715743 -0.419198,-1.258379 -0.700381,-2.553414 -0.938197,-3.857326 -0.236405,-1.122878 -0.441843,-2.254972 -0.764105,-3.356615 -0.341042,-1.105707 -0.606684,-2.233748 -0.971952,-3.33257 -0.572515,-2.108351 -1.125008,-4.222605 -1.552934,-6.366216 -0.464488,-2.64867 -0.764458,-5.326341 -1.40217,-7.943559 -0.457892,-2.511915 -0.77329,-5.046499 -1.284961,-7.54893 -0.0072,-0.04265 -0.326526,-1.925402 -0.342179,-2.004931 -0.237811,-1.208273 -0.624541,-2.380112 -0.902212,-3.578987 -0.408981,-1.640795 -0.881265,-3.273594 -1.056064,-4.961247 -0.113237,-1.648529 -0.179989,-3.300436 -0.177176,-4.953063 -0.01272,-1.394399 -0.02022,-2.788958 -0.04682,-4.183159 z" />
    <path
       style="fill:#000000;fill-opacity:1;stroke:#000000;stroke-width:0.264583"
       id="path10"
       d="m 17.353417,24.446134 c 0.07631,-0.601291 0.357769,-1.12601 0.629609,-1.655562 0.289148,-0.566831 0.574252,-1.133839 0.98431,-1.623095 0.525753,-0.493064 1.181919,-0.780689 1.84446,-1.036874 0.871242,-0.244109 1.731274,-0.526358 2.605262,-0.759247 0.971046,-0.199873 1.950685,-0.357335 2.926932,-0.530815 0.644523,-0.185664 1.307598,-0.265085 1.966178,-0.374942 0.651266,-0.127781 1.325882,-0.178514 1.967571,-0.35016 0.440904,-0.132872 0.899451,-0.156294 1.356254,-0.174381 0.332396,0.02919 0.662866,0.0756 0.99395,0.116315 0,0 -3.160689,-2.350923 -3.160689,-2.350923 v 0 c -0.339984,-0.03462 -0.681289,-0.0731 -1.023665,-0.05727 -0.47607,0.03218 -0.947065,0.08808 -1.404646,0.231021 -0.634425,0.14226 -1.277193,0.251328 -1.921528,0.337131 -0.661839,0.08709 -1.305536,0.238535 -1.95275,0.401054 -0.975422,0.187886 -1.95842,0.339898 -2.925449,0.56793 -0.891585,0.236289 -1.778143,0.493982 -2.65503,0.780047 -0.717842,0.289688 -1.424859,0.631092 -1.978808,1.186379 -0.416708,0.519117 -0.703168,1.110175 -1.014792,1.696154 -0.294821,0.542474 -0.568509,1.093178 -0.71043,1.698944 z" />
    <path
       style="fill:#000000;fill-opacity:1;stroke:#000000;stroke-width:0.264583"
       id="path11"
       d="m 13.987069,20.731434 c -0.14465,0.584769 -0.369484,1.142805 -0.519597,1.726094 -0.122007,0.53578 -0.156877,1.082441 -0.164916,1.629867 -0.01038,0.672332 -0.0041,1.342596 0.05206,2.01277 0.03776,0.76832 0.216931,1.514985 0.387508,2.261459 0.235303,1.034317 0.36955,2.081628 0.447275,3.138223 0.08068,1.394454 0.16655,2.787925 0.205377,4.184345 0.02327,0.726885 -1.54e-4,1.454092 0.0085,2.181016 -0.01343,0.697045 0.06586,1.390219 0.120201,2.084044 0.03618,0.799187 0.146752,1.592633 0.252903,2.384838 0.107168,0.94693 0.229697,1.89149 0.308024,2.841418 0.07633,1.450377 0.118907,2.902323 0.181656,4.353481 0.0474,1.208262 0.13571,2.415556 0.240368,3.620169 0.120229,1.34362 0.176688,2.691466 0.305764,4.034356 0.128487,1.237398 0.535442,2.422684 0.943668,3.590864 0.46728,1.326719 1.035352,2.615062 1.585212,3.908967 0.496778,1.090338 0.917921,2.211512 1.347277,3.329282 0.454745,1.153509 0.796646,2.346772 1.157317,3.531838 0.290154,0.852096 0.581059,1.702654 0.853768,2.560621 0.255733,0.647423 0.362803,1.386666 0.745282,1.980597 0.06343,0.0985 0.145808,0.183409 0.218712,0.275111 1.216956,0.719328 2.421109,1.460773 3.65087,2.157982 0.116331,0.06595 0.78616,0.255455 0.886516,0.285678 0.594985,0.179187 1.183511,0.373711 1.772209,0.572574 1.58678,0.45679 3.137775,1.062813 4.767648,1.359398 0.345266,0.06283 0.694391,0.102195 1.041586,0.153291 2.042459,0.287933 4.101922,0.324766 6.159579,0.372745 2.359615,0.04765 4.717933,0.149244 7.077969,0.172861 2.449441,0.02647 4.896475,0.140681 7.344974,0.203057 1.689891,0.04665 3.379605,-0.0086 5.064365,-0.137528 1.204556,-0.05464 2.404661,-0.156319 3.606763,-0.245936 1.180796,-0.121255 2.365915,-0.188198 3.539578,-0.37063 1.265848,-0.25019 2.543585,-0.438997 3.820488,-0.623578 1.223838,-0.156017 2.451658,-0.272206 3.675086,-0.430306 0.927031,-0.151262 1.857994,-0.250933 2.792031,-0.350705 0.81298,-0.179305 1.898132,-0.06773 2.668151,-0.3981 0.321313,-0.137856 0.390626,-0.267843 0.604465,-0.512926 0.362828,-0.590892 0.290745,-1.280697 0.263948,-1.943248 0.01191,-1.11247 0.03648,-2.226551 0.09692,-3.337672 0.131577,-1.283477 0.0977,-2.570442 0.103725,-3.857635 0.03253,-1.4859 0.03043,-2.970869 0.116236,-4.45494 0.191556,-1.979436 0.473726,-3.94847 0.69931,-5.924513 0.257807,-2.029587 0.437912,-4.067876 0.640921,-6.103498 0.112702,-1.952774 0.432208,-3.877726 0.786906,-5.797913 0.363783,-1.932562 0.766638,-3.858048 1.175104,-5.781685 0.280575,-1.385748 0.514311,-2.780319 0.78182,-4.16872 0.15879,-0.806299 0.410692,-1.589775 0.643319,-2.37671 0.229629,-0.659669 0.38613,-1.336002 0.513326,-2.021506 0.136974,-0.687234 0.246869,-1.379008 0.378007,-2.067272 0.07788,-0.462047 0.21962,-0.908391 0.29663,-1.370475 0.06444,-0.601448 0.04825,-1.207196 0.08976,-1.810928 0.01087,-0.128174 0.02175,-0.256349 0.03263,-0.384524 0,0 -3.455141,-1.79575 -3.455141,-1.79575 v 0 c -0.0099,0.128887 -0.01982,0.257773 -0.02974,0.386658 -0.05289,0.587111 -0.0878,1.173573 -0.125744,1.761594 -0.0605,0.463288 -0.193614,0.910434 -0.264136,1.371843 -0.12528,0.690692 -0.208473,1.388131 -0.367318,2.072664 -0.126249,0.672169 -0.268224,1.342705 -0.486373,1.992101 -0.231439,0.804897 -0.492892,1.603745 -0.62946,2.432558 -0.222882,1.404178 -0.413557,2.813796 -0.676537,4.211256 -0.394856,1.930138 -0.790159,3.86021 -1.164807,5.794399 -0.381727,1.939914 -0.694401,3.853738 -0.789093,5.833782 -0.207124,2.032953 -0.400677,4.067567 -0.644361,6.09646 -0.22289,1.977411 -0.509556,3.944829 -0.740346,5.920949 -0.124005,1.480561 -0.163828,2.964098 -0.179346,4.449596 -0.0118,1.278401 0.02291,2.557161 -0.111032,3.831693 -0.06992,1.112716 -0.09018,2.228152 -0.158948,3.341132 0.0024,0.553987 0.08311,1.159724 -0.14871,1.67712 -0.05452,0.0625 -0.09862,0.135908 -0.163552,0.187502 -0.595267,0.472977 -2.120437,0.410639 -2.849745,0.537575 -0.976384,0.05637 -1.898007,0.149365 -2.85841,0.329917 -1.209545,0.17834 -2.424575,0.312491 -3.637928,0.461965 -1.285108,0.20002 -2.572388,0.386678 -3.855389,0.599295 -1.162582,0.169568 -2.331625,0.2751 -3.503343,0.359362 -1.193054,0.0814 -2.383869,0.193847 -3.57755,0.267687 -1.655374,0.11558 -3.313803,0.216805 -4.974275,0.159311 -2.449407,-0.03717 -4.898552,-0.08481 -7.345807,-0.19984 -2.348675,-0.03308 -4.69827,-0.0411 -7.044862,-0.158837 -2.054318,-0.09194 -4.117771,-0.11901 -6.155015,-0.42849 -0.350589,-0.06349 -0.702937,-0.117931 -1.051764,-0.190479 -1.629119,-0.338834 -3.204183,-0.89621 -4.779973,-1.419299 -0.609195,-0.214069 -1.225085,-0.405339 -1.834938,-0.616548 -1.327401,-0.459714 -3.37655,-1.835984 2.127458,1.413433 -0.08779,-0.06157 -0.187245,-0.109178 -0.263358,-0.1847 -0.450421,-0.446932 -0.575578,-1.325087 -0.798942,-1.899018 -0.269672,-0.873935 -0.568029,-1.733868 -0.903235,-2.584791 -0.38517,-1.180304 -0.701417,-2.382235 -1.128973,-3.547989 -0.452379,-1.123518 -0.856928,-2.26786 -1.385572,-3.359152 -0.550635,-1.282179 -1.112657,-2.562376 -1.57674,-3.878906 -0.412677,-1.140872 -0.806787,-2.307576 -0.985371,-3.510269 -0.151701,-1.337419 -0.211311,-2.680502 -0.302145,-4.022876 -0.09264,-1.206272 -0.186287,-2.412722 -0.266788,-3.61955 -0.08008,-1.447893 -0.139536,-2.894907 -0.152883,-4.345173 -0.04283,-0.952518 -0.138519,-1.898531 -0.255813,-2.84458 -0.101899,-0.784273 -0.203353,-1.570085 -0.256975,-2.359081 -0.03839,-0.682109 -0.12361,-1.362374 -0.0988,-2.046462 -1.75e-4,-0.746225 -0.05704,-1.491125 -0.08923,-2.236359 -0.07049,-1.397878 -0.159283,-2.795058 -0.205579,-4.193989 -0.05278,-1.064321 -0.138654,-2.123038 -0.372059,-3.165544 -0.147031,-0.732687 -0.341963,-1.46023 -0.390445,-2.208784 -0.05872,-0.654669 -0.07417,-1.308293 -0.0507,-1.965711 0.01256,-0.520013 0.0233,-1.043166 0.123054,-1.55544 0.130403,-0.579848 0.334211,-1.138113 0.543689,-1.693438 z" />
    <path
       style="fill:#000000;fill-opacity:1;stroke:#000000;stroke-width:0.264583"
       id="path12"
       d="m 14.138589,34.705163 c 0.511453,0.693242 1.165848,1.28583 1.908368,1.725776 1.283717,0.760603 2.58301,1.494608 3.874515,2.241913 2.033113,1.21308 4.341709,1.790041 6.604491,2.411214 1.68071,0.398018 3.376499,0.754263 5.092375,0.965144 2.038619,0.250545 4.145658,0.378084 6.194216,0.550362 3.767153,0.336442 7.541614,0.56632 11.319816,0.72966 3.116533,0.162785 6.231239,0.356783 9.347116,0.531035 3.371212,0.193048 6.746208,0.283819 10.121915,0.345175 2.250324,0.07084 4.485159,-0.181938 6.712006,-0.467955 1.626632,-0.227121 3.247932,-0.469929 4.849489,-0.835655 1.558505,-0.329641 3.119385,-0.64702 4.679032,-0.971147 0.747461,-0.172019 1.497489,-0.373484 2.131177,-0.817349 0.431101,-0.343378 0.838977,-0.717166 1.239681,-1.095168 0.354743,-0.328187 0.40686,-0.800243 0.488635,-1.249439 0.108321,-0.502706 0.135157,-1.014961 0.174257,-1.525897 0.08355,-0.73926 0.120254,-1.482419 0.157901,-2.225088 0.06242,-0.660334 -0.02782,-1.31731 -0.08716,-1.973858 -0.08095,-1.044165 -0.08827,-2.092203 -0.08933,-3.138932 -0.015,-0.657055 -0.06473,-1.312545 -0.106608,-1.968243 -0.01154,-0.199499 -0.0051,-0.10106 -0.01932,-0.295323 0,0 -3.574516,-1.719182 -3.574516,-1.719182 v 0 c 0.06805,0.142485 0.04161,0.05967 0.0609,0.253609 0.07428,0.658904 0.169817,1.316086 0.198961,1.979278 0.01439,1.048803 0.02376,2.097738 0.05289,3.146271 0.02785,0.644774 0.121182,1.284997 0.09151,1.931112 -0.01593,0.734073 -0.05171,1.468202 -0.154339,2.196023 -0.06719,0.493974 -0.07335,0.995511 -0.181173,1.484228 -0.07595,0.36916 -0.06701,0.765953 -0.365028,1.040373 -0.378327,0.365887 -0.757105,0.737412 -1.187132,1.042787 -0.609486,0.36591 -1.290537,0.581078 -1.977742,0.752766 -1.530707,0.366508 -3.073082,0.683802 -4.612119,1.012489 -1.60053,0.312764 -3.213076,0.56152 -4.82351,0.817599 -2.175536,0.286592 -4.359524,0.55345 -6.558931,0.51339 -3.353935,-0.02942 -6.708865,-0.102034 -10.056595,-0.319032 -1.126937,-0.07845 -2.252856,-0.171384 -3.380044,-0.246163 -1.992784,-0.13221 -3.99115,-0.165502 -5.984441,-0.289687 -3.72872,-0.171617 -7.460832,-0.309968 -11.1795,-0.645613 -3.81679,-0.364939 -7.663008,-0.659921 -11.378952,-1.66497 -2.348047,-0.674497 -4.657874,-1.361633 -6.757871,-2.645947 0.877569,0.511876 1.750686,1.031462 2.632706,1.535631 0.196859,0.112525 -0.389926,-0.232177 -0.576868,-0.360505 -0.396103,-0.271912 -0.787031,-0.588081 -1.094918,-0.959863 -0.0585,-0.07064 -0.108036,-0.148262 -0.162054,-0.222393 z" />
    <path
       style="fill:#000000;fill-opacity:1;stroke:#000000;stroke-width:0.264583"
       id="path13"
       d="m 14.766301,19.886471 c -0.593053,0.569392 -1.043344,1.271059 -1.454839,1.977738 -0.546886,1.050175 -0.841431,2.209341 -1.110053,3.355852 -0.281658,1.454323 -0.506125,2.923887 -0.62804,4.40062 -0.06214,1.014671 -0.04484,2.031915 -0.04918,3.047955 -0.02447,0.60239 0.180775,1.097594 0.547997,1.560761 0.246025,0.341074 0.608837,0.536305 0.965246,0.740997 3.599841,2.067446 2.476936,1.426906 4.036202,2.315708 0.898032,0.409477 1.857246,0.651184 2.792832,0.95459 0.391608,0.121383 0.35574,0.09001 0.716497,0.281678 0.110405,0.05866 0.432734,0.250637 0.324091,0.188775 -5.459777,-3.10877 -3.383763,-1.970061 -2.199012,-1.186823 1.490936,0.912958 2.915936,2.012172 4.581218,2.567622 0.37796,0.126069 0.767824,0.198387 1.159216,0.265978 0.336022,0.05979 0.676315,0.06591 1.016333,0.06973 0,0 -3.179394,-2.323848 -3.179394,-2.323848 v 0 c -0.319722,-0.01487 -0.639026,-0.04062 -0.953822,-0.101658 -0.371174,-0.07835 -0.732651,-0.166238 -1.084316,-0.313124 -0.136352,-0.05695 -0.527716,-0.265007 -0.401008,-0.188976 0.290741,0.174453 4.278783,2.488523 2.457954,1.431859 -1.738836,-1.175438 -3.484689,-2.452997 -5.505093,-3.064301 -0.938842,-0.27931 -1.888211,-0.554181 -2.75213,-1.027174 -1.309345,-0.72912 -0.748081,-0.419134 2.62037,1.525821 0.113802,0.06571 -0.223163,-0.139166 -0.338897,-0.201409 -0.280586,-0.150902 -0.244109,-0.08532 -0.470316,-0.25463 -0.05872,-0.04394 -0.111081,-0.0958 -0.166622,-0.14369 -0.375132,-0.425751 -0.675018,-0.722971 -0.689633,-1.334259 -0.04271,-1.017791 -0.07095,-2.036712 -0.03989,-3.055353 0.08141,-1.460285 0.288729,-2.918288 0.593982,-4.34817 0.264727,-1.106228 0.577601,-2.214697 1.113381,-3.224361 0.389661,-0.670453 0.817325,-1.357843 1.450289,-1.824019 z" />
    <path
       style="fill:#000000;fill-opacity:1;stroke:#000000;stroke-width:0.264583"
       id="path14"
       d="m 16.098137,46.237448 c 0.121528,0.641355 0.125774,1.297614 0.173122,1.947214 0.02979,0.575122 0.139237,1.140261 0.256123,1.702662 0.165703,0.78336 0.382524,1.553115 0.615885,2.31851 0.18423,0.547097 0.2906,1.116269 0.465783,1.665933 0.0766,0.240355 0.229055,0.648425 0.314234,0.881017 0.318863,0.826702 0.517907,1.691503 0.71735,2.552774 0.146373,0.592887 0.255416,1.192242 0.31701,1.799567 0.0509,0.778562 0.0973,1.557512 0.158321,2.335397 0.07689,0.826196 0.101225,1.655636 0.158262,2.483131 0.0346,0.558519 0.08583,1.115491 0.16443,1.669534 0.07846,0.510833 0.161587,1.02245 0.280417,1.525682 0.118319,0.489781 0.287813,0.964703 0.467629,1.434659 0.281848,0.769347 0.573687,1.535072 0.84024,2.309905 0.219126,0.679889 0.425812,1.363622 0.635525,2.046443 0.138312,0.429475 0.252523,0.866243 0.425903,1.283359 0.12284,0.311581 0.326946,0.58669 0.549548,0.834379 0.203623,0.228402 0.397672,0.464982 0.589035,0.703411 1.140198,1.137081 2.720737,1.719945 4.130867,2.47604 0.04686,0.02209 0.09372,0.04417 0.140578,0.06626 0,0 -3.081061,-2.45736 -3.081061,-2.45736 v 0 c -0.04448,-0.02196 -0.08895,-0.04393 -0.133429,-0.06589 -1.282534,-0.584761 -0.142962,-0.07108 3.067131,1.792004 0.315902,0.183346 -0.300863,-0.172974 -0.37107,-0.220866 -0.03448,-0.02352 -0.07095,-0.04398 -0.106424,-0.06597 -0.230206,-0.210063 -0.409773,-0.461915 -0.611779,-0.698167 -0.203889,-0.239577 -0.429973,-0.459994 -0.601872,-0.726664 -0.191031,-0.411867 -0.359716,-0.827911 -0.476276,-1.26886 -0.252526,-0.682096 -0.466478,-1.378593 -0.682836,-2.072828 -0.271527,-0.764677 -0.55728,-1.525 -0.791303,-2.3021 -0.177763,-0.447579 -0.321123,-0.911005 -0.458105,-1.372073 -0.123098,-0.499494 -0.260261,-0.997464 -0.327539,-1.508901 -0.08325,-0.551021 -0.11265,-1.106228 -0.184991,-1.658445 -0.102712,-0.829868 -0.134688,-1.664708 -0.205548,-2.497674 -0.05527,-0.767586 -0.08208,-1.536719 -0.09345,-2.306077 -0.04096,-0.635648 -0.162635,-1.256697 -0.335416,-1.869929 -0.198327,-0.879097 -0.424402,-1.756014 -0.725903,-2.605667 -0.283863,-0.832731 -0.568592,-1.661713 -0.768544,-2.520196 -0.217818,-0.749726 -0.465346,-1.4941 -0.587673,-2.267466 -0.111129,-0.552974 -0.226763,-1.106866 -0.282339,-1.668703 -0.07303,-0.639059 -0.107717,-1.280613 -0.09778,-1.924169 z" />
    <path
       style="fill:#000000;fill-opacity:1;stroke:#000000;stroke-width:0.264583"
       id="path15"
       d="m 18.707145,38.416309 c 0.07404,0.04226 0.295975,0.169394 0.222129,0.126788 -0.992611,-0.572722 -1.983388,-1.148643 -2.97843,-1.71713 -0.147938,-0.08452 0.289535,0.179787 0.436988,0.265152 1.727804,1.000274 3.281909,1.960785 5.035212,2.797802 1.065076,0.512393 2.15853,0.962237 3.241938,1.433775 0.582848,0.224052 1.159069,0.474811 1.756963,0.657982 0.302173,0.09258 0.60952,0.16738 0.913392,0.254214 0.907587,0.220199 1.800378,0.500105 2.709836,0.711869 0.909563,0.20351 1.827257,0.363699 2.740525,0.54955 1.192575,0.23108 2.395114,0.415449 3.606038,0.514792 1.141264,0.111369 2.281883,0.23349 3.421456,0.362016 1.318705,0.179171 2.638637,0.347822 3.959691,0.508501 0.70358,0.052 1.400969,0.165774 2.102914,0.232708 0.533588,0.05088 1.151929,0.08365 1.68253,0.116137 1.867662,0.111736 3.736022,0.209272 5.604396,0.308266 0.877271,0.0554 1.754719,0.09669 2.633782,0.09475 1.102455,-0.01177 2.204587,-0.04048 3.307119,-0.05094 1.411362,-0.02294 2.81975,0.0847 4.228891,0.13925 1.026406,0.04884 2.054273,0.01408 3.080721,0.04581 1.396865,0.04428 2.794035,0.07785 4.191339,0.103791 1.683499,0.06101 3.360364,0.23083 5.042305,0.31669 0.849947,0.0019 1.702961,0.102421 2.55261,0.06135 0.572161,-0.08024 1.07212,-0.397476 1.552392,-0.699995 0.358757,-0.257434 0.768218,-0.424003 1.159293,-0.622387 0.249693,-0.114888 0.472197,-0.270373 0.741818,-0.337233 0.378335,-0.133757 0.768397,-0.233085 1.135904,-0.3956 0.218998,-0.07738 0.424312,-0.180866 0.636296,-0.275338 0.02519,-0.03381 0.05039,-0.06762 0.07558,-0.101439 0,0 -3.433241,-2.031053 -3.433241,-2.031053 v 0 c 0.0141,-0.0186 0.02822,-0.0372 0.04232,-0.0558 -0.194225,0.101965 -0.391385,0.195464 -0.593809,0.280419 -0.366718,0.147119 -0.746049,0.254764 -1.124561,0.366797 -0.26742,0.109006 -0.51379,0.25522 -0.768803,0.389628 -0.392829,0.202205 -0.770951,0.429739 -1.139206,0.673891 -0.44559,0.271209 -0.912556,0.516586 -1.446845,0.529445 -0.808492,0.02503 -1.617606,0.02053 -2.425972,-0.0087 -1.647275,-0.05733 -3.294158,-0.12368 -4.938673,-0.238284 -1.439592,-0.08034 -2.87982,-0.134586 -4.32036,-0.194495 -1.017976,-0.02889 -2.03608,-0.0083 -3.054218,-0.02927 -1.395441,-0.04557 -2.790888,-0.109471 -4.187623,-0.09245 -1.147062,-0.0096 -2.293795,-0.03517 -3.440777,-0.04812 -0.830966,-0.0078 -1.661898,7.94e-4 -2.492856,-0.0075 C 48.324356,43.315078 46.4758,43.203586 44.628873,43.066519 43.322654,42.940651 42.028196,42.731813 40.721541,42.611663 39.427202,42.476437 38.131384,42.352181 36.843906,42.15913 35.67458,42.000761 34.5051,41.838 33.328144,41.746245 c -1.193454,-0.100192 -2.3827,-0.253548 -3.549399,-0.53154 -0.933704,-0.20325 -1.873419,-0.377751 -2.800919,-0.609028 -0.887443,-0.220181 -1.777222,-0.434065 -2.654137,-0.693587 -0.898023,-0.272246 -1.788449,-0.57014 -2.64674,-0.952476 -1.052781,-0.452165 -2.119777,-0.873649 -3.147325,-1.382231 -0.231319,-0.117213 -0.464453,-0.230907 -0.693955,-0.351637 -0.209122,-0.110008 -0.82526,-0.46056 -0.62175,-0.340489 0.904892,0.533892 1.813831,1.060966 2.726137,1.582086 0.136481,0.07796 -0.262806,-0.172728 -0.398298,-0.252394 -1.778003,-1.045432 -2.562237,-1.498639 -3.898992,-2.271826 z" />
    <path
       style="fill:#000000;fill-opacity:1;stroke:#000000;stroke-width:0.264583"
       id="path16"
       d="m 15.123021,24.356917 c 1.410844,0.929634 2.899483,1.723123 4.379919,2.543188 0.18879,0.104577 0.393554,0.177279 0.589991,0.266666 0.225575,0.102647 0.450696,0.20629 0.676044,0.309435 1.47928,0.647803 5.89141,3.253648 -0.192828,-0.244409 0.733229,0.451178 1.453266,0.921907 2.18675,1.373198 1.53274,0.922775 0.993498,0.602189 4.063032,2.340256 0.380717,0.215574 0.788887,0.377394 1.211093,0.486328 1.078783,0.236101 2.155643,0.48083 3.235574,0.711703 1.566325,0.309731 3.161062,0.459512 4.74686,0.638952 1.517881,0.218835 3.048678,0.29849 4.576115,0.414481 1.487712,0.117006 2.97485,0.243475 4.460494,0.384963 1.604819,0.109014 3.210427,0.207039 4.815554,0.312132 1.362625,0.08262 2.727364,0.119933 4.091913,0.154813 1.461138,0.03438 2.921484,0.04138 4.381453,0.111802 1.438703,0.07042 2.878391,0.107903 4.318375,0.140592 1.617663,0.06007 3.234471,0.140353 4.851355,0.218027 1.036828,0.06089 2.073286,0.0091 3.109182,-0.03822 1.677152,-0.08444 3.356645,-0.103852 5.034061,-0.180983 1.217967,-0.08144 2.442077,-0.07175 3.655208,-0.215858 0.596704,-0.06552 1.189866,-0.145846 1.780714,-0.251494 0.525164,-0.07368 1.041609,-0.194985 1.568196,-0.260038 0.419894,-0.08789 0.836335,-0.185166 1.245831,-0.314418 0.391096,-0.0904 0.775456,-0.206981 1.16654,-0.29642 0.24739,-0.124579 0.524568,-0.13502 0.795369,-0.157647 0,0 -3.200498,-2.270789 -3.200498,-2.270789 v 0 c -0.286996,0.04045 -0.569449,0.0922 -0.841224,0.195895 -0.378248,0.113773 -0.759849,0.214966 -1.139754,0.323154 -0.411289,0.103677 -0.825338,0.193916 -1.244245,0.261453 -0.504134,0.104251 -1.004393,0.231249 -1.516912,0.289753 -0.584509,0.07281 -1.165108,0.17118 -1.747004,0.262195 -1.165397,0.147618 -2.33699,0.216325 -3.509126,0.288065 -1.704904,0.10188 -3.410228,0.116837 -5.11783,0.113921 -1.029785,0.03133 -2.058729,0.05444 -3.08899,0.02188 -1.583025,-0.0118 -3.164916,-0.06473 -4.746116,-0.141943 -1.468023,-0.05525 -2.932917,-0.166818 -4.401588,-0.205023 -1.444691,-0.03966 -2.890146,-0.02996 -4.334806,-0.07443 -1.370467,-0.04969 -2.738374,-0.146257 -4.1095,-0.177927 -1.604153,-0.06483 -3.205816,-0.178904 -4.804762,-0.322683 -1.476544,-0.135419 -2.9543,-0.261094 -4.434014,-0.356548 -1.527977,-0.110527 -3.051384,-0.261895 -4.574207,-0.428831 -1.59272,-0.166198 -3.189412,-0.350623 -4.754854,-0.694809 -1.119584,-0.251595 -2.240543,-0.506934 -3.340472,-0.835393 -0.271143,-0.10201 -0.533578,-0.210402 -0.793069,-0.33996 -0.111083,-0.05546 -0.437705,-0.23435 -0.330735,-0.171321 1.802829,1.062257 4.045444,2.337036 2.466233,1.438169 -0.39824,-0.251049 -0.810415,-0.483377 -1.203354,-0.742489 -0.315066,-0.207762 -0.301499,-0.229389 -0.61719,-0.431623 -0.107591,-0.06892 -0.219789,-0.130376 -0.329684,-0.195564 -2.069539,-1.195051 -4.103891,-2.459766 -6.287543,-3.440094 -0.232595,-0.11052 -0.466438,-0.218452 -0.697785,-0.33156 -1.284215,-0.627867 -2.368269,-1.300244 2.208996,1.341465 0.148482,0.0857 -0.283987,-0.192142 -0.427002,-0.28668 -0.04782,-0.03161 -0.09713,-0.06091 -0.145691,-0.09136 z" />
    <path
       style="fill:#000000;fill-opacity:1;stroke:#000000;stroke-width:0.264583"
       id="path17"
       d="m 20.641737,26.430589 c 0.396726,-0.647907 0.90841,-1.221024 1.433512,-1.767204 0.563836,-0.651816 1.2702,-1.044403 2.029126,-1.422745 1.024898,-0.509458 2.155199,-0.711372 3.266096,-0.940795 1.162018,-0.254934 2.324923,-0.490128 3.507054,-0.627991 0.971339,-0.116088 1.937687,-0.262486 2.898932,-0.444023 1.127675,-0.261836 2.277689,-0.383896 3.424925,-0.519589 0.898723,-0.121104 1.796526,-0.226302 2.702158,-0.278829 1.486672,-0.07645 2.975567,-0.08191 4.463552,-0.117362 1.362139,-0.03568 2.722282,-0.116918 4.084476,-0.155012 1.444609,-0.05316 2.887398,0.09048 4.326554,0.197768 1.793272,0.173136 3.587708,0.328703 5.387258,0.417758 1.601732,0.04734 3.203689,0.0439 4.80372,0.137169 2.3105,0.152334 4.609451,0.440615 6.902328,0.757332 1.572696,0.197138 3.138305,0.441065 4.704611,0.683326 1.135412,0.192259 2.282204,0.322254 3.404402,0.585614 0.960869,0.26311 1.927532,0.503105 2.89252,0.75079 1.222756,0.318116 2.438559,0.653466 3.612399,1.124464 1.21965,0.637082 3.037432,1.70593 -2.56603,-1.489839 -0.06085,-0.03471 0.120089,0.07229 0.17825,0.111334 0.175866,0.11807 0.160586,0.115228 0.317497,0.259855 0.239898,0.264474 0.477026,0.534514 0.659588,0.842601 0.104249,0.220822 0.161727,0.445356 0.195736,0.686125 0.0089,0.04474 0.01791,0.08948 0.02686,0.134216 0,0 3.554198,1.71826 3.554198,1.71826 v 0 c -0.0097,-0.04311 -0.01939,-0.08622 -0.0291,-0.129328 -0.0665,-0.248595 -0.02698,-0.521719 -0.166328,-0.750096 -0.101309,-0.38519 -0.376791,-0.685341 -0.632193,-0.981065 -0.131447,-0.180074 -0.264496,-0.368323 -0.461819,-0.484191 -1.327492,-0.7795 -2.635533,-1.72213 -4.096203,-2.279923 -1.166691,-0.395057 -2.357747,-0.708438 -3.547202,-1.026522 -1.012328,-0.269529 -2.01159,-0.589008 -3.031062,-0.828936 -1.064675,-0.177386 -2.14545,-0.237914 -3.209919,-0.419331 -1.572718,-0.253374 -3.134154,-0.589981 -4.728157,-0.684458 -2.296846,-0.23576 -4.59113,-0.495229 -6.888755,-0.723216 -1.626378,-0.122792 -3.254643,-0.14966 -4.884791,-0.186417 -1.777883,-0.06918 -3.552677,-0.192697 -5.321564,-0.387564 -1.483257,-0.13905 -2.972692,-0.317905 -4.46482,-0.242888 -1.339107,0.06345 -2.676591,0.161153 -4.01683,0.19958 -1.523093,0.05025 -3.045831,0.03699 -4.569309,0.05524 -0.905132,0.05378 -1.802829,0.167068 -2.697417,0.314894 -1.148511,0.161809 -2.302706,0.292335 -3.438355,0.53386 -0.963441,0.168269 -1.934517,0.271346 -2.900032,0.425233 -1.165773,0.196222 -2.326127,0.420039 -3.480261,0.676449 -1.146849,0.240838 -2.311621,0.452497 -3.365854,0.990053 -0.793451,0.39263 -1.552678,0.831541 -2.130221,1.520377 -0.519225,0.567894 -1.009952,1.161185 -1.528281,1.729597 z" />
    <path
       style="fill:#000000;fill-opacity:1;stroke:#000000;stroke-width:0.264583"
       id="path18"
       d="m 30.27304,29.993367 c 0.988451,-0.447042 2.024824,-0.767077 3.073466,-1.036849 0.832178,-0.186362 1.679895,-0.29641 2.523233,-0.421439 0.687163,-0.100951 1.371079,-0.227494 2.059983,-0.315724 1.158734,-0.18052 2.334873,-0.214424 3.50444,-0.277046 1.095809,-0.04674 2.172055,-0.245491 3.248951,-0.437716 1.545217,-0.304662 3.107402,-0.486777 4.677127,-0.598654 1.346512,-0.08765 2.696162,-0.09802 4.044849,-0.07744 0.71995,-0.0066 1.43782,-0.07528 2.157334,-0.09234 0.311999,-0.0074 1.237485,-0.0016 1.523034,-7.94e-4 1.880878,0.0387 3.756086,0.228378 5.624568,0.438081 1.76136,0.254013 3.514706,0.569116 5.252079,0.954442 1.357998,0.303969 2.697922,0.680051 4.040706,1.043591 1.01721,0.279477 2.061377,0.438714 3.081259,0.705771 1.142695,0.28035 2.265389,0.638344 3.382959,1.005139 0.370253,0.156519 0.760516,0.256264 1.139746,0.386095 0.206296,0.07063 0.404029,0.156708 0.612899,0.220528 0.324208,0.07843 0.644226,0.167071 0.971265,0.238109 0.207361,0.07089 0.433379,0.09955 0.633909,0.190783 0.06952,0.03163 0.130467,0.0799 0.199139,0.113319 0.03456,0.01003 0.06912,0.02003 0.10369,0.03005 0,0 -3.115931,-2.443435 -3.115931,-2.443435 v 0 c -0.03005,-0.01482 -0.0601,-0.02964 -0.09014,-0.04446 -0.274283,-0.109484 -0.574305,-0.147452 -0.857049,-0.231031 -0.320014,-0.08282 -0.640744,-0.16147 -0.955162,-0.263776 -0.542819,-0.182642 -1.095851,-0.333317 -1.638543,-0.516713 -1.137695,-0.346771 -2.271194,-0.710951 -3.423513,-1.00657 -0.997069,-0.237514 -2.01517,-0.376479 -3.00288,-0.655791 -1.331061,-0.364887 -2.66236,-0.733246 -4.017717,-0.999034 -1.737529,-0.347942 -3.481437,-0.676436 -5.23989,-0.899556 -1.887006,-0.198392 -3.778758,-0.360752 -5.675257,-0.432768 -1.257938,-0.03142 -2.51538,-0.0369 -3.77227,0.03517 -1.337768,0.03512 -2.677533,0.03824 -4.012639,0.137143 -1.574499,0.152701 -3.137755,0.392345 -4.70394,0.612009 -1.079423,0.144866 -2.156912,0.310347 -3.242852,0.400133 -1.20559,0.08885 -2.41508,0.112613 -3.61832,0.230297 -0.68053,0.09952 -1.353503,0.246488 -2.035392,0.338948 -0.837814,0.127254 -1.681814,0.244418 -2.492306,0.500876 -1.068803,0.326573 -2.131939,0.676069 -3.21468,0.95404 z" />
    <path
       style="fill:#000000;fill-opacity:1;stroke:#000000;stroke-width:0.264583"
       id="path19"
       d="m 30.463844,26.626933 c -0.366143,0.124521 -0.75207,0.173763 -1.128453,0.261483 -0.323734,0.05843 -0.648801,0.09092 -0.96724,0.176869 -0.279778,0.04975 -0.550458,0.14148 -0.831871,0.181562 -0.176985,0.06022 -0.341982,0.144574 -0.522602,0.194315 -0.217438,0.04403 -0.428282,0.123733 -0.623695,0.228291 -0.234357,0.0834 -0.450003,0.205872 -0.657225,0.342318 -0.21185,0.109929 -0.353453,0.305064 -0.503215,0.48293 0,0 3.391608,2.036752 3.391608,2.036752 v 0 c 0.124042,-0.149741 0.261683,-0.282736 0.434562,-0.375785 0.202502,-0.115377 0.412853,-0.209484 0.627806,-0.2994 0.201173,-0.07018 0.405038,-0.128132 0.608301,-0.191447 0.161875,-0.06273 0.326911,-0.121817 0.496917,-0.156258 0.267488,-0.07354 0.533733,-0.151648 0.806947,-0.202371 0.325324,-0.05322 0.653513,-0.09526 0.972119,-0.182169 0.373689,-0.08984 0.754086,-0.161853 1.133866,-0.217572 z" />
    <path
       style="fill:#000000;fill-opacity:1;stroke:#000000;stroke-width:0.264583"
       id="path20"
       d="m 30.723869,18.41644 c 0.937696,-0.263951 1.884854,-0.462439 2.851338,-0.582975 0.73456,-0.085 1.474089,-0.09985 2.212689,-0.103403 0.814218,0.02196 1.620716,-0.107299 2.430886,-0.172783 0.747294,-0.05612 1.496628,-0.07317 2.245754,-0.07888 1.069607,-0.04012 2.138976,0.05428 3.199556,0.186602 1.197115,0.08928 2.353775,0.392389 3.509444,0.693757 0.796472,0.228139 1.615704,0.329846 2.439852,0.38214 0.385532,0.08149 0.189585,0.04367 0.587952,0.112902 0,0 -3.148441,-2.368765 -3.148441,-2.368765 v 0 c -0.406874,-0.06643 -0.204174,-0.03954 -0.608029,-0.08121 -0.799425,-0.06477 -1.588918,-0.19763 -2.362517,-0.413345 -1.161349,-0.300954 -2.336393,-0.531876 -3.532756,-0.644093 -1.086401,-0.118464 -2.179638,-0.193821 -3.273124,-0.176876 -0.748249,0.01699 -1.496123,0.04589 -2.241708,0.114717 -0.810686,0.06977 -1.619936,0.164774 -2.435374,0.135672 -0.740468,0.01595 -1.480743,0.05068 -2.214075,0.162207 -0.983538,0.148918 -1.947691,0.377449 -2.917825,0.594436 z" />
  </g>
</svg>
