{
    "discontinuedDate": "",
    "foodComponents": [],
    "foodAttributes": [
        {
            "id": 3253620,
            "value": 5,
            "name": "Nutrient Added"
        },
        {
            "id": 3253621,
            "value": 6,
            "name": "Nutrient Removed"
        }
    ],
    "foodPortions": [],
    "fdcId": 2663758,
    "description": "F'SH PLANT-BASED TENDER, FLAKY FILETS IN A LIGHT GOLDEN TEMPURA BATTER, F'SH",
    "publicationDate": "11/16/2023",
    "foodNutrients": [
        {
            "type": "FoodNutrient",
            "nutrient": {
                "id": 1008,
                "number": "208",
                "name": "Energy",
                "rank": 300,
                "unitName": "kcal"
            },
            "foodNutrientDerivation": {
                "id": 70,
                "code": "LCCS",
                "description": "Calculated from value per serving size measure"
            },
            "id": 33711146,
            "amount": 208.0
        },
        {
            "type": "FoodNutrient",
            "nutrient": {
                "id": 1087,
                "number": "301",
                "name": "Calcium, Ca",
                "rank": 5300,
                "unitName": "mg"
            },
            "foodNutrientDerivation": {
                "id": 70,
                "code": "LCCS",
                "description": "Calculated from value per serving size measure"
            },
            "id": 33711149,
            "amount": 42.0
        },
        {
            "type": "FoodNutrient",
            "nutrient": {
                "id": 1253,
                "number": "601",
                "name": "Cholesterol",
                "rank": 15700,
                "unitName": "mg"
            },
            "foodNutrientDerivation": {
                "id": 70,
                "code": "LCCS",
                "description": "Calculated from value per serving size measure"
            },
            "id": 33711155,
            "amount": 0.0
        },
        {
            "type": "FoodNutrient",
            "nutrient": {
                "id": 1258,
                "number": "606",
                "name": "Fatty acids, total saturated",
                "rank": 9700,
                "unitName": "g"
            },
            "foodNutrientDerivation": {
                "id": 70,
                "code": "LCCS",
                "description": "Calculated from value per serving size measure"
            },
            "id": 33711157,
            "amount": 1.04
        },
        {
            "type": "FoodNutrient",
            "nutrient": {
                "id": 2000,
                "number": "269",
                "name": "Sugars, total including NLEA",
                "rank": 1510,
                "unitName": "g"
            },
            "foodNutrientDerivation": {
                "id": 70,
                "code": "LCCS",
                "description": "Calculated from value per serving size measure"
            },
            "id": 33711147,
            "amount": 0.0
        },
        {
            "type": "FoodNutrient",
            "nutrient": {
                "id": 1005,
                "number": "205",
                "name": "Carbohydrate, by difference",
                "rank": 1110,
                "unitName": "g"
            },
            "foodNutrientDerivation": {
                "id": 70,
                "code": "LCCS",
                "description": "Calculated from value per serving size measure"
            },
            "id": 33711145,
            "amount": 12.5
        },
        {
            "type": "FoodNutrient",
            "nutrient": {
                "id": 1003,
                "number": "203",
                "name": "Protein",
                "rank": 600,
                "unitName": "g"
            },
            "foodNutrientDerivation": {
                "id": 70,
                "code": "LCCS",
                "description": "Calculated from value per serving size measure"
            },
            "id": 33711143,
            "amount": 9.38
        },
        {
            "type": "FoodNutrient",
            "nutrient": {
                "id": 1114,
                "number": "328",
                "name": "Vitamin D (D2 + D3)",
                "rank": 8700,
                "unitName": "\u00b5g"
            },
            "foodNutrientDerivation": {
                "id": 70,
                "code": "LCCS",
                "description": "Calculated from value per serving size measure"
            },
            "id": 33711153,
            "amount": 0.0
        },
        {
            "type": "FoodNutrient",
            "nutrient": {
                "id": 1293,
                "number": "646",
                "name": "Fatty acids, total polyunsaturated",
                "rank": 12900,
                "unitName": "g"
            },
            "foodNutrientDerivation": {
                "id": 70,
                "code": "LCCS",
                "description": "Calculated from value per serving size measure"
            },
            "id": 33711159,
            "amount": 3.65
        },
        {
            "type": "FoodNutrient",
            "nutrient": {
                "id": 1089,
                "number": "303",
                "name": "Iron, Fe",
                "rank": 5400,
                "unitName": "mg"
            },
            "foodNutrientDerivation": {
                "id": 70,
                "code": "LCCS",
                "description": "Calculated from value per serving size measure"
            },
            "id": 33711150,
            "amount": 1.77
        },
        {
            "type": "FoodNutrient",
            "nutrient": {
                "id": 1235,
                "number": "539",
                "name": "Sugars, added",
                "rank": 1540,
                "unitName": "g"
            },
            "foodNutrientDerivation": {
                "id": 70,
                "code": "LCCS",
                "description": "Calculated from value per serving size measure"
            },
            "id": 33711154,
            "amount": 0.0
        },
        {
            "type": "FoodNutrient",
            "nutrient": {
                "id": 1079,
                "number": "291",
                "name": "Fiber, total dietary",
                "rank": 1200,
                "unitName": "g"
            },
            "foodNutrientDerivation": {
                "id": 70,
                "code": "LCCS",
                "description": "Calculated from value per serving size measure"
            },
            "id": 33711148,
            "amount": 2.1
        },
        {
            "type": "FoodNutrient",
            "nutrient": {
                "id": 1004,
                "number": "204",
                "name": "Total lipid (fat)",
                "rank": 800,
                "unitName": "g"
            },
            "foodNutrientDerivation": {
                "id": 70,
                "code": "LCCS",
                "description": "Calculated from value per serving size measure"
            },
            "id": 33711144,
            "amount": 13.54
        },
        {
            "type": "FoodNutrient",
            "nutrient": {
                "id": 1092,
                "number": "306",
                "name": "Potassium, K",
                "rank": 5700,
                "unitName": "mg"
            },
            "foodNutrientDerivation": {
                "id": 70,
                "code": "LCCS",
                "description": "Calculated from value per serving size measure"
            },
            "id": 33711151,
            "amount": 271.0
        },
        {
            "type": "FoodNutrient",
            "nutrient": {
                "id": 1257,
                "number": "605",
                "name": "Fatty acids, total trans",
                "rank": 15400,
                "unitName": "g"
            },
            "foodNutrientDerivation": {
                "id": 70,
                "code": "LCCS",
                "description": "Calculated from value per serving size measure"
            },
            "id": 33711156,
            "amount": 0.0
        },
        {
            "type": "FoodNutrient",
            "nutrient": {
                "id": 1093,
                "number": "307",
                "name": "Sodium, Na",
                "rank": 5800,
                "unitName": "mg"
            },
            "foodNutrientDerivation": {
                "id": 70,
                "code": "LCCS",
                "description": "Calculated from value per serving size measure"
            },
            "id": 33711152,
            "amount": 375.0
        },
        {
            "type": "FoodNutrient",
            "nutrient": {
                "id": 1292,
                "number": "645",
                "name": "Fatty acids, total monounsaturated",
                "rank": 11400,
                "unitName": "g"
            },
            "foodNutrientDerivation": {
                "id": 70,
                "code": "LCCS",
                "description": "Calculated from value per serving size measure"
            },
            "id": 33711158,
            "amount": 8.33
        }
    ],
    "dataType": "Branded",
    "foodClass": "Branded",
    "shortDescription": "",
    "modifiedDate": "3/19/2021",
    "availableDate": "3/19/2021",
    "brandOwner": "Pinnacle Foods Group LLC",
    "brandName": "GARDEIN",
    "dataSource": "LI",
    "brandedFoodCategory": "Vegetarian Frozen Meats",
    "gtinUpc": "842234001664",
    "householdServingFullText": "2 Pieces",
    "ingredients": "WATER, CANOLA OIL, TEXTURED VEGETABLE PROTEIN PRODUCT (SOY PROTEIN CONCENTRATE, TITANIUM DIOXIDE [COLOR]), ENRICHED WHEAT FLOUR (WHEAT FLOUR, NIACIN, REDUCED IRON, THIAMINE MONONITRATE, RIBOFLAVIN, FOLIC ACID), 2% OR LESS OF: POTATO STARCH, TAPIOCA STARCH, METHYLCELLULOSE, SALT, YEAST EXTRACT, DEGERMINATED YELLOW CORN FLOUR, NATURAL FLAVORS, ONION POWDER, GARLIC POWDER, LEAVENING (SODIUM ACID PYROPHOSPHATE, SODIUM BICARBONATE, MONOCALCIUM PHOSPHATE), SUNFLOWER OIL, WHEAT GLUTEN, PAPRIKA, DHA ALGAL OIL, AUTOLYZED YEAST EXTRACT, SPICE, SOY FLOUR, XANTHAN GUM, SUGAR, CITRIC ACID, SOYBEAN OIL, TURMERIC.",
    "marketCountry": "United States",
    "servingSize": 96.0,
    "servingSizeUnit": "GRM",
    "packageWeight": "10.1 OZ/288 g",
    "foodUpdateLog": [
        {
            "discontinuedDate": "",
            "foodAttributes": [],
            "fdcId": 2663758,
            "description": "F'SH PLANT-BASED TENDER, FLAKY FILETS IN A LIGHT GOLDEN TEMPURA BATTER, F'SH",
            "publicationDate": "11/16/2023",
            "dataType": "Branded",
            "foodClass": "Branded",
            "shortDescription": "",
            "modifiedDate": "3/19/2021",
            "availableDate": "3/19/2021",
            "brandOwner": "Pinnacle Foods Group LLC",
            "brandName": "GARDEIN",
            "dataSource": "LI",
            "brandedFoodCategory": "Vegetarian Frozen Meats",
            "gtinUpc": "842234001664",
            "householdServingFullText": "2 Pieces",
            "ingredients": "WATER, CANOLA OIL, TEXTURED VEGETABLE PROTEIN PRODUCT (SOY PROTEIN CONCENTRATE, TITANIUM DIOXIDE [COLOR]), ENRICHED WHEAT FLOUR (WHEAT FLOUR, NIACIN, REDUCED IRON, THIAMINE MONONITRATE, RIBOFLAVIN, FOLIC ACID), 2% OR LESS OF: POTATO STARCH, TAPIOCA STARCH, METHYLCELLULOSE, SALT, YEAST EXTRACT, DEGERMINATED YELLOW CORN FLOUR, NATURAL FLAVORS, ONION POWDER, GARLIC POWDER, LEAVENING (SODIUM ACID PYROPHOSPHATE, SODIUM BICARBONATE, MONOCALCIUM PHOSPHATE), SUNFLOWER OIL, WHEAT GLUTEN, PAPRIKA, DHA ALGAL OIL, AUTOLYZED YEAST EXTRACT, SPICE, SOY FLOUR, XANTHAN GUM, SUGAR, CITRIC ACID, SOYBEAN OIL, TURMERIC.",
            "marketCountry": "United States",
            "servingSize": 96.0,
            "servingSizeUnit": "GRM",
            "packageWeight": "10.1 OZ/288 g",
            "foodVersions": [
                {
                    "discontinuedDate": "",
                    "foodComponents": [],
                    "foodAttributes": [],
                    "foodPortions": [],
                    "modifiedDate": "3/11/2018",
                    "availableDate": "3/11/2018",
                    "brandOwner": "Pinnacle Foods Group LLC",
                    "dataSource": "LI",
                    "gpcCategoryGroup": "Vegetarian Frozen Meats",
                    "gtinUpc": "842234001664",
                    "householdServingFullText": "2 PIECES",
                    "ingredients": "GARDEIN: WATER, SOY PROTEIN CONCENTRATE*, EXPELLER PRESSED CANOLA OIL*, POTATO STARCH, MODIFIED VEGETABLE GUM, SOY PROTEIN ISOLATE*, VITAL WHEAT GLUTEN*, SEA SALT, NATURAL FLAVORS (FROM PLANT SOURCES), YEAST EXTRACT, ORGANIC CANE SUGAR, CITRIC ACID, ALGAL OIL (PLANT SOURCE OF OMEGA 3 DHA AND EPA), ONION, POWDER, PEA PROTEIN, CARROT FIBER, COLOR ADDED, PAPRIKA, ROSEMARY AND TURMERIC EXTRACTS. BREADING: WHEAT FLOUR*, MODIFIED CORN STARCH, TAPIOCA STARCH, YELLOW CORN FLOUR, ONION POWDER, SALT, GARLIC POWDER, WHEAT GLUTEN*, BAKING POWDER, CANOLA OIL, SOY FLOUR, SPICES, SUGAR, PAPRIKA, CITRIC ACID, TURMERIC, XANTHAN GUM.",
                    "marketCountry": "United States",
                    "servingSize": 96.0,
                    "servingSizeUnit": "g",
                    "fdcId": 409432,
                    "description": "GARDEIN, GOLDEN FISHLESS FILETS",
                    "publicationDate": "4/1/2019",
                    "workingFoodId": 45122286,
                    "dataType": "Branded",
                    "foodClass": "Branded"
                },
                {
                    "discontinuedDate": "",
                    "foodComponents": [],
                    "foodAttributes": [],
                    "foodPortions": [],
                    "modifiedDate": "3/19/2021",
                    "availableDate": "3/19/2021",
                    "brandOwner": "Pinnacle Foods Group LLC",
                    "dataSource": "LI",
                    "gpcCategoryGroup": "Vegetarian Frozen Meats",
                    "gtinUpc": "842234001664",
                    "ingredients": "WATER, CANOLA OIL, TEXTURED VEGETABLE PROTEIN PRODUCT (SOY PROTEIN CONCENTRATE, TITANIUM DIOXIDE [COLOR]), ENRICHED WHEAT FLOUR (WHEAT FLOUR, NIACIN, REDUCED IRON, THIAMINE MONONITRATE, RIBOFLAVIN, FOLIC ACID), 2% OR LESS OF: POTATO STARCH, TAPIOCA STARCH, METHYLCELLULOSE, SALT, YEAST EXTRACT, DEGERMINATED YELLOW CORN FLOUR, NATURAL FLAVORS, ONION POWDER, GARLIC POWDER, LEAVENING (SODIUM ACID PYROPHOSPHATE, SODIUM BICARBONATE, MONOCALCIUM PHOSPHATE), SUNFLOWER OIL, WHEAT GLUTEN, PAPRIKA, DHA ALGAL OIL, AUTOLYZED YEAST EXTRACT, SPICE, SOY FLOUR, XANTHAN GUM, SUGAR, CITRIC ACID, SOYBEAN OIL, TURMERIC.",
                    "marketCountry": "United States",
                    "servingSize": 96.0,
                    "servingSizeUnit": "g",
                    "fdcId": 1870939,
                    "description": "F'SH PLANT-BASED TENDER, FLAKY FILETS IN A LIGHT GOLDEN TEMPURA BATTER, F'SH",
                    "publicationDate": "7/29/2021",
                    "dataType": "Branded",
                    "foodClass": "Branded"
                },
                {
                    "discontinuedDate": "",
                    "foodComponents": [],
                    "foodAttributes": [],
                    "foodPortions": [],
                    "modifiedDate": "12/29/2020",
                    "availableDate": "12/29/2020",
                    "brandOwner": "Pinnacle Foods Group LLC",
                    "dataSource": "LI",
                    "gpcCategoryGroup": "Vegetarian Frozen Meats",
                    "gtinUpc": "842234001664",
                    "ingredients": "WATER, CANOLA OIL, TEXTURED VEGETABLE PROTEIN PRODUCT (SOY PROTEIN CONCENTRATE, COLOR ADDED), ENRICHED FLOUR (WHEAT FLOUR, NIACIN, REDUCED IRON, THIAMINE MONONITRATE, RIBOFLAVIN, FOLIC ACID), TAPIOCA STARCH, POTATO STARCH, METHYLCELLULOSE, YEAST EXTRACT, DEGERMINATED YELLOW CORN FLOUR, NATURAL FLAVORS, SEA SALT, SALT, WHEAT GLUTEN, ONION POWDER, GARLIC POWDER, LEAVENING (SODIUM ACID PYROPHOSPHATE, SODIUM BICARBONATE, MONOCALCIUM PHOSPHATE), PAPRIKA, SOY FLOUR, DHA ALGAL OIL, AUTOLYZED YEAST EXTRACT, SPICE, SUGAR, CITRIC ACID, XANTHAN GUM, SPICES, TURMERIC, TURMERIC EXTRACTIVES.",
                    "marketCountry": "United States",
                    "servingSize": 96.0,
                    "servingSizeUnit": "g",
                    "fdcId": 1218020,
                    "description": "GOLDEN FISHLESS FILETS, GOLDEN",
                    "publicationDate": "2/26/2021",
                    "dataType": "Branded",
                    "foodClass": "Branded"
                },
                {
                    "discontinuedDate": "",
                    "foodComponents": [],
                    "foodAttributes": [],
                    "foodPortions": [],
                    "modifiedDate": "4/11/2020",
                    "availableDate": "4/11/2020",
                    "brandOwner": "Pinnacle Foods Group LLC",
                    "dataSource": "LI",
                    "gpcCategoryGroup": "Vegetarian Frozen Meats",
                    "gtinUpc": "842234001664",
                    "householdServingFullText": "2 PIECES",
                    "ingredients": "GARDEIN: WATER, SOY PROTEIN CONCENTRATE*, EXPELLER PRESSED CANOLA OIL*, POTATO STARCH, MODIFIED VEGETABLE GUM, SOY PROTEIN ISOLATE*, VITAL WHEAT GLUTEN*, SEA SALT, NATURAL FLAVORS (FROM PLANT SOURCES), YEAST EXTRACT, ORGANIC CANE SUGAR, CITRIC ACID, ALGAL OIL (PLANT SOURCE OF OMEGA 3 DHA AND EPA), ONION POWDER, PEA PROTEIN, CARROT FIBER, COLOR ADDED, PAPRIKA, ROSEMARY AND TURMERIC EXTRACTS. BREADING: WHEAT FLOUR*, MODIFIED CORN STARCH, TAPIOCA STARCH, YELLOW CORN FLOUR, ONION POWDER, SALT, GARLIC POWDER, WHEAT GLUTEN*, BAKING POWDER, CANOLA OIL, SOY FLOUR, SPICES, SUGAR, PAPRIKA, CITRIC ACID, TURMERIC, XANTHAN GUM.",
                    "marketCountry": "United States",
                    "servingSize": 96.0,
                    "servingSizeUnit": "g",
                    "fdcId": 829120,
                    "description": "GARDEIN, GOLDEN FISHLESS FILETS",
                    "publicationDate": "5/28/2020",
                    "dataType": "Branded",
                    "foodClass": "Branded"
                },
                {
                    "discontinuedDate": "",
                    "foodComponents": [],
                    "foodAttributes": [],
                    "foodPortions": [],
                    "modifiedDate": "4/11/2020",
                    "availableDate": "4/11/2020",
                    "brandOwner": "Pinnacle Foods Group LLC",
                    "dataSource": "LI",
                    "gpcCategoryGroup": "Vegetarian Frozen Meats",
                    "gtinUpc": "842234001664",
                    "householdServingFullText": "2 PIECES",
                    "ingredients": "GARDEIN: WATER, SOY PROTEIN CONCENTRATE*, EXPELLER PRESSED CANOLA OIL*, POTATO STARCH, MODIFIED VEGETABLE GUM, SOY PROTEIN ISOLATE*, VITAL WHEAT GLUTEN*, SEA SALT, NATURAL FLAVORS (FROM PLANT SOURCES), YEAST EXTRACT, ORGANIC CANE SUGAR, CITRIC ACID, ALGAL OIL (PLANT SOURCE OF OMEGA 3 DHA AND EPA), ONION POWDER, PEA PROTEIN, CARROT FIBER, COLOR ADDED, PAPRIKA, ROSEMARY AND TURMERIC EXTRACTS. BREADING: WHEAT FLOUR*, MODIFIED CORN STARCH, TAPIOCA STARCH, YELLOW CORN FLOUR, ONION POWDER, SALT, GARLIC POWDER, WHEAT GLUTEN*, BAKING POWDER, CANOLA OIL, SOY FLOUR, SPICES, SUGAR, PAPRIKA, CITRIC ACID, TURMERIC, XANTHAN GUM.",
                    "marketCountry": "United States",
                    "servingSize": 96.0,
                    "servingSizeUnit": "g",
                    "fdcId": 961733,
                    "description": "GARDEIN, GOLDEN FISHLESS FILETS",
                    "publicationDate": "6/26/2020",
                    "dataType": "Branded",
                    "foodClass": "Branded"
                },
                {
                    "discontinuedDate": "",
                    "foodComponents": [],
                    "foodAttributes": [],
                    "foodPortions": [],
                    "modifiedDate": "3/19/2021",
                    "availableDate": "3/19/2021",
                    "brandOwner": "Pinnacle Foods Group LLC",
                    "dataSource": "LI",
                    "gpcCategoryGroup": "Vegetarian Frozen Meats",
                    "gtinUpc": "842234001664",
                    "householdServingFullText": "2 Pieces",
                    "ingredients": "WATER, CANOLA OIL, TEXTURED VEGETABLE PROTEIN PRODUCT (SOY PROTEIN CONCENTRATE, TITANIUM DIOXIDE [COLOR]), ENRICHED WHEAT FLOUR (WHEAT FLOUR, NIACIN, REDUCED IRON, THIAMINE MONONITRATE, RIBOFLAVIN, FOLIC ACID), 2% OR LESS OF: POTATO STARCH, TAPIOCA STARCH, METHYLCELLULOSE, SALT, YEAST EXTRACT, DEGERMINATED YELLOW CORN FLOUR, NATURAL FLAVORS, ONION POWDER, GARLIC POWDER, LEAVENING (SODIUM ACID PYROPHOSPHATE, SODIUM BICARBONATE, MONOCALCIUM PHOSPHATE), SUNFLOWER OIL, WHEAT GLUTEN, PAPRIKA, DHA ALGAL OIL, AUTOLYZED YEAST EXTRACT, SPICE, SOY FLOUR, XANTHAN GUM, SUGAR, CITRIC ACID, SOYBEAN OIL, TURMERIC.",
                    "marketCountry": "United States",
                    "servingSize": 96.0,
                    "servingSizeUnit": "g",
                    "fdcId": 2383579,
                    "description": "F'SH PLANT-BASED TENDER, FLAKY FILETS IN A LIGHT GOLDEN TEMPURA BATTER, F'SH",
                    "publicationDate": "12/22/2022",
                    "dataType": "Branded",
                    "foodClass": "Branded"
                },
                {
                    "discontinuedDate": "",
                    "foodComponents": [],
                    "foodAttributes": [],
                    "foodPortions": [],
                    "modifiedDate": "12/17/2020",
                    "availableDate": "12/17/2020",
                    "brandOwner": "Pinnacle Foods Group LLC",
                    "dataSource": "LI",
                    "gpcCategoryGroup": "Vegetarian Frozen Meats",
                    "gtinUpc": "842234001664",
                    "ingredients": "WATER, CANOLA OIL, TEXTURED VEGETABLE PROTEIN PRODUCT (SOY PROTEIN CONCENTRATE, COLOR ADDED), ENRICHED FLOUR (WHEAT FLOUR, NIACIN, REDUCED IRON, THIAMINE MONONITRATE, RIBOFLAVIN, FOLIC ACID), TAPIOCA STARCH, POTATO STARCH, METHYLCELLULOSE, YEAST EXTRACT, DEGERMINATED YELLOW CORN FLOUR, NATURAL FLAVORS, SEA SALT, SALT, WHEAT GLUTEN, ONION POWDER, GARLIC POWDER, LEAVENING (SODIUM ACID PYROPHOSPHATE, SODIUM BICARBONATE, MONOCALCIUM PHOSPHATE), PAPRIKA, SOY FLOUR, DHA ALGAL OIL, AUTOLYZED YEAST EXTRACT, SPICE, SUGAR, CITRIC ACID, XANTHAN GUM, SPICES, TURMERIC, TURMERIC EXTRACTIVES.",
                    "marketCountry": "United States",
                    "servingSize": 96.0,
                    "servingSizeUnit": "g",
                    "fdcId": 1155923,
                    "description": "GOLDEN FISHLESS FILETS, GOLDEN",
                    "publicationDate": "1/28/2021",
                    "dataType": "Branded",
                    "foodClass": "Branded"
                },
                {
                    "discontinuedDate": "",
                    "foodComponents": [],
                    "foodAttributes": [],
                    "foodPortions": [],
                    "modifiedDate": "2/25/2021",
                    "availableDate": "2/25/2021",
                    "brandOwner": "Pinnacle Foods Group LLC",
                    "dataSource": "LI",
                    "gpcCategoryGroup": "Vegetarian Frozen Meats",
                    "gtinUpc": "842234001664",
                    "ingredients": "WATER, CANOLA OIL, TEXTURED VEGETABLE PROTEIN PRODUCT (SOY PROTEIN CONCENTRATE, TITANIUM DIOXIDE [COLOR]), ENRICHED WHEAT FLOUR (WHEAT FLOUR, NIACIN, REDUCED IRON, THIAMINE MONONITRATE, RIBOFLAVIN, FOLIC ACID), 2% OR LESS OF: POTATO STARCH, TAPIOCA STARCH, METHYLCELLULOSE, SALT, YEAST EXTRACT, DEGERMINATED YELLOW CORN FLOUR, NATURAL FLAVORS, ONION POWDER, GARLIC POWDER, LEAVENING (SODIUM ACID PYROPHOSPHATE, SODIUM BICARBONATE, MONOCALCIUM PHOSPHATE), SUNFLOWER OIL, WHEAT GLUTEN, PAPRIKA, DHA ALGAL OIL, AUTOLYZED YEAST EXTRACT, SPICE, SOY FLOUR, XANTHAN GUM, SUGAR, CITRIC ACID, SOYBEAN OIL, TURMERIC.",
                    "marketCountry": "United States",
                    "servingSize": 96.0,
                    "servingSizeUnit": "g",
                    "fdcId": 1510080,
                    "description": "F'SH PLANT-BASED TENDER, FLAKY FILETS IN A LIGHT GOLDEN TEMPURA BATTER, F'SH",
                    "publicationDate": "3/19/2021",
                    "dataType": "Branded",
                    "foodClass": "Branded"
                }
            ]
        },
        {
            "discontinuedDate": "",
            "foodAttributes": [],
            "fdcId": 2383579,
            "description": "F'SH PLANT-BASED TENDER, FLAKY FILETS IN A LIGHT GOLDEN TEMPURA BATTER, F'SH",
            "publicationDate": "12/22/2022",
            "dataType": "Branded",
            "foodClass": "Branded",
            "shortDescription": "",
            "modifiedDate": "3/19/2021",
            "availableDate": "3/19/2021",
            "brandOwner": "Pinnacle Foods Group LLC",
            "brandName": "GARDEIN",
            "dataSource": "LI",
            "brandedFoodCategory": "Vegetarian Frozen Meats",
            "gtinUpc": "842234001664",
            "householdServingFullText": "2 Pieces",
            "ingredients": "WATER, CANOLA OIL, TEXTURED VEGETABLE PROTEIN PRODUCT (SOY PROTEIN CONCENTRATE, TITANIUM DIOXIDE [COLOR]), ENRICHED WHEAT FLOUR (WHEAT FLOUR, NIACIN, REDUCED IRON, THIAMINE MONONITRATE, RIBOFLAVIN, FOLIC ACID), 2% OR LESS OF: POTATO STARCH, TAPIOCA STARCH, METHYLCELLULOSE, SALT, YEAST EXTRACT, DEGERMINATED YELLOW CORN FLOUR, NATURAL FLAVORS, ONION POWDER, GARLIC POWDER, LEAVENING (SODIUM ACID PYROPHOSPHATE, SODIUM BICARBONATE, MONOCALCIUM PHOSPHATE), SUNFLOWER OIL, WHEAT GLUTEN, PAPRIKA, DHA ALGAL OIL, AUTOLYZED YEAST EXTRACT, SPICE, SOY FLOUR, XANTHAN GUM, SUGAR, CITRIC ACID, SOYBEAN OIL, TURMERIC.",
            "marketCountry": "United States",
            "servingSize": 96.0,
            "servingSizeUnit": "g",
            "packageWeight": "10.1 OZ/288 g"
        },
        {
            "discontinuedDate": "",
            "foodAttributes": [],
            "fdcId": 1870939,
            "description": "F'SH PLANT-BASED TENDER, FLAKY FILETS IN A LIGHT GOLDEN TEMPURA BATTER, F'SH",
            "publicationDate": "7/29/2021",
            "dataType": "Branded",
            "foodClass": "Branded",
            "modifiedDate": "3/19/2021",
            "availableDate": "3/19/2021",
            "brandOwner": "Pinnacle Foods Group LLC",
            "brandName": "GARDEIN",
            "dataSource": "LI",
            "brandedFoodCategory": "Vegetarian Frozen Meats",
            "gtinUpc": "842234001664",
            "ingredients": "WATER, CANOLA OIL, TEXTURED VEGETABLE PROTEIN PRODUCT (SOY PROTEIN CONCENTRATE, TITANIUM DIOXIDE [COLOR]), ENRICHED WHEAT FLOUR (WHEAT FLOUR, NIACIN, REDUCED IRON, THIAMINE MONONITRATE, RIBOFLAVIN, FOLIC ACID), 2% OR LESS OF: POTATO STARCH, TAPIOCA STARCH, METHYLCELLULOSE, SALT, YEAST EXTRACT, DEGERMINATED YELLOW CORN FLOUR, NATURAL FLAVORS, ONION POWDER, GARLIC POWDER, LEAVENING (SODIUM ACID PYROPHOSPHATE, SODIUM BICARBONATE, MONOCALCIUM PHOSPHATE), SUNFLOWER OIL, WHEAT GLUTEN, PAPRIKA, DHA ALGAL OIL, AUTOLYZED YEAST EXTRACT, SPICE, SOY FLOUR, XANTHAN GUM, SUGAR, CITRIC ACID, SOYBEAN OIL, TURMERIC.",
            "marketCountry": "United States",
            "servingSize": 96.0,
            "servingSizeUnit": "g",
            "packageWeight": "10.1 OZ/288 g"
        },
        {
            "discontinuedDate": "",
            "foodAttributes": [],
            "fdcId": 1510080,
            "description": "F'SH PLANT-BASED TENDER, FLAKY FILETS IN A LIGHT GOLDEN TEMPURA BATTER, F'SH",
            "publicationDate": "3/19/2021",
            "dataType": "Branded",
            "foodClass": "Branded",
            "modifiedDate": "2/25/2021",
            "availableDate": "2/25/2021",
            "brandOwner": "Pinnacle Foods Group LLC",
            "brandName": "GARDEIN",
            "dataSource": "LI",
            "brandedFoodCategory": "Vegetarian Frozen Meats",
            "gtinUpc": "842234001664",
            "ingredients": "WATER, CANOLA OIL, TEXTURED VEGETABLE PROTEIN PRODUCT (SOY PROTEIN CONCENTRATE, TITANIUM DIOXIDE [COLOR]), ENRICHED WHEAT FLOUR (WHEAT FLOUR, NIACIN, REDUCED IRON, THIAMINE MONONITRATE, RIBOFLAVIN, FOLIC ACID), 2% OR LESS OF: POTATO STARCH, TAPIOCA STARCH, METHYLCELLULOSE, SALT, YEAST EXTRACT, DEGERMINATED YELLOW CORN FLOUR, NATURAL FLAVORS, ONION POWDER, GARLIC POWDER, LEAVENING (SODIUM ACID PYROPHOSPHATE, SODIUM BICARBONATE, MONOCALCIUM PHOSPHATE), SUNFLOWER OIL, WHEAT GLUTEN, PAPRIKA, DHA ALGAL OIL, AUTOLYZED YEAST EXTRACT, SPICE, SOY FLOUR, XANTHAN GUM, SUGAR, CITRIC ACID, SOYBEAN OIL, TURMERIC.",
            "marketCountry": "United States",
            "servingSize": 96.0,
            "servingSizeUnit": "g"
        },
        {
            "discontinuedDate": "",
            "foodAttributes": [],
            "fdcId": 1218020,
            "description": "GOLDEN FISHLESS FILETS, GOLDEN",
            "publicationDate": "2/26/2021",
            "dataType": "Branded",
            "foodClass": "Branded",
            "modifiedDate": "12/29/2020",
            "availableDate": "12/29/2020",
            "brandOwner": "Pinnacle Foods Group LLC",
            "brandName": "GARDEIN",
            "subbrandName": "",
            "dataSource": "LI",
            "brandedFoodCategory": "Vegetarian Frozen Meats",
            "gtinUpc": "842234001664",
            "ingredients": "WATER, CANOLA OIL, TEXTURED VEGETABLE PROTEIN PRODUCT (SOY PROTEIN CONCENTRATE, COLOR ADDED), ENRICHED FLOUR (WHEAT FLOUR, NIACIN, REDUCED IRON, THIAMINE MONONITRATE, RIBOFLAVIN, FOLIC ACID), TAPIOCA STARCH, POTATO STARCH, METHYLCELLULOSE, YEAST EXTRACT, DEGERMINATED YELLOW CORN FLOUR, NATURAL FLAVORS, SEA SALT, SALT, WHEAT GLUTEN, ONION POWDER, GARLIC POWDER, LEAVENING (SODIUM ACID PYROPHOSPHATE, SODIUM BICARBONATE, MONOCALCIUM PHOSPHATE), PAPRIKA, SOY FLOUR, DHA ALGAL OIL, AUTOLYZED YEAST EXTRACT, SPICE, SUGAR, CITRIC ACID, XANTHAN GUM, SPICES, TURMERIC, TURMERIC EXTRACTIVES.",
            "marketCountry": "United States",
            "servingSize": 96.0,
            "servingSizeUnit": "g",
            "packageWeight": "",
            "notaSignificantSourceOf": ""
        },
        {
            "discontinuedDate": "",
            "foodAttributes": [],
            "fdcId": 1155923,
            "description": "GOLDEN FISHLESS FILETS, GOLDEN",
            "publicationDate": "1/28/2021",
            "dataType": "Branded",
            "foodClass": "Branded",
            "modifiedDate": "12/17/2020",
            "availableDate": "12/17/2020",
            "brandOwner": "Pinnacle Foods Group LLC",
            "dataSource": "LI",
            "brandedFoodCategory": "Vegetarian Frozen Meats",
            "gtinUpc": "842234001664",
            "ingredients": "WATER, CANOLA OIL, TEXTURED VEGETABLE PROTEIN PRODUCT (SOY PROTEIN CONCENTRATE, COLOR ADDED), ENRICHED FLOUR (WHEAT FLOUR, NIACIN, REDUCED IRON, THIAMINE MONONITRATE, RIBOFLAVIN, FOLIC ACID), TAPIOCA STARCH, POTATO STARCH, METHYLCELLULOSE, YEAST EXTRACT, DEGERMINATED YELLOW CORN FLOUR, NATURAL FLAVORS, SEA SALT, SALT, WHEAT GLUTEN, ONION POWDER, GARLIC POWDER, LEAVENING (SODIUM ACID PYROPHOSPHATE, SODIUM BICARBONATE, MONOCALCIUM PHOSPHATE), PAPRIKA, SOY FLOUR, DHA ALGAL OIL, AUTOLYZED YEAST EXTRACT, SPICE, SUGAR, CITRIC ACID, XANTHAN GUM, SPICES, TURMERIC, TURMERIC EXTRACTIVES.",
            "marketCountry": "United States",
            "servingSize": 96.0,
            "servingSizeUnit": "g"
        },
        {
            "discontinuedDate": "",
            "foodAttributes": [],
            "fdcId": 961733,
            "description": "GARDEIN, GOLDEN FISHLESS FILETS",
            "publicationDate": "6/26/2020",
            "dataType": "Branded",
            "foodClass": "Branded",
            "modifiedDate": "4/11/2020",
            "availableDate": "4/11/2020",
            "brandOwner": "Pinnacle Foods Group LLC",
            "dataSource": "LI",
            "brandedFoodCategory": "Vegetarian Frozen Meats",
            "gtinUpc": "842234001664",
            "householdServingFullText": "2 PIECES",
            "ingredients": "GARDEIN: WATER, SOY PROTEIN CONCENTRATE*, EXPELLER PRESSED CANOLA OIL*, POTATO STARCH, MODIFIED VEGETABLE GUM, SOY PROTEIN ISOLATE*, VITAL WHEAT GLUTEN*, SEA SALT, NATURAL FLAVORS (FROM PLANT SOURCES), YEAST EXTRACT, ORGANIC CANE SUGAR, CITRIC ACID, ALGAL OIL (PLANT SOURCE OF OMEGA 3 DHA AND EPA), ONION POWDER, PEA PROTEIN, CARROT FIBER, COLOR ADDED, PAPRIKA, ROSEMARY AND TURMERIC EXTRACTS. BREADING: WHEAT FLOUR*, MODIFIED CORN STARCH, TAPIOCA STARCH, YELLOW CORN FLOUR, ONION POWDER, SALT, GARLIC POWDER, WHEAT GLUTEN*, BAKING POWDER, CANOLA OIL, SOY FLOUR, SPICES, SUGAR, PAPRIKA, CITRIC ACID, TURMERIC, XANTHAN GUM.",
            "marketCountry": "United States",
            "servingSize": 96.0,
            "servingSizeUnit": "g"
        },
        {
            "discontinuedDate": "",
            "foodAttributes": [],
            "fdcId": 829120,
            "description": "GARDEIN, GOLDEN FISHLESS FILETS",
            "publicationDate": "5/28/2020",
            "dataType": "Branded",
            "foodClass": "Branded",
            "modifiedDate": "4/11/2020",
            "availableDate": "4/11/2020",
            "brandOwner": "Pinnacle Foods Group LLC",
            "dataSource": "LI",
            "brandedFoodCategory": "Vegetarian Frozen Meats",
            "gtinUpc": "842234001664",
            "householdServingFullText": "2 PIECES",
            "ingredients": "GARDEIN: WATER, SOY PROTEIN CONCENTRATE*, EXPELLER PRESSED CANOLA OIL*, POTATO STARCH, MODIFIED VEGETABLE GUM, SOY PROTEIN ISOLATE*, VITAL WHEAT GLUTEN*, SEA SALT, NATURAL FLAVORS (FROM PLANT SOURCES), YEAST EXTRACT, ORGANIC CANE SUGAR, CITRIC ACID, ALGAL OIL (PLANT SOURCE OF OMEGA 3 DHA AND EPA), ONION POWDER, PEA PROTEIN, CARROT FIBER, COLOR ADDED, PAPRIKA, ROSEMARY AND TURMERIC EXTRACTS. BREADING: WHEAT FLOUR*, MODIFIED CORN STARCH, TAPIOCA STARCH, YELLOW CORN FLOUR, ONION POWDER, SALT, GARLIC POWDER, WHEAT GLUTEN*, BAKING POWDER, CANOLA OIL, SOY FLOUR, SPICES, SUGAR, PAPRIKA, CITRIC ACID, TURMERIC, XANTHAN GUM.",
            "marketCountry": "United States",
            "servingSize": 96.0,
            "servingSizeUnit": "g"
        },
        {
            "discontinuedDate": "",
            "foodAttributes": [],
            "modifiedDate": "3/11/2018",
            "availableDate": "3/11/2018",
            "brandOwner": "Pinnacle Foods Group LLC",
            "dataSource": "LI",
            "gpcCategoryGroup": "Vegetarian Frozen Meats",
            "gtinUpc": "842234001664",
            "householdServingFullText": "2 PIECES",
            "ingredients": "GARDEIN: WATER, SOY PROTEIN CONCENTRATE*, EXPELLER PRESSED CANOLA OIL*, POTATO STARCH, MODIFIED VEGETABLE GUM, SOY PROTEIN ISOLATE*, VITAL WHEAT GLUTEN*, SEA SALT, NATURAL FLAVORS (FROM PLANT SOURCES), YEAST EXTRACT, ORGANIC CANE SUGAR, CITRIC ACID, ALGAL OIL (PLANT SOURCE OF OMEGA 3 DHA AND EPA), ONION, POWDER, PEA PROTEIN, CARROT FIBER, COLOR ADDED, PAPRIKA, ROSEMARY AND TURMERIC EXTRACTS. BREADING: WHEAT FLOUR*, MODIFIED CORN STARCH, TAPIOCA STARCH, YELLOW CORN FLOUR, ONION POWDER, SALT, GARLIC POWDER, WHEAT GLUTEN*, BAKING POWDER, CANOLA OIL, SOY FLOUR, SPICES, SUGAR, PAPRIKA, CITRIC ACID, TURMERIC, XANTHAN GUM.",
            "marketCountry": "United States",
            "servingSize": 96.0,
            "servingSizeUnit": "g",
            "fdcId": 409432,
            "description": "GARDEIN, GOLDEN FISHLESS FILETS",
            "publicationDate": "4/1/2019",
            "workingFoodId": 45122286,
            "dataType": "Branded",
            "foodClass": "Branded"
        }
    ],
    "labelNutrients": {
        "fat": {
            "value": 13.0
        },
        "saturatedFat": {
            "value": 0.998
        },
        "transFat": {
            "value": 0.0
        },
        "cholesterol": {
            "value": 0.0
        },
        "sodium": {
            "value": 360
        },
        "carbohydrates": {
            "value": 12.0
        },
        "fiber": {
            "value": 2.02
        },
        "sugars": {
            "value": 0.0
        },
        "protein": {
            "value": 9.0
        },
        "vitaminD": {
            "value": 0.0
        },
        "calcium": {
            "value": 40.3
        },
        "iron": {
            "value": 1.7
        },
        "potassium": {
            "value": 260
        },
        "addedSugar": {
            "value": 0.0
        },
        "calories": {
            "value": 200
        }
    }
}