{
    "discontinuedDate": "",
    "foodComponents": [],
    "foodAttributes": [],
    "foodPortions": [],
    "fdcId": 2642759,
    "description": "UP BEET COLD PRESSED JUICE, UP BEET",
    "publicationDate": "9/14/2023",
    "foodNutrients": [
        {
            "type": "FoodNutrient",
            "nutrient": {
                "id": 1258,
                "number": "606",
                "name": "Fatty acids, total saturated",
                "rank": 9700,
                "unitName": "g"
            },
            "foodNutrientDerivation": {
                "id": 70,
                "code": "LCCS",
                "description": "Calculated from value per serving size measure"
            },
            "id": 33005022,
            "amount": 0.0
        },
        {
            "type": "FoodNutrient",
            "nutrient": {
                "id": 1092,
                "number": "306",
                "name": "Potassium, K",
                "rank": 5700,
                "unitName": "mg"
            },
            "foodNutrientDerivation": {
                "id": 70,
                "code": "LCCS",
                "description": "Calculated from value per serving size measure"
            },
            "id": 33005016,
            "amount": 247.0
        },
        {
            "type": "FoodNutrient",
            "nutrient": {
                "id": 1008,
                "number": "208",
                "name": "Energy",
                "rank": 300,
                "unitName": "kcal"
            },
            "foodNutrientDerivation": {
                "id": 70,
                "code": "LCCS",
                "description": "Calculated from value per serving size measure"
            },
            "id": 33005011,
            "amount": 37.0
        },
        {
            "type": "FoodNutrient",
            "nutrient": {
                "id": 1257,
                "number": "605",
                "name": "Fatty acids, total trans",
                "rank": 15400,
                "unitName": "g"
            },
            "foodNutrientDerivation": {
                "id": 70,
                "code": "LCCS",
                "description": "Calculated from value per serving size measure"
            },
            "id": 33005021,
            "amount": 0.0
        },
        {
            "type": "FoodNutrient",
            "nutrient": {
                "id": 1253,
                "number": "601",
                "name": "Cholesterol",
                "rank": 15700,
                "unitName": "mg"
            },
            "foodNutrientDerivation": {
                "id": 70,
                "code": "LCCS",
                "description": "Calculated from value per serving size measure"
            },
            "id": 33005020,
            "amount": 0.0
        },
        {
            "type": "FoodNutrient",
            "nutrient": {
                "id": 2000,
                "number": "269",
                "name": "Sugars, total including NLEA",
                "rank": 1510,
                "unitName": "g"
            },
            "foodNutrientDerivation": {
                "id": 70,
                "code": "LCCS",
                "description": "Calculated from value per serving size measure"
            },
            "id": 33005012,
            "amount": 7.32
        },
        {
            "type": "FoodNutrient",
            "nutrient": {
                "id": 1005,
                "number": "205",
                "name": "Carbohydrate, by difference",
                "rank": 1110,
                "unitName": "g"
            },
            "foodNutrientDerivation": {
                "id": 70,
                "code": "LCCS",
                "description": "Calculated from value per serving size measure"
            },
            "id": 33005010,
            "amount": 8.45
        },
        {
            "type": "FoodNutrient",
            "nutrient": {
                "id": 1114,
                "number": "328",
                "name": "Vitamin D (D2 + D3)",
                "rank": 8700,
                "unitName": "\u00b5g"
            },
            "foodNutrientDerivation": {
                "id": 70,
                "code": "LCCS",
                "description": "Calculated from value per serving size measure"
            },
            "id": 33005018,
            "amount": 0.0
        },
        {
            "type": "FoodNutrient",
            "nutrient": {
                "id": 1093,
                "number": "307",
                "name": "Sodium, Na",
                "rank": 5800,
                "unitName": "mg"
            },
            "foodNutrientDerivation": {
                "id": 70,
                "code": "LCCS",
                "description": "Calculated from value per serving size measure"
            },
            "id": 33005017,
            "amount": 21.0
        },
        {
            "type": "FoodNutrient",
            "nutrient": {
                "id": 1087,
                "number": "301",
                "name": "Calcium, Ca",
                "rank": 5300,
                "unitName": "mg"
            },
            "foodNutrientDerivation": {
                "id": 70,
                "code": "LCCS",
                "description": "Calculated from value per serving size measure"
            },
            "id": 33005014,
            "amount": 8.0
        },
        {
            "type": "FoodNutrient",
            "nutrient": {
                "id": 1235,
                "number": "539",
                "name": "Sugars, added",
                "rank": 1540,
                "unitName": "g"
            },
            "foodNutrientDerivation": {
                "id": 70,
                "code": "LCCS",
                "description": "Calculated from value per serving size measure"
            },
            "id": 33005019,
            "amount": 0.0
        },
        {
            "type": "FoodNutrient",
            "nutrient": {
                "id": 1003,
                "number": "203",
                "name": "Protein",
                "rank": 600,
                "unitName": "g"
            },
            "foodNutrientDerivation": {
                "id": 70,
                "code": "LCCS",
                "description": "Calculated from value per serving size measure"
            },
            "id": 33005008,
            "amount": 0.56
        },
        {
            "type": "FoodNutrient",
            "nutrient": {
                "id": 1089,
                "number": "303",
                "name": "Iron, Fe",
                "rank": 5400,
                "unitName": "mg"
            },
            "foodNutrientDerivation": {
                "id": 70,
                "code": "LCCS",
                "description": "Calculated from value per serving size measure"
            },
            "id": 33005015,
            "amount": 0.56
        },
        {
            "type": "FoodNutrient",
            "nutrient": {
                "id": 1079,
                "number": "291",
                "name": "Fiber, total dietary",
                "rank": 1200,
                "unitName": "g"
            },
            "foodNutrientDerivation": {
                "id": 73,
                "code": "LCSL",
                "description": "Calculated from a less than value per serving size measure"
            },
            "id": 33005013,
            "amount": 0.3
        },
        {
            "type": "FoodNutrient",
            "nutrient": {
                "id": 1004,
                "number": "204",
                "name": "Total lipid (fat)",
                "rank": 800,
                "unitName": "g"
            },
            "foodNutrientDerivation": {
                "id": 70,
                "code": "LCCS",
                "description": "Calculated from value per serving size measure"
            },
            "id": 33005009,
            "amount": 0.0
        }
    ],
    "dataType": "Branded",
    "foodClass": "Branded",
    "shortDescription": "",
    "modifiedDate": "8/29/2023",
    "availableDate": "8/29/2023",
    "brandOwner": "Food Markets Northwest, Inc.",
    "brandName": "METROPOLITAN MARKET",
    "dataSource": "LI",
    "brandedFoodCategory": "Fruit & Vegetable Juice, Nectars & Fruit Drinks",
    "gtinUpc": "664150060163",
    "householdServingFullText": "12 fl oz",
    "ingredients": "ORGANIC BEET, ORGANIC APPLE, ORGANIC LEMON, ORGANIC ALOE VERA JUICE (ORGANIC ALOE VERA, ORGANIC LEMON JUICE CONCENTRATE), ORGANIC GINGER.",
    "marketCountry": "United States",
    "servingSize": 355.0,
    "servingSizeUnit": "MLT",
    "packageWeight": "12 fl oz/355 mL",
    "foodUpdateLog": [
        {
            "discontinuedDate": "",
            "foodAttributes": [],
            "fdcId": 2642759,
            "description": "UP BEET COLD PRESSED JUICE, UP BEET",
            "publicationDate": "9/14/2023",
            "dataType": "Branded",
            "foodClass": "Branded",
            "shortDescription": "",
            "modifiedDate": "8/29/2023",
            "availableDate": "8/29/2023",
            "brandOwner": "Food Markets Northwest, Inc.",
            "brandName": "METROPOLITAN MARKET",
            "dataSource": "LI",
            "brandedFoodCategory": "Fruit & Vegetable Juice, Nectars & Fruit Drinks",
            "gtinUpc": "664150060163",
            "householdServingFullText": "12 fl oz",
            "ingredients": "ORGANIC BEET, ORGANIC APPLE, ORGANIC LEMON, ORGANIC ALOE VERA JUICE (ORGANIC ALOE VERA, ORGANIC LEMON JUICE CONCENTRATE), ORGANIC GINGER.",
            "marketCountry": "United States",
            "servingSize": 355.0,
            "servingSizeUnit": "MLT",
            "packageWeight": "12 fl oz/355 mL"
        }
    ],
    "labelNutrients": {
        "fat": {
            "value": 0.0
        },
        "saturatedFat": {
            "value": 0.0
        },
        "transFat": {
            "value": 0.0
        },
        "cholesterol": {
            "value": 0.0
        },
        "sodium": {
            "value": 74.6
        },
        "carbohydrates": {
            "value": 30.0
        },
        "fiber": {
            "value": 1.06
        },
        "sugars": {
            "value": 26.0
        },
        "protein": {
            "value": 1.99
        },
        "vitaminD": {
            "value": 0.0
        },
        "calcium": {
            "value": 28.4
        },
        "iron": {
            "value": 1.99
        },
        "potassium": {
            "value": 877
        },
        "addedSugar": {
            "value": 0.0
        },
        "calories": {
            "value": 131
        }
    }
}