{
  "discontinuedDate": "",
  "foodComponents": [],
  "foodAttributes": [
    {
      "id": 2001605,
      "value": 4,
      "name": "Nutrient Updated"
    },
    {
      "id": 2001607,
      "value": 2,
      "name": "Description"
    },
    {
      "id": 2001606,
      "value": 5,
      "name": "Nutrient Added"
    }
  ],
  "foodPortions": [],
  "fdcId": 1882785,
  "description": "WALNUTS HALVES & PIECES, WALNUTS",
  "publicationDate": "7/29/2021",
  "foodNutrients": [
    {
      "type": "FoodNutrient",
      "nutrient": {
        "id": 1292,
        "number": "645",
        "name": "Fatty acids, total monounsaturated",
        "rank": 11400,
        "unitName": "g"
      },
      "foodNutrientDerivation": {
        "id": 70,
        "code": "LCCS",
        "description": "Calculated from value per serving size measure"
      },
      "id": 22807008,
      "amount": 8.93
    },
    {
      "type": "FoodNutrient",
      "nutrient": {
        "id": 1257,
        "number": "605",
        "name": "Fatty acids, total trans",
        "rank": 15400,
        "unitName": "g"
      },
      "foodNutrientDerivation": {
        "id": 70,
        "code": "LCCS",
        "description": "Calculated from value per serving size measure"
      },
      "id": 22807006,
      "amount": 0
    },
    {
      "type": "FoodNutrient",
      "nutrient": {
        "id": 1089,
        "number": "303",
        "name": "Iron, Fe",
        "rank": 5400,
        "unitName": "mg"
      },
      "foodNutrientDerivation": {
        "id": 70,
        "code": "LCCS",
        "description": "Calculated from value per serving size measure"
      },
      "id": 22807000,
      "amount": 2.86
    },
    {
      "type": "FoodNutrient",
      "nutrient": {
        "id": 1093,
        "number": "307",
        "name": "Sodium, Na",
        "rank": 5800,
        "unitName": "mg"
      },
      "foodNutrientDerivation": {
        "id": 75,
        "code": "LCCD",
        "description": "Calculated from a daily value percentage per serving size measure"
      },
      "id": 22807002,
      "amount": 0
    },
    {
      "type": "FoodNutrient",
      "nutrient": {
        "id": 1004,
        "number": "204",
        "name": "Total lipid (fat)",
        "rank": 800,
        "unitName": "g"
      },
      "foodNutrientDerivation": {
        "id": 70,
        "code": "LCCS",
        "description": "Calculated from value per serving size measure"
      },
      "id": 22806994,
      "amount": 64.29
    },
    {
      "type": "FoodNutrient",
      "nutrient": {
        "id": 1293,
        "number": "646",
        "name": "Fatty acids, total polyunsaturated",
        "rank": 12900,
        "unitName": "g"
      },
      "foodNutrientDerivation": {
        "id": 70,
        "code": "LCCS",
        "description": "Calculated from value per serving size measure"
      },
      "id": 22807009,
      "amount": 46.43
    },
    {
      "type": "FoodNutrient",
      "nutrient": {
        "id": 1110,
        "number": "324",
        "name": "Vitamin D (D2 + D3), International Units",
        "rank": 8650,
        "unitName": "IU"
      },
      "foodNutrientDerivation": {
        "id": 75,
        "code": "LCCD",
        "description": "Calculated from a daily value percentage per serving size measure"
      },
      "id": 22807003,
      "amount": 0
    },
    {
      "type": "FoodNutrient",
      "nutrient": {
        "id": 1235,
        "number": "539",
        "name": "Sugars, added",
        "rank": 1540,
        "unitName": "g"
      },
      "foodNutrientDerivation": {
        "id": 75,
        "code": "LCCD",
        "description": "Calculated from a daily value percentage per serving size measure"
      },
      "id": 22807004,
      "amount": 0
    },
    {
      "type": "FoodNutrient",
      "nutrient": {
        "id": 1087,
        "number": "301",
        "name": "Calcium, Ca",
        "rank": 5300,
        "unitName": "mg"
      },
      "foodNutrientDerivation": {
        "id": 70,
        "code": "LCCS",
        "description": "Calculated from value per serving size measure"
      },
      "id": 22806999,
      "amount": 107
    },
    {
      "type": "FoodNutrient",
      "nutrient": {
        "id": 1003,
        "number": "203",
        "name": "Protein",
        "rank": 600,
        "unitName": "g"
      },
      "foodNutrientDerivation": {
        "id": 70,
        "code": "LCCS",
        "description": "Calculated from value per serving size measure"
      },
      "id": 22806993,
      "amount": 14.29
    },
    {
      "type": "FoodNutrient",
      "nutrient": {
        "id": 2000,
        "number": "269",
        "name": "Sugars, total including NLEA",
        "rank": 1510,
        "unitName": "g"
      },
      "foodNutrientDerivation": {
        "id": 73,
        "code": "LCSL",
        "description": "Calculated from a less than value per serving size measure"
      },
      "id": 22806997,
      "amount": 3.57
    },
    {
      "type": "FoodNutrient",
      "nutrient": {
        "id": 1253,
        "number": "601",
        "name": "Cholesterol",
        "rank": 15700,
        "unitName": "mg"
      },
      "foodNutrientDerivation": {
        "id": 75,
        "code": "LCCD",
        "description": "Calculated from a daily value percentage per serving size measure"
      },
      "id": 22807005,
      "amount": 0
    },
    {
      "type": "FoodNutrient",
      "nutrient": {
        "id": 1079,
        "number": "291",
        "name": "Fiber, total dietary",
        "rank": 1200,
        "unitName": "g"
      },
      "foodNutrientDerivation": {
        "id": 70,
        "code": "LCCS",
        "description": "Calculated from value per serving size measure"
      },
      "id": 22806998,
      "amount": 7.1
    },
    {
      "type": "FoodNutrient",
      "nutrient": {
        "id": 1008,
        "number": "208",
        "name": "Energy",
        "rank": 300,
        "unitName": "kcal"
      },
      "foodNutrientDerivation": {
        "id": 70,
        "code": "LCCS",
        "description": "Calculated from value per serving size measure"
      },
      "id": 22806996,
      "amount": 679
    },
    {
      "type": "FoodNutrient",
      "nutrient": {
        "id": 1005,
        "number": "205",
        "name": "Carbohydrate, by difference",
        "rank": 1110,
        "unitName": "g"
      },
      "foodNutrientDerivation": {
        "id": 70,
        "code": "LCCS",
        "description": "Calculated from value per serving size measure"
      },
      "id": 22806995,
      "amount": 14.29
    },
    {
      "type": "FoodNutrient",
      "nutrient": {
        "id": 1258,
        "number": "606",
        "name": "Fatty acids, total saturated",
        "rank": 9700,
        "unitName": "g"
      },
      "foodNutrientDerivation": {
        "id": 70,
        "code": "LCCS",
        "description": "Calculated from value per serving size measure"
      },
      "id": 22807007,
      "amount": 5.36
    },
    {
      "type": "FoodNutrient",
      "nutrient": {
        "id": 1092,
        "number": "306",
        "name": "Potassium, K",
        "rank": 5700,
        "unitName": "mg"
      },
      "foodNutrientDerivation": {
        "id": 70,
        "code": "LCCS",
        "description": "Calculated from value per serving size measure"
      },
      "id": 22807001,
      "amount": 429
    }
  ],
  "dataType": "Branded",
  "foodClass": "Branded",
  "modifiedDate": "6/18/2021",
  "availableDate": "6/18/2021",
  "brandOwner": "Whole Foods Market, Inc.",
  "brandName": "365 WHOLE FOODS MARKET",
  "dataSource": "LI",
  "brandedFoodCategory": "Popcorn, Peanuts, Seeds & Related Snacks",
  "gtinUpc": "099482434618",
  "ingredients": "WALNUTS.",
  "marketCountry": "United States",
  "servingSize": 28,
  "servingSizeUnit": "g",
  "packageWeight": "16 OZ/1 LB/454 g",
  "foodUpdateLog": [
    {
      "discontinuedDate": "",
      "foodAttributes": [],
      "fdcId": 1882785,
      "description": "WALNUTS HALVES & PIECES, WALNUTS",
      "publicationDate": "7/29/2021",
      "dataType": "Branded",
      "foodClass": "Branded",
      "modifiedDate": "6/18/2021",
      "availableDate": "6/18/2021",
      "brandOwner": "Whole Foods Market, Inc.",
      "brandName": "365 WHOLE FOODS MARKET",
      "dataSource": "LI",
      "brandedFoodCategory": "Popcorn, Peanuts, Seeds & Related Snacks",
      "gtinUpc": "099482434618",
      "ingredients": "WALNUTS.",
      "marketCountry": "United States",
      "servingSize": 28,
      "servingSizeUnit": "g",
      "packageWeight": "16 OZ/1 LB/454 g"
    },
    {
      "discontinuedDate": "",
      "foodAttributes": [],
      "fdcId": 1535120,
      "description": "HALVES & PIECES WALNUTS",
      "publicationDate": "3/19/2021",
      "dataType": "Branded",
      "foodClass": "Branded",
      "modifiedDate": "2/18/2021",
      "availableDate": "2/18/2021",
      "brandOwner": "Whole Foods Market, Inc.",
      "brandName": "365 WHOLE FOODS MARKET",
      "dataSource": "LI",
      "brandedFoodCategory": "Popcorn, Peanuts, Seeds & Related Snacks",
      "gtinUpc": "099482434618",
      "ingredients": "WALNUTS.",
      "marketCountry": "United States",
      "servingSize": 28,
      "servingSizeUnit": "g"
    },
    {
      "discontinuedDate": "",
      "foodAttributes": [],
      "fdcId": 1243058,
      "description": "365 EVERYDAY VALUE, WALNUTS HALVES & PIECES",
      "publicationDate": "2/26/2021",
      "dataType": "Branded",
      "foodClass": "Branded",
      "modifiedDate": "2/8/2020",
      "availableDate": "2/8/2020",
      "brandOwner": "Whole Foods Market, Inc.",
      "brandName": "365 EVERYDAY VALUE",
      "subbrandName": "",
      "dataSource": "LI",
      "brandedFoodCategory": "Popcorn, Peanuts, Seeds & Related Snacks",
      "gtinUpc": "099482434618",
      "ingredients": "WALNUTS.",
      "marketCountry": "United States",
      "servingSize": 28,
      "servingSizeUnit": "g",
      "packageWeight": "",
      "notaSignificantSourceOf": ""
    }
  ],
  "labelNutrients": {
    "fat": {
      "value": 18
    },
    "saturatedFat": {
      "value": 1.5
    },
    "transFat": {
      "value": 0
    },
    "cholesterol": {
      "value": 0
    },
    "sodium": {
      "value": 0
    },
    "carbohydrates": {
      "value": 4
    },
    "fiber": {
      "value": 1.99
    },
    "sugars": {
      "value": 1
    },
    "protein": {
      "value": 4
    },
    "calcium": {
      "value": 30
    },
    "iron": {
      "value": 0.801
    },
    "potassium": {
      "value": 120
    },
    "addedSugar": {
      "value": 0
    },
    "calories": {
      "value": 190
    }
  }
}