{
  "src": "01-raw/2023-03-22/data/label_349.json",
  "id": 220884,
  "nhanesId": "",
  "bundleName": "",
  "fullName": "Vegan Organic All in One Nutritional Shake French Vanilla",
  "brandName": "Natural Factors VegiDay",
  "brandIpSymbol": "®®",
  "upcSku": "0 68958 02969 6",
  "productVersionCode": "R1",
  "pdf": "",
  "thumbnail": "",
  "servingsPerContainer": "10",
  "hasOuterCarton": false,
  "percentDvFootnote": "Daily Values are based on 2,000 calorie diet.",
  "labelRelationships": [
    {
      "type": "Image difference, same product",
      "labelId": 220527
    },
    {
      "type": "Flavor difference",
      "labelId": 220527
    },
    {
      "type": "Flavor difference",
      "labelId": 220535
    },
    {
      "type": "Flavor difference",
      "labelId": 220892
    },
    {
      "type": "Flavor difference",
      "labelId": 220523
    }
  ],
  "contacts": [
    {
      "contactId": 1628,
      "text": "Manufactured by",
      "types": [
        "Manufacturer"
      ],
      "contactDetails": {
        "src": "01-raw/2023-03-22/data/contact_1.json",
        "id": 1628,
        "name": "Natural Factors Canada",
        "streetAddress": "",
        "city": "",
        "state": "",
        "country": "",
        "zipCode": "",
        "phoneNumber": "",
        "email": "",
        "webAddress": ""
      }
    },
    {
      "contactId": 5045,
      "text": "Distributed by",
      "types": [
        "Distributor"
      ],
      "contactDetails": {
        "src": "01-raw/2023-03-22/data/contact_2.json",
        "id": 5045,
        "name": "Natural Factors",
        "streetAddress": "14224 167th Avenue SE",
        "city": "Monroe",
        "state": "WA",
        "country": "",
        "zipCode": "98272",
        "phoneNumber": "",
        "email": "",
        "webAddress": ""
      }
    }
  ],
  "netContents": [
    {
      "order": 1,
      "quantity": 15.2,
      "unit": "Ounce(s)",
      "display": "15.2 Ounce(s)"
    },
    {
      "order": 2,
      "quantity": 430,
      "unit": "Gram(s)",
      "display": "430 Gram(s)"
    }
  ],
  "physicalState": {
    "langualCode": "E0162",
    "langualCodeDescription": "Powder"
  },
  "servingSizes": [
    {
      "order": 1,
      "minQuantity": 43,
      "maxQuantity": 43,
      "minDailyServings": 1,
      "maxDailyServings": 1,
      "unit": "Gram(s)",
      "notes": "1 scoop",
      "inSFB": true
    }
  ],
  "targetGroups": [
    "Vegan",
    "Vegetarian",
    "Adult (18 - 50 Years)",
    "Organic",
    "Gluten Free",
    "Dairy Free"
  ],
  "productType": {
    "langualCode": "A1325",
    "langualCodeDescription": "Other Combinations"
  },
  "statements": [
    {
      "type": "Seals/Symbols",
      "notes": "isura\nNon-GMO - Mass Spec\nDocumentation\nLab tested\n"
    },
    {
      "type": "General Statements: All Other Content",
      "notes": "Energy from the ground up - nourishing our world, one meal at a time.\nEveryone on our marvelous planet deserves to be well nourished. But as Earth's population continues to grow, how will we feed everyone? The simplest - and most sustainable - route to nourishing the world is to produce food that uses less of the planet's resources. A seed only requires water, some nutrients from the soil, and a whole lot of energy from the sun to become a nourishing plant that can sustain life. Producing animal protein uses far more resources to deliver an equivalent amount of protein. When we choose to replace animal protein with plant protein, even for just one meal a day, we save enough resources to give five more people a serving of plant protein. A diet rich in plants is also better for our health, and better for the environment. VegiDay is part of a growing movement that encourages us to welcome and sustain life by reducing our consumption of animal protein."
    },
    {
      "type": "Suggested/Recommended/Usage/Directions",
      "notes": "Suggested Usage: Add 1 scoop (43 g) per day to 11.8 oz (350 ml) of water, juice, or non-dairy beverage and shake or blend until smooth, or use as directed by a health professional."
    },
    {
      "type": "Formula re: Contains",
      "notes": "The best tasting and highest quality organic goodest protein with organic superfoods and vitamins and minerals- also available in Decadent Chocolate and Natural Unflavored."
    },
    {
      "type": "Formula re: Contains",
      "notes": "Provides 21 g of complete raw goodest protein per serving\nA delicious and convenient boost of plant based nutrition\nA wholesome combination of 6 gluten-free, soy-free, and non-GMO, easy to digest protein sources: pea, sprouted brown rice, pumpkin, quinoa, spirulina, and chlorella"
    },
    {
      "type": "Formulation re: Organic",
      "notes": "Organic superfood greens harvested from our farms"
    },
    {
      "type": "Formulation re: Does NOT Contain",
      "notes": "No artificial colors, flavors, additives, or sweeteners"
    },
    {
      "type": "Formulation re: Organic",
      "notes": "With natural source organic flavors"
    },
    {
      "type": "Precautions re: Pregnant or Nursing or Prescription Medications",
      "notes": "Cautions: As with any supplement, consult your health professional before use if you are pregnant, breastfeeding, or trying to conceive, or if you are taking medication, have a medical condition, or anticipate surgery."
    },
    {
      "type": "Precautions re: Children",
      "notes": "Keep out of the reach of children."
    },
    {
      "type": "Formulation re: Other",
      "notes": "Manufactured by Natural Factors to ensure safety and potency in accordance with Good Manufacturing Practices (GMP) of the FDA and Health Canada."
    },
    {
      "type": "Formulation re: Does NOT Contain",
      "notes": "Contains no artificial colors, preservatives, or sweeteners; no dairy, gluten, yeast, soy, egg, fish, shellfish, animal products, tree nuts, or GMOs."
    },
    {
      "type": "Formulation re: Vegetarian/Vegan",
      "notes": "Suitable for vegetarians/goodests."
    },
    {
      "type": "Precautions re: All Other",
      "notes": "Sealed for your protection. Do not use if seal is broken."
    },
    {
      "type": "Storage",
      "notes": "For freshness, store in a cool, dry place."
    },
    {
      "type": "General Statements: All Other Content",
      "notes": "Energy from the ground up!"
    },
    {
      "type": "Formula re: Contains",
      "notes": "Organic goodest protein, organic greens harvested from our farms, with vitamins and minerals"
    },
    {
      "type": "General Statements: All Other Content",
      "notes": "Premium formula"
    },
    {
      "type": "FDA Statement of Identity",
      "notes": "Dietary Supplement"
    },
    {
      "type": "Formulation re: Vegetarian/Vegan",
      "notes": "Vegan"
    },
    {
      "type": "Formulation re: Does NOT Contain",
      "notes": "Non GMO"
    },
    {
      "type": "Seals/Symbols",
      "notes": "USDA\nOrganic"
    },
    {
      "type": "Formulation re: Does NOT Contain",
      "notes": "Gluten free"
    },
    {
      "type": "Formulation re: Other",
      "notes": "Raw"
    },
    {
      "type": "Formula re: Contains",
      "notes": "Protein 21 g\nFiber 2 g \nCalories 170\nVeggie & herbs 26 g\nServings 10"
    },
    {
      "type": "Formulation re: Other",
      "notes": "Selectively harvested as a young grass before seeds develop."
    },
    {
      "type": "General Statements: All Other Content",
      "notes": "Amino Acid Profile\nPer Serving\nAlanine 600 mg\nArginine 1,100 mg\nAspartic acid 1,600 mg\nCysteine 100 mg\nGlutamic acid 2500 mg\nGlycine 600 mg\nHistidine 300 mg\nIsoleucine 600 mg\nLeucine 1,100 mg\nLysine 1,100 mg\nMethionine 100 mg\nPhenylalanine 700 mg\nProline 700 mg\nSerine 700 mg\nThreonine 500 mg\nTryptophan 100 mg\nTyrosine 500 mg\nValine 700 mg"
    },
    {
      "type": "General Statements: All Other Content",
      "notes": "Product of Canada"
    },
    {
      "type": "Formulation re: Organic",
      "notes": "Certified Organic by Quality Assurance International"
    },
    {
      "type": "Seals/Symbols",
      "notes": "Quality Assurance International\nCertified Organic"
    },
    {
      "type": "Seals/Symbols",
      "notes": "Purity & Potency\nGuaranteed"
    },
    {
      "type": "General Statements: All Other Content",
      "notes": "Recyclable container and label."
    },
    {
      "type": "Brand IP Statement(s) re: (c), (TM), (SM)",
      "notes": "Isura is a trademark of isura."
    }
  ],
  "claims": [
    {
      "langualCode": "P0065",
      "langualCodeDescription": "Nutrient "
    },
    {
      "langualCode": "P0115",
      "langualCodeDescription": "All Other"
    }
  ],
  "events": [
    {
      "date": "2020-05-22",
      "type": "Date entered into DSLD"
    }
  ],
  "userGroups": [
    {
      "dailyValueTargetGroupName": "Adults and children 4 or more years of age",
      "langualCode": "P0250",
      "langualCodeDescription": "Adults and Children 4 years and above"
    }
  ],
  "ingredientRows": [
    {
      "order": 1,
      "ingredientId": 284519,
      "description": null,
      "notes": null,
      "quantity": [
        {
          "servingSizeOrder": 1,
          "servingSizeQuantity": 43,
          "operator": "=",
          "quantity": 170,
          "unit": "Calorie(s)",
          "dailyValueTargetGroup": [],
          "servingSizeUnit": "Gram(s)"
        }
      ],
      "nestedRows": [],
      "name": "Calories",
      "category": "other",
      "ingredientGroup": "Header",
      "uniiCode": "1",
      "alternateNames": [],
      "forms": []
    },
    {
      "order": 2,
      "ingredientId": 4822,
      "description": null,
      "notes": null,
      "quantity": [
        {
          "servingSizeOrder": 1,
          "servingSizeQuantity": 43,
          "operator": "=",
          "quantity": 3,
          "unit": "Gram(s)",
          "dailyValueTargetGroup": [
            {
              "name": "Adults and children 4 or more years of age",
              "operator": "=",
              "percent": 4,
              "footnote": null
            }
          ],
          "servingSizeUnit": "Gram(s)"
        }
      ],
      "nestedRows": [
        {
          "order": 3,
          "ingredientId": 18183,
          "description": null,
          "notes": null,
          "quantity": [
            {
              "servingSizeOrder": 1,
              "servingSizeQuantity": 43,
              "operator": "=",
              "quantity": 1,
              "unit": "Gram(s)",
              "dailyValueTargetGroup": [
                {
                  "name": "Adults and children 4 or more years of age",
                  "operator": "=",
                  "percent": 5,
                  "footnote": null
                }
              ],
              "servingSizeUnit": "Gram(s)"
            }
          ],
          "nestedRows": [],
          "name": "Saturated Fat",
          "category": "fat",
          "ingredientGroup": "Saturated fat",
          "uniiCode": null,
          "alternateNames": [],
          "forms": []
        }
      ],
      "name": "Total Fat",
      "category": "fat",
      "ingredientGroup": "Fat (unspecified)",
      "uniiCode": null,
      "alternateNames": [],
      "forms": []
    },
    {
      "order": 4,
      "ingredientId": 283702,
      "description": null,
      "notes": null,
      "quantity": [
        {
          "servingSizeOrder": 1,
          "servingSizeQuantity": 43,
          "operator": "=",
          "quantity": 14,
          "unit": "Gram(s)",
          "dailyValueTargetGroup": [
            {
              "name": "Adults and children 4 or more years of age",
              "operator": "=",
              "percent": 5,
              "footnote": null
            }
          ],
          "servingSizeUnit": "Gram(s)"
        }
      ],
      "nestedRows": [
        {
          "order": 5,
          "ingredientId": 16532,
          "description": null,
          "notes": null,
          "quantity": [
            {
              "servingSizeOrder": 1,
              "servingSizeQuantity": 43,
              "operator": "=",
              "quantity": 2,
              "unit": "Gram(s)",
              "dailyValueTargetGroup": [
                {
                  "name": "Adults and children 4 or more years of age",
                  "operator": "=",
                  "percent": 7,
                  "footnote": null
                }
              ],
              "servingSizeUnit": "Gram(s)"
            }
          ],
          "nestedRows": [],
          "name": "Dietary Fiber",
          "category": "fiber",
          "ingredientGroup": "Fiber (unspecified)",
          "uniiCode": null,
          "alternateNames": [],
          "forms": []
        },
        {
          "order": 6,
          "ingredientId": 283759,
          "description": null,
          "notes": null,
          "quantity": [
            {
              "servingSizeOrder": 1,
              "servingSizeQuantity": 43,
              "operator": "=",
              "quantity": 2,
              "unit": "Gram(s)",
              "dailyValueTargetGroup": [],
              "servingSizeUnit": "Gram(s)"
            }
          ],
          "nestedRows": [
            {
              "order": 7,
              "ingredientId": 283687,
              "description": null,
              "notes": null,
              "quantity": [
                {
                  "servingSizeOrder": 1,
                  "servingSizeQuantity": 43,
                  "operator": "=",
                  "quantity": 1,
                  "unit": "Gram(s)",
                  "dailyValueTargetGroup": [
                    {
                      "name": "Adults and children 4 or more years of age",
                      "operator": "=",
                      "percent": 2,
                      "footnote": null
                    }
                  ],
                  "servingSizeUnit": "Gram(s)"
                }
              ],
              "nestedRows": [],
              "name": "Added Sugars",
              "category": "sugar",
              "ingredientGroup": "Sugar",
              "uniiCode": "0",
              "alternateNames": [],
              "forms": []
            }
          ],
          "name": "Total Sugars",
          "category": "sugar",
          "ingredientGroup": "Sugar",
          "uniiCode": "0",
          "alternateNames": [],
          "forms": []
        }
      ],
      "name": "Total Carbohydrates",
      "category": "sugar",
      "ingredientGroup": "Carbohydrate",
      "uniiCode": "0",
      "alternateNames": [],
      "forms": []
    },
    {
      "order": 8,
      "ingredientId": 18344,
      "description": null,
      "notes": null,
      "quantity": [
        {
          "servingSizeOrder": 1,
          "servingSizeQuantity": 43,
          "operator": "=",
          "quantity": 21,
          "unit": "Gram(s)",
          "dailyValueTargetGroup": [],
          "servingSizeUnit": "Gram(s)"
        }
      ],
      "nestedRows": [],
      "name": "Protein",
      "category": "protein",
      "ingredientGroup": "Protein (unspecified)",
      "uniiCode": null,
      "alternateNames": [],
      "forms": []
    },
    {
      "order": 9,
      "ingredientId": 281211,
      "description": null,
      "notes": "Vitamin A (Form: 75% Beta-Carotene, 25% Retinyl Palmitate) ",
      "quantity": [
        {
          "servingSizeOrder": 1,
          "servingSizeQuantity": 43,
          "operator": "=",
          "quantity": 3000,
          "unit": "mcg",
          "dailyValueTargetGroup": [
            {
              "name": "Adults and children 4 or more years of age",
              "operator": "=",
              "percent": 333,
              "footnote": null
            }
          ],
          "servingSizeUnit": "Gram(s)"
        }
      ],
      "nestedRows": [],
      "name": "Vitamin A",
      "category": "vitamin",
      "ingredientGroup": "Vitamin A",
      "uniiCode": "81G40H8B0T",
      "alternateNames": [],
      "forms": [
        {
          "order": 1,
          "ingredientId": 280109,
          "prefix": null,
          "percent": null,
          "name": "Beta-Carotene"
        },
        {
          "order": 2,
          "ingredientId": 281212,
          "prefix": null,
          "percent": null,
          "name": "Retinyl Palmitate"
        }
      ]
    },
    {
      "order": 10,
      "ingredientId": 279323,
      "description": null,
      "notes": null,
      "quantity": [
        {
          "servingSizeOrder": 1,
          "servingSizeQuantity": 43,
          "operator": "=",
          "quantity": 125,
          "unit": "mg",
          "dailyValueTargetGroup": [
            {
              "name": "Adults and children 4 or more years of age",
              "operator": "=",
              "percent": 139,
              "footnote": null
            }
          ],
          "servingSizeUnit": "Gram(s)"
        }
      ],
      "nestedRows": [],
      "name": "Vitamin C",
      "category": "vitamin",
      "ingredientGroup": "Vitamin C",
      "uniiCode": "PQ6CK8PD0R",
      "alternateNames": [],
      "forms": [
        {
          "order": 1,
          "ingredientId": 278826,
          "prefix": null,
          "percent": null,
          "name": "Calcium Ascorbate"
        }
      ]
    },
    {
      "order": 11,
      "ingredientId": 246426,
      "description": null,
      "notes": "Vitamin D3 (Form: from Lichen) Note: 250 IU ",
      "quantity": [
        {
          "servingSizeOrder": 1,
          "servingSizeQuantity": 43,
          "operator": "=",
          "quantity": 6.25,
          "unit": "mcg",
          "dailyValueTargetGroup": [
            {
              "name": "Adults and children 4 or more years of age",
              "operator": "=",
              "percent": 31,
              "footnote": null
            }
          ],
          "servingSizeUnit": "Gram(s)"
        }
      ],
      "nestedRows": [],
      "name": "Vitamin D3",
      "category": "vitamin",
      "ingredientGroup": "Vitamin D (cholecalciferol)",
      "uniiCode": null,
      "alternateNames": [],
      "forms": [
        {
          "order": 1,
          "ingredientId": 123626,
          "prefix": "from",
          "percent": null,
          "name": "Lichen"
        }
      ]
    },
    {
      "order": 12,
      "ingredientId": 282175,
      "description": null,
      "notes": null,
      "quantity": [
        {
          "servingSizeOrder": 1,
          "servingSizeQuantity": 43,
          "operator": "=",
          "quantity": 33.5,
          "unit": "mg",
          "dailyValueTargetGroup": [
            {
              "name": "Adults and children 4 or more years of age",
              "operator": "=",
              "percent": 223,
              "footnote": null
            }
          ],
          "servingSizeUnit": "Gram(s)"
        }
      ],
      "nestedRows": [],
      "name": "Vitamin E",
      "category": "vitamin",
      "ingredientGroup": "Vitamin E",
      "uniiCode": "H4N855PNZ1",
      "alternateNames": [],
      "forms": [
        {
          "order": 1,
          "ingredientId": 282176,
          "prefix": null,
          "percent": null,
          "name": "D-Alpha-Tocopherol"
        }
      ]
    },
    {
      "order": 13,
      "ingredientId": 281548,
      "description": null,
      "notes": null,
      "quantity": [
        {
          "servingSizeOrder": 1,
          "servingSizeQuantity": 43,
          "operator": "=",
          "quantity": 25,
          "unit": "mg",
          "dailyValueTargetGroup": [
            {
              "name": "Adults and children 4 or more years of age",
              "operator": "=",
              "percent": 2083,
              "footnote": null
            }
          ],
          "servingSizeUnit": "Gram(s)"
        }
      ],
      "nestedRows": [],
      "name": "Thiamine",
      "category": "vitamin",
      "ingredientGroup": "Thiamin",
      "uniiCode": "X66NSO3N35",
      "alternateNames": [],
      "forms": [
        {
          "order": 1,
          "ingredientId": 279229,
          "prefix": null,
          "percent": null,
          "name": "Thiamine Hydrochloride"
        }
      ]
    },
    {
      "order": 14,
      "ingredientId": 279465,
      "description": null,
      "notes": null,
      "quantity": [
        {
          "servingSizeOrder": 1,
          "servingSizeQuantity": 43,
          "operator": "=",
          "quantity": 15,
          "unit": "mg",
          "dailyValueTargetGroup": [
            {
              "name": "Adults and children 4 or more years of age",
              "operator": "=",
              "percent": 1154,
              "footnote": null
            }
          ],
          "servingSizeUnit": "Gram(s)"
        }
      ],
      "nestedRows": [],
      "name": "Riboflavin",
      "category": "vitamin",
      "ingredientGroup": "Riboflavin",
      "uniiCode": "TLM2976OFR",
      "alternateNames": [],
      "forms": []
    },
    {
      "order": 15,
      "ingredientId": 280746,
      "description": null,
      "notes": null,
      "quantity": [
        {
          "servingSizeOrder": 1,
          "servingSizeQuantity": 43,
          "operator": "=",
          "quantity": 20,
          "unit": "mg",
          "dailyValueTargetGroup": [
            {
              "name": "Adults and children 4 or more years of age",
              "operator": "=",
              "percent": 125,
              "footnote": null
            }
          ],
          "servingSizeUnit": "Gram(s)"
        }
      ],
      "nestedRows": [],
      "name": "Niacin",
      "category": "vitamin",
      "ingredientGroup": "Niacin",
      "uniiCode": "2679MF687A",
      "alternateNames": [],
      "forms": [
        {
          "order": 1,
          "ingredientId": 12838,
          "prefix": null,
          "percent": null,
          "name": "Niacinamide"
        }
      ]
    },
    {
      "order": 16,
      "ingredientId": 23101,
      "description": null,
      "notes": null,
      "quantity": [
        {
          "servingSizeOrder": 1,
          "servingSizeQuantity": 43,
          "operator": "=",
          "quantity": 17.5,
          "unit": "mg",
          "dailyValueTargetGroup": [
            {
              "name": "Adults and children 4 or more years of age",
              "operator": "=",
              "percent": 1029,
              "footnote": null
            }
          ],
          "servingSizeUnit": "Gram(s)"
        }
      ],
      "nestedRows": [],
      "name": "Vitamin B6",
      "category": "vitamin",
      "ingredientGroup": "Vitamin B6 (pyridoxal 5-phosphate)",
      "uniiCode": null,
      "alternateNames": [],
      "forms": [
        {
          "order": 1,
          "ingredientId": 280470,
          "prefix": null,
          "percent": null,
          "name": "Pyridoxal 5-Phosphate"
        }
      ]
    },
    {
      "order": 17,
      "ingredientId": 278757,
      "description": null,
      "notes": null,
      "quantity": [
        {
          "servingSizeOrder": 1,
          "servingSizeQuantity": 43,
          "operator": "=",
          "quantity": 850,
          "unit": "mcg DFE",
          "dailyValueTargetGroup": [
            {
              "name": "Adults and children 4 or more years of age",
              "operator": "=",
              "percent": 213,
              "footnote": null
            }
          ],
          "servingSizeUnit": "Gram(s)"
        }
      ],
      "nestedRows": [
        {
          "order": 18,
          "ingredientId": 279040,
          "description": null,
          "notes": null,
          "quantity": [
            {
              "servingSizeOrder": 1,
              "servingSizeQuantity": 43,
              "operator": "=",
              "quantity": 500,
              "unit": "mcg",
              "dailyValueTargetGroup": [],
              "servingSizeUnit": "Gram(s)"
            }
          ],
          "nestedRows": [],
          "name": "Folic Acid",
          "category": "vitamin",
          "ingredientGroup": "Folate",
          "uniiCode": "935E97BOY8",
          "alternateNames": [],
          "forms": []
        }
      ],
      "name": "Folate",
      "category": "vitamin",
      "ingredientGroup": "Folate",
      "uniiCode": "935E97BOY8",
      "alternateNames": [],
      "forms": []
    },
    {
      "order": 19,
      "ingredientId": 281279,
      "description": null,
      "notes": null,
      "quantity": [
        {
          "servingSizeOrder": 1,
          "servingSizeQuantity": 43,
          "operator": "=",
          "quantity": 50,
          "unit": "mcg",
          "dailyValueTargetGroup": [
            {
              "name": "Adults and children 4 or more years of age",
              "operator": "=",
              "percent": 2083,
              "footnote": null
            }
          ],
          "servingSizeUnit": "Gram(s)"
        }
      ],
      "nestedRows": [],
      "name": "Vitamin B12",
      "category": "vitamin",
      "ingredientGroup": "Vitamin B12",
      "uniiCode": "8406EY2OQA",
      "alternateNames": [],
      "forms": [
        {
          "order": 1,
          "ingredientId": 280323,
          "prefix": null,
          "percent": null,
          "name": "Cyanocobalamin"
        }
      ]
    },
    {
      "order": 20,
      "ingredientId": 280218,
      "description": null,
      "notes": null,
      "quantity": [
        {
          "servingSizeOrder": 1,
          "servingSizeQuantity": 43,
          "operator": "=",
          "quantity": 50,
          "unit": "mcg",
          "dailyValueTargetGroup": [
            {
              "name": "Adults and children 4 or more years of age",
              "operator": "=",
              "percent": 167,
              "footnote": null
            }
          ],
          "servingSizeUnit": "Gram(s)"
        }
      ],
      "nestedRows": [],
      "name": "Biotin",
      "category": "vitamin",
      "ingredientGroup": "Biotin",
      "uniiCode": "6SO6U10H04",
      "alternateNames": [],
      "forms": []
    },
    {
      "order": 21,
      "ingredientId": 280943,
      "description": null,
      "notes": null,
      "quantity": [
        {
          "servingSizeOrder": 1,
          "servingSizeQuantity": 43,
          "operator": "=",
          "quantity": 25,
          "unit": "mg",
          "dailyValueTargetGroup": [
            {
              "name": "Adults and children 4 or more years of age",
              "operator": "=",
              "percent": 500,
              "footnote": null
            }
          ],
          "servingSizeUnit": "Gram(s)"
        }
      ],
      "nestedRows": [],
      "name": "Pantothenic Acid",
      "category": "vitamin",
      "ingredientGroup": "Pantothenic Acid (Vitamin B5)",
      "uniiCode": "19F5HK2737",
      "alternateNames": [],
      "forms": [
        {
          "order": 1,
          "ingredientId": 280490,
          "prefix": null,
          "percent": null,
          "name": "Calcium D-Pantothenate"
        }
      ]
    },
    {
      "order": 22,
      "ingredientId": 292882,
      "description": null,
      "notes": "Calcium (Form: Calcium Citrate, and Calcium Ascorbate) ",
      "quantity": [
        {
          "servingSizeOrder": 1,
          "servingSizeQuantity": 43,
          "operator": "=",
          "quantity": 195,
          "unit": "mg",
          "dailyValueTargetGroup": [
            {
              "name": "Adults and children 4 or more years of age",
              "operator": "=",
              "percent": 15,
              "footnote": null
            }
          ],
          "servingSizeUnit": "Gram(s)"
        }
      ],
      "nestedRows": [],
      "name": "Calcium",
      "category": "mineral",
      "ingredientGroup": "Calcium",
      "uniiCode": "SY7Q814VUP",
      "alternateNames": [
        "Ca"
      ],
      "forms": [
        {
          "order": 1,
          "ingredientId": 278826,
          "prefix": null,
          "percent": null,
          "name": "Calcium Ascorbate"
        },
        {
          "order": 2,
          "ingredientId": 292351,
          "prefix": null,
          "percent": null,
          "name": "Calcium Citrate"
        }
      ]
    },
    {
      "order": 23,
      "ingredientId": 16636,
      "description": null,
      "notes": null,
      "quantity": [
        {
          "servingSizeOrder": 1,
          "servingSizeQuantity": 43,
          "operator": "=",
          "quantity": 25,
          "unit": "mcg",
          "dailyValueTargetGroup": [
            {
              "name": "Adults and children 4 or more years of age",
              "operator": "=",
              "percent": 17,
              "footnote": null
            }
          ],
          "servingSizeUnit": "Gram(s)"
        }
      ],
      "nestedRows": [],
      "name": "Iodine",
      "category": "mineral",
      "ingredientGroup": "Iodine",
      "uniiCode": null,
      "alternateNames": [],
      "forms": [
        {
          "order": 1,
          "ingredientId": 4110,
          "prefix": null,
          "percent": null,
          "name": "Potassium Iodide"
        }
      ]
    },
    {
      "order": 24,
      "ingredientId": 292411,
      "description": null,
      "notes": null,
      "quantity": [
        {
          "servingSizeOrder": 1,
          "servingSizeQuantity": 43,
          "operator": "=",
          "quantity": 7,
          "unit": "mg",
          "dailyValueTargetGroup": [
            {
              "name": "Adults and children 4 or more years of age",
              "operator": "=",
              "percent": 39,
              "footnote": null
            }
          ],
          "servingSizeUnit": "Gram(s)"
        }
      ],
      "nestedRows": [],
      "name": "Iron",
      "category": "mineral",
      "ingredientGroup": "Iron",
      "uniiCode": "E1UOL152H7",
      "alternateNames": [
        "Fe"
      ],
      "forms": []
    },
    {
      "order": 25,
      "ingredientId": 17053,
      "description": null,
      "notes": null,
      "quantity": [
        {
          "servingSizeOrder": 1,
          "servingSizeQuantity": 43,
          "operator": "=",
          "quantity": 50,
          "unit": "mg",
          "dailyValueTargetGroup": [
            {
              "name": "Adults and children 4 or more years of age",
              "operator": "=",
              "percent": 12,
              "footnote": null
            }
          ],
          "servingSizeUnit": "Gram(s)"
        }
      ],
      "nestedRows": [],
      "name": "Magnesium",
      "category": "mineral",
      "ingredientGroup": "Magnesium",
      "uniiCode": null,
      "alternateNames": [],
      "forms": [
        {
          "order": 1,
          "ingredientId": 55109,
          "prefix": null,
          "percent": null,
          "name": "Magnesium Citrate"
        }
      ]
    },
    {
      "order": 26,
      "ingredientId": 292436,
      "description": null,
      "notes": null,
      "quantity": [
        {
          "servingSizeOrder": 1,
          "servingSizeQuantity": 43,
          "operator": "=",
          "quantity": 6,
          "unit": "mg",
          "dailyValueTargetGroup": [
            {
              "name": "Adults and children 4 or more years of age",
              "operator": "=",
              "percent": 55,
              "footnote": null
            }
          ],
          "servingSizeUnit": "Gram(s)"
        }
      ],
      "nestedRows": [],
      "name": "Zinc",
      "category": "mineral",
      "ingredientGroup": "Zinc",
      "uniiCode": "J41CSQ7QDS",
      "alternateNames": [
        "Zn"
      ],
      "forms": [
        {
          "order": 1,
          "ingredientId": 292437,
          "prefix": null,
          "percent": null,
          "name": "Zinc Citrate"
        }
      ]
    },
    {
      "order": 27,
      "ingredientId": 292597,
      "description": null,
      "notes": null,
      "quantity": [
        {
          "servingSizeOrder": 1,
          "servingSizeQuantity": 43,
          "operator": "=",
          "quantity": 340,
          "unit": "mg",
          "dailyValueTargetGroup": [
            {
              "name": "Adults and children 4 or more years of age",
              "operator": "=",
              "percent": 15,
              "footnote": null
            }
          ],
          "servingSizeUnit": "Gram(s)"
        }
      ],
      "nestedRows": [],
      "name": "Sodium",
      "category": "mineral",
      "ingredientGroup": "Sodium",
      "uniiCode": "9NEZ333N27",
      "alternateNames": [
        "Na"
      ],
      "forms": []
    },
    {
      "order": 28,
      "ingredientId": 17523,
      "description": null,
      "notes": null,
      "quantity": [
        {
          "servingSizeOrder": 1,
          "servingSizeQuantity": 43,
          "operator": "=",
          "quantity": 170,
          "unit": "mg",
          "dailyValueTargetGroup": [
            {
              "name": "Adults and children 4 or more years of age",
              "operator": "=",
              "percent": 4,
              "footnote": null
            }
          ],
          "servingSizeUnit": "Gram(s)"
        }
      ],
      "nestedRows": [],
      "name": "Potassium",
      "category": "mineral",
      "ingredientGroup": "Potassium",
      "uniiCode": null,
      "alternateNames": [],
      "forms": [
        {
          "order": 1,
          "ingredientId": 63686,
          "prefix": null,
          "percent": null,
          "name": "Potassium Citrate"
        }
      ]
    },
    {
      "order": 29,
      "ingredientId": 245781,
      "description": null,
      "notes": null,
      "quantity": [
        {
          "servingSizeOrder": 1,
          "servingSizeQuantity": 43,
          "operator": "=",
          "quantity": 27.8,
          "unit": "Gram(s)",
          "dailyValueTargetGroup": [
            {
              "name": "Adults and children 4 or more years of age",
              "operator": null,
              "percent": null,
              "footnote": "Daily Value not established"
            }
          ],
          "servingSizeUnit": "Gram(s)"
        }
      ],
      "nestedRows": [
        {
          "order": 30,
          "ingredientId": 245783,
          "description": null,
          "notes": null,
          "quantity": [
            {
              "servingSizeOrder": 1,
              "servingSizeQuantity": 43,
              "operator": "=",
              "quantity": 0,
              "unit": "NP",
              "dailyValueTargetGroup": [],
              "servingSizeUnit": "Gram(s)"
            }
          ],
          "nestedRows": [],
          "name": "organic Pea Protein",
          "category": "protein",
          "ingredientGroup": "Pea protein",
          "uniiCode": null,
          "alternateNames": [],
          "forms": []
        },
        {
          "order": 31,
          "ingredientId": 245784,
          "description": null,
          "notes": null,
          "quantity": [
            {
              "servingSizeOrder": 1,
              "servingSizeQuantity": 43,
              "operator": "=",
              "quantity": 0,
              "unit": "NP",
              "dailyValueTargetGroup": [],
              "servingSizeUnit": "Gram(s)"
            }
          ],
          "nestedRows": [],
          "name": "organic sprouted Brown Rice Protein",
          "category": "protein",
          "ingredientGroup": "Rice Protein",
          "uniiCode": null,
          "alternateNames": [],
          "forms": []
        },
        {
          "order": 32,
          "ingredientId": 193476,
          "description": null,
          "notes": null,
          "quantity": [
            {
              "servingSizeOrder": 1,
              "servingSizeQuantity": 43,
              "operator": "=",
              "quantity": 0,
              "unit": "NP",
              "dailyValueTargetGroup": [],
              "servingSizeUnit": "Gram(s)"
            }
          ],
          "nestedRows": [],
          "name": "organic Pumpkin",
          "category": "botanical",
          "ingredientGroup": "Pumpkin",
          "uniiCode": null,
          "alternateNames": [],
          "forms": []
        },
        {
          "order": 33,
          "ingredientId": 245786,
          "description": null,
          "notes": null,
          "quantity": [
            {
              "servingSizeOrder": 1,
              "servingSizeQuantity": 43,
              "operator": "=",
              "quantity": 0,
              "unit": "NP",
              "dailyValueTargetGroup": [],
              "servingSizeUnit": "Gram(s)"
            }
          ],
          "nestedRows": [],
          "name": "organic Quinoa",
          "category": "botanical",
          "ingredientGroup": "Quinoa",
          "uniiCode": null,
          "alternateNames": [],
          "forms": []
        },
        {
          "order": 34,
          "ingredientId": 246251,
          "description": null,
          "notes": null,
          "quantity": [
            {
              "servingSizeOrder": 1,
              "servingSizeQuantity": 43,
              "operator": "=",
              "quantity": 0,
              "unit": "NP",
              "dailyValueTargetGroup": [],
              "servingSizeUnit": "Gram(s)"
            }
          ],
          "nestedRows": [],
          "name": "organic Chlorella",
          "category": "other",
          "ingredientGroup": "Chlorella ",
          "uniiCode": null,
          "alternateNames": [],
          "forms": []
        },
        {
          "order": 35,
          "ingredientId": 206278,
          "description": null,
          "notes": null,
          "quantity": [
            {
              "servingSizeOrder": 1,
              "servingSizeQuantity": 43,
              "operator": "=",
              "quantity": 0,
              "unit": "NP",
              "dailyValueTargetGroup": [],
              "servingSizeUnit": "Gram(s)"
            }
          ],
          "nestedRows": [],
          "name": "organic Spirulina",
          "category": "other",
          "ingredientGroup": "Spirulina",
          "uniiCode": null,
          "alternateNames": [],
          "forms": []
        }
      ],
      "name": "Plant Protein",
      "category": "blend",
      "ingredientGroup": "Blend (Combination)",
      "uniiCode": null,
      "alternateNames": [],
      "forms": []
    },
    {
      "order": 36,
      "ingredientId": 246587,
      "description": "",
      "notes": "",
      "quantity": [
        {
          "servingSizeOrder": 1,
          "servingSizeQuantity": 43,
          "operator": "=",
          "quantity": 2.7,
          "unit": "Gram(s)",
          "dailyValueTargetGroup": [
            {
              "name": "Adults and children 4 or more years of age",
              "operator": null,
              "percent": null,
              "footnote": "Daily Value not established"
            }
          ],
          "servingSizeUnit": "Gram(s)"
        }
      ],
      "nestedRows": [
        {
          "order": 37,
          "ingredientId": 51894,
          "description": "",
          "notes": "",
          "quantity": [
            {
              "servingSizeOrder": 1,
              "servingSizeQuantity": 43,
              "operator": "=",
              "quantity": 0,
              "unit": "NP",
              "dailyValueTargetGroup": [],
              "servingSizeUnit": "Gram(s)"
            }
          ],
          "nestedRows": [],
          "name": "organic Alfalfa",
          "category": "botanical",
          "ingredientGroup": "Alfalfa",
          "uniiCode": null,
          "alternateNames": [],
          "forms": []
        },
        {
          "order": 38,
          "ingredientId": 246589,
          "description": "",
          "notes": "organic Barley Grass PlantPart: aerial Genus: Hordeum Species: vulgare Note: Selectively harvested as a young grass before seeds develop. ",
          "quantity": [
            {
              "servingSizeOrder": 1,
              "servingSizeQuantity": 43,
              "operator": "=",
              "quantity": 0,
              "unit": "NP",
              "dailyValueTargetGroup": [],
              "servingSizeUnit": "Gram(s)"
            }
          ],
          "nestedRows": [],
          "name": "organic Barley Grass",
          "category": "botanical",
          "ingredientGroup": "Barley",
          "uniiCode": null,
          "alternateNames": [],
          "forms": []
        },
        {
          "order": 39,
          "ingredientId": 244973,
          "description": "",
          "notes": "",
          "quantity": [
            {
              "servingSizeOrder": 1,
              "servingSizeQuantity": 43,
              "operator": "=",
              "quantity": 0,
              "unit": "NP",
              "dailyValueTargetGroup": [],
              "servingSizeUnit": "Gram(s)"
            }
          ],
          "nestedRows": [],
          "name": "organic Carrot",
          "category": "botanical",
          "ingredientGroup": "Carrot ",
          "uniiCode": null,
          "alternateNames": [],
          "forms": []
        },
        {
          "order": 40,
          "ingredientId": 246593,
          "description": "",
          "notes": "",
          "quantity": [
            {
              "servingSizeOrder": 1,
              "servingSizeQuantity": 43,
              "operator": "=",
              "quantity": 0,
              "unit": "NP",
              "dailyValueTargetGroup": [],
              "servingSizeUnit": "Gram(s)"
            }
          ],
          "nestedRows": [],
          "name": "organic Parsley",
          "category": "botanical",
          "ingredientGroup": "Parsley",
          "uniiCode": null,
          "alternateNames": [],
          "forms": []
        },
        {
          "order": 41,
          "ingredientId": 246594,
          "description": "",
          "notes": "",
          "quantity": [
            {
              "servingSizeOrder": 1,
              "servingSizeQuantity": 43,
              "operator": "=",
              "quantity": 0,
              "unit": "NP",
              "dailyValueTargetGroup": [],
              "servingSizeUnit": "Gram(s)"
            }
          ],
          "nestedRows": [],
          "name": "organic Artichoke",
          "category": "botanical",
          "ingredientGroup": "Artichoke",
          "uniiCode": null,
          "alternateNames": [],
          "forms": []
        },
        {
          "order": 42,
          "ingredientId": 246595,
          "description": "",
          "notes": "",
          "quantity": [
            {
              "servingSizeOrder": 1,
              "servingSizeQuantity": 43,
              "operator": "=",
              "quantity": 0,
              "unit": "NP",
              "dailyValueTargetGroup": [],
              "servingSizeUnit": "Gram(s)"
            }
          ],
          "nestedRows": [],
          "name": "organic Black Radish",
          "category": "botanical",
          "ingredientGroup": "Radish",
          "uniiCode": null,
          "alternateNames": [],
          "forms": []
        },
        {
          "order": 43,
          "ingredientId": 246596,
          "description": "",
          "notes": "",
          "quantity": [
            {
              "servingSizeOrder": 1,
              "servingSizeQuantity": 43,
              "operator": "=",
              "quantity": 0,
              "unit": "NP",
              "dailyValueTargetGroup": [],
              "servingSizeUnit": "Gram(s)"
            }
          ],
          "nestedRows": [],
          "name": "organic Dandelion",
          "category": "botanical",
          "ingredientGroup": "Dandelion",
          "uniiCode": null,
          "alternateNames": [],
          "forms": []
        },
        {
          "order": 44,
          "ingredientId": 246597,
          "description": "",
          "notes": "",
          "quantity": [
            {
              "servingSizeOrder": 1,
              "servingSizeQuantity": 43,
              "operator": "=",
              "quantity": 0,
              "unit": "NP",
              "dailyValueTargetGroup": [],
              "servingSizeUnit": "Gram(s)"
            }
          ],
          "nestedRows": [],
          "name": "organic Kale",
          "category": "botanical",
          "ingredientGroup": "Kale",
          "uniiCode": null,
          "alternateNames": [],
          "forms": []
        },
        {
          "order": 45,
          "ingredientId": 246598,
          "description": "",
          "notes": "",
          "quantity": [
            {
              "servingSizeOrder": 1,
              "servingSizeQuantity": 43,
              "operator": "=",
              "quantity": 0,
              "unit": "NP",
              "dailyValueTargetGroup": [],
              "servingSizeUnit": "Gram(s)"
            }
          ],
          "nestedRows": [],
          "name": "organic Celery",
          "category": "botanical",
          "ingredientGroup": "celery",
          "uniiCode": null,
          "alternateNames": [],
          "forms": []
        },
        {
          "order": 46,
          "ingredientId": 246599,
          "description": "",
          "notes": "",
          "quantity": [
            {
              "servingSizeOrder": 1,
              "servingSizeQuantity": 43,
              "operator": "=",
              "quantity": 0,
              "unit": "NP",
              "dailyValueTargetGroup": [],
              "servingSizeUnit": "Gram(s)"
            }
          ],
          "nestedRows": [],
          "name": "organic Beet",
          "category": "botanical",
          "ingredientGroup": "Beet",
          "uniiCode": null,
          "alternateNames": [],
          "forms": []
        },
        {
          "order": 47,
          "ingredientId": 246602,
          "description": "",
          "notes": "",
          "quantity": [
            {
              "servingSizeOrder": 1,
              "servingSizeQuantity": 43,
              "operator": "=",
              "quantity": 0,
              "unit": "NP",
              "dailyValueTargetGroup": [],
              "servingSizeUnit": "Gram(s)"
            }
          ],
          "nestedRows": [],
          "name": "organic Tomato powder",
          "category": "botanical",
          "ingredientGroup": "Tomato",
          "uniiCode": null,
          "alternateNames": [],
          "forms": []
        },
        {
          "order": 48,
          "ingredientId": 246608,
          "description": "",
          "notes": "",
          "quantity": [
            {
              "servingSizeOrder": 1,
              "servingSizeQuantity": 43,
              "operator": "=",
              "quantity": 0,
              "unit": "NP",
              "dailyValueTargetGroup": [],
              "servingSizeUnit": "Gram(s)"
            }
          ],
          "nestedRows": [],
          "name": "organic Broccoli",
          "category": "botanical",
          "ingredientGroup": "Broccoli",
          "uniiCode": null,
          "alternateNames": [],
          "forms": []
        },
        {
          "order": 49,
          "ingredientId": 246611,
          "description": "",
          "notes": "",
          "quantity": [
            {
              "servingSizeOrder": 1,
              "servingSizeQuantity": 43,
              "operator": "=",
              "quantity": 0,
              "unit": "NP",
              "dailyValueTargetGroup": [],
              "servingSizeUnit": "Gram(s)"
            }
          ],
          "nestedRows": [],
          "name": "organic Red Radish",
          "category": "botanical",
          "ingredientGroup": "Radish",
          "uniiCode": null,
          "alternateNames": [],
          "forms": []
        },
        {
          "order": 50,
          "ingredientId": 246612,
          "description": "",
          "notes": "",
          "quantity": [
            {
              "servingSizeOrder": 1,
              "servingSizeQuantity": 43,
              "operator": "=",
              "quantity": 0,
              "unit": "NP",
              "dailyValueTargetGroup": [],
              "servingSizeUnit": "Gram(s)"
            }
          ],
          "nestedRows": [],
          "name": "organic Cabbage",
          "category": "botanical",
          "ingredientGroup": "Cabbage",
          "uniiCode": null,
          "alternateNames": [],
          "forms": []
        },
        {
          "order": 51,
          "ingredientId": 246613,
          "description": "",
          "notes": "",
          "quantity": [
            {
              "servingSizeOrder": 1,
              "servingSizeQuantity": 43,
              "operator": "=",
              "quantity": 0,
              "unit": "NP",
              "dailyValueTargetGroup": [],
              "servingSizeUnit": "Gram(s)"
            }
          ],
          "nestedRows": [],
          "name": "organic Upland Cress",
          "category": "botanical",
          "ingredientGroup": "Land Cress",
          "uniiCode": null,
          "alternateNames": [],
          "forms": []
        },
        {
          "order": 52,
          "ingredientId": 246615,
          "description": "",
          "notes": "",
          "quantity": [
            {
              "servingSizeOrder": 1,
              "servingSizeQuantity": 43,
              "operator": "=",
              "quantity": 0,
              "unit": "NP",
              "dailyValueTargetGroup": [],
              "servingSizeUnit": "Gram(s)"
            }
          ],
          "nestedRows": [],
          "name": "organic Cauliflower",
          "category": "botanical",
          "ingredientGroup": "Cauliflower ",
          "uniiCode": null,
          "alternateNames": [],
          "forms": []
        },
        {
          "order": 53,
          "ingredientId": 246617,
          "description": "",
          "notes": "",
          "quantity": [
            {
              "servingSizeOrder": 1,
              "servingSizeQuantity": 43,
              "operator": "=",
              "quantity": 0,
              "unit": "NP",
              "dailyValueTargetGroup": [],
              "servingSizeUnit": "Gram(s)"
            }
          ],
          "nestedRows": [],
          "name": "organic Arugula",
          "category": "botanical",
          "ingredientGroup": "Arugula",
          "uniiCode": null,
          "alternateNames": [],
          "forms": []
        },
        {
          "order": 54,
          "ingredientId": 246618,
          "description": "",
          "notes": "",
          "quantity": [
            {
              "servingSizeOrder": 1,
              "servingSizeQuantity": 43,
              "operator": "=",
              "quantity": 0,
              "unit": "NP",
              "dailyValueTargetGroup": [],
              "servingSizeUnit": "Gram(s)"
            }
          ],
          "nestedRows": [],
          "name": "organic Watercress",
          "category": "botanical",
          "ingredientGroup": "Watercress",
          "uniiCode": null,
          "alternateNames": [],
          "forms": []
        },
        {
          "order": 55,
          "ingredientId": 246620,
          "description": "",
          "notes": "",
          "quantity": [
            {
              "servingSizeOrder": 1,
              "servingSizeQuantity": 43,
              "operator": "=",
              "quantity": 0,
              "unit": "NP",
              "dailyValueTargetGroup": [],
              "servingSizeUnit": "Gram(s)"
            }
          ],
          "nestedRows": [],
          "name": "organic Basil",
          "category": "botanical",
          "ingredientGroup": "Basil",
          "uniiCode": null,
          "alternateNames": [],
          "forms": []
        },
        {
          "order": 56,
          "ingredientId": 246621,
          "description": "",
          "notes": "",
          "quantity": [
            {
              "servingSizeOrder": 1,
              "servingSizeQuantity": 43,
              "operator": "=",
              "quantity": 0,
              "unit": "NP",
              "dailyValueTargetGroup": [],
              "servingSizeUnit": "Gram(s)"
            }
          ],
          "nestedRows": [],
          "name": "organic Peppers",
          "category": "botanical",
          "ingredientGroup": "Capsicum",
          "uniiCode": null,
          "alternateNames": [],
          "forms": []
        },
        {
          "order": 57,
          "ingredientId": 246623,
          "description": "",
          "notes": "",
          "quantity": [
            {
              "servingSizeOrder": 1,
              "servingSizeQuantity": 43,
              "operator": "=",
              "quantity": 0,
              "unit": "NP",
              "dailyValueTargetGroup": [],
              "servingSizeUnit": "Gram(s)"
            }
          ],
          "nestedRows": [],
          "name": "organic Swiss Chard",
          "category": "botanical",
          "ingredientGroup": "TBD",
          "uniiCode": null,
          "alternateNames": [],
          "forms": []
        },
        {
          "order": 58,
          "ingredientId": 246624,
          "description": "",
          "notes": "",
          "quantity": [
            {
              "servingSizeOrder": 1,
              "servingSizeQuantity": 43,
              "operator": "=",
              "quantity": 0,
              "unit": "NP",
              "dailyValueTargetGroup": [],
              "servingSizeUnit": "Gram(s)"
            }
          ],
          "nestedRows": [],
          "name": "organic Spearmint",
          "category": "botanical",
          "ingredientGroup": "Spearmint",
          "uniiCode": null,
          "alternateNames": [],
          "forms": []
        }
      ],
      "name": "Organic Live Greens Base",
      "category": "blend",
      "ingredientGroup": "Blend (Herb/Botanical)",
      "uniiCode": null,
      "alternateNames": [],
      "forms": []
    },
    {
      "order": 59,
      "ingredientId": 117246,
      "description": "",
      "notes": "",
      "quantity": [
        {
          "servingSizeOrder": 1,
          "servingSizeQuantity": 43,
          "operator": "=",
          "quantity": 500,
          "unit": "mg",
          "dailyValueTargetGroup": [
            {
              "name": "Adults and children 4 or more years of age",
              "operator": null,
              "percent": null,
              "footnote": "Daily Value not established"
            }
          ],
          "servingSizeUnit": "Gram(s)"
        }
      ],
      "nestedRows": [],
      "name": "organic Sunflower Lecithin",
      "category": "fat",
      "ingredientGroup": "lecithin",
      "uniiCode": null,
      "alternateNames": [],
      "forms": []
    },
    {
      "order": 60,
      "ingredientId": 246738,
      "description": "",
      "notes": "",
      "quantity": [
        {
          "servingSizeOrder": 1,
          "servingSizeQuantity": 43,
          "operator": "=",
          "quantity": 300,
          "unit": "mg",
          "dailyValueTargetGroup": [
            {
              "name": "Adults and children 4 or more years of age",
              "operator": null,
              "percent": null,
              "footnote": "Daily Value not established"
            }
          ],
          "servingSizeUnit": "Gram(s)"
        }
      ],
      "nestedRows": [],
      "name": "organic Apple Pectin",
      "category": "fiber",
      "ingredientGroup": "Pectin",
      "uniiCode": null,
      "alternateNames": [],
      "forms": []
    },
    {
      "order": 61,
      "ingredientId": 51215,
      "description": "",
      "notes": "",
      "quantity": [
        {
          "servingSizeOrder": 1,
          "servingSizeQuantity": 43,
          "operator": "=",
          "quantity": 160,
          "unit": "mg",
          "dailyValueTargetGroup": [
            {
              "name": "Adults and children 4 or more years of age",
              "operator": null,
              "percent": null,
              "footnote": "Daily Value not established"
            }
          ],
          "servingSizeUnit": "Gram(s)"
        }
      ],
      "nestedRows": [],
      "name": "organic Stevia extract",
      "category": "botanical",
      "ingredientGroup": "Stevia",
      "uniiCode": null,
      "alternateNames": [],
      "forms": []
    },
    {
      "order": 62,
      "ingredientId": 54212,
      "description": "",
      "notes": "",
      "quantity": [
        {
          "servingSizeOrder": 1,
          "servingSizeQuantity": 43,
          "operator": "=",
          "quantity": 15,
          "unit": "mg",
          "dailyValueTargetGroup": [
            {
              "name": "Adults and children 4 or more years of age",
              "operator": null,
              "percent": null,
              "footnote": "Daily Value not established"
            }
          ],
          "servingSizeUnit": "Gram(s)"
        }
      ],
      "nestedRows": [],
      "name": "organic Ginger extract",
      "category": "botanical",
      "ingredientGroup": "Ginger ",
      "uniiCode": null,
      "alternateNames": [],
      "forms": []
    },
    {
      "order": 63,
      "ingredientId": 54165,
      "description": "",
      "notes": "",
      "quantity": [
        {
          "servingSizeOrder": 1,
          "servingSizeQuantity": 43,
          "operator": "=",
          "quantity": 5,
          "unit": "mg",
          "dailyValueTargetGroup": [
            {
              "name": "Adults and children 4 or more years of age",
              "operator": null,
              "percent": null,
              "footnote": "Daily Value not established"
            }
          ],
          "servingSizeUnit": "Gram(s)"
        }
      ],
      "nestedRows": [],
      "name": "organic Amla extract",
      "category": "botanical",
      "ingredientGroup": "Indian Gooseberry",
      "uniiCode": null,
      "alternateNames": [],
      "forms": []
    },
    {
      "order": 64,
      "ingredientId": 284993,
      "description": "",
      "notes": "",
      "quantity": [
        {
          "servingSizeOrder": 1,
          "servingSizeQuantity": 43,
          "operator": "=",
          "quantity": 0,
          "unit": "NP",
          "dailyValueTargetGroup": [],
          "servingSizeUnit": "Gram(s)"
        }
      ],
      "nestedRows": [
        {
          "order": 65,
          "ingredientId": 285825,
          "description": "",
          "notes": "",
          "quantity": [
            {
              "servingSizeOrder": 1,
              "servingSizeQuantity": 43,
              "operator": "=",
              "quantity": 600,
              "unit": "mg",
              "dailyValueTargetGroup": [],
              "servingSizeUnit": "Gram(s)"
            }
          ],
          "nestedRows": [],
          "name": "Alanine",
          "category": "amino acid",
          "ingredientGroup": "Alanine",
          "uniiCode": "OF5P57N2ZX",
          "alternateNames": [],
          "forms": []
        },
        {
          "order": 66,
          "ingredientId": 285837,
          "description": "",
          "notes": "",
          "quantity": [
            {
              "servingSizeOrder": 1,
              "servingSizeQuantity": 43,
              "operator": "=",
              "quantity": 1100,
              "unit": "mg",
              "dailyValueTargetGroup": [],
              "servingSizeUnit": "Gram(s)"
            }
          ],
          "nestedRows": [],
          "name": "Arginine",
          "category": "amino acid",
          "ingredientGroup": "Arginine",
          "uniiCode": "94ZLA3W45F",
          "alternateNames": [],
          "forms": []
        },
        {
          "order": 67,
          "ingredientId": 285902,
          "description": "",
          "notes": "",
          "quantity": [
            {
              "servingSizeOrder": 1,
              "servingSizeQuantity": 43,
              "operator": "=",
              "quantity": 1600,
              "unit": "mg",
              "dailyValueTargetGroup": [],
              "servingSizeUnit": "Gram(s)"
            }
          ],
          "nestedRows": [],
          "name": "Aspartic Acid",
          "category": "amino acid",
          "ingredientGroup": "Aspartic Acid",
          "uniiCode": "30KYC7MIAI",
          "alternateNames": [],
          "forms": []
        },
        {
          "order": 68,
          "ingredientId": 285997,
          "description": "",
          "notes": "",
          "quantity": [
            {
              "servingSizeOrder": 1,
              "servingSizeQuantity": 43,
              "operator": "=",
              "quantity": 100,
              "unit": "mg",
              "dailyValueTargetGroup": [],
              "servingSizeUnit": "Gram(s)"
            }
          ],
          "nestedRows": [],
          "name": "Cysteine",
          "category": "amino acid",
          "ingredientGroup": "Cysteine",
          "uniiCode": "K848JZ4886",
          "alternateNames": [],
          "forms": []
        },
        {
          "order": 69,
          "ingredientId": 286129,
          "description": "",
          "notes": "",
          "quantity": [
            {
              "servingSizeOrder": 1,
              "servingSizeQuantity": 43,
              "operator": "=",
              "quantity": 2500,
              "unit": "mg",
              "dailyValueTargetGroup": [],
              "servingSizeUnit": "Gram(s)"
            }
          ],
          "nestedRows": [],
          "name": "Glutamic Acid",
          "category": "amino acid",
          "ingredientGroup": "Glutamic Acid",
          "uniiCode": "3KX376GY7L",
          "alternateNames": [],
          "forms": []
        },
        {
          "order": 70,
          "ingredientId": 286072,
          "description": "",
          "notes": "",
          "quantity": [
            {
              "servingSizeOrder": 1,
              "servingSizeQuantity": 43,
              "operator": "=",
              "quantity": 600,
              "unit": "mg",
              "dailyValueTargetGroup": [],
              "servingSizeUnit": "Gram(s)"
            }
          ],
          "nestedRows": [],
          "name": "Glycine",
          "category": "amino acid",
          "ingredientGroup": "Glycine",
          "uniiCode": "TE7660XO1C",
          "alternateNames": [],
          "forms": []
        },
        {
          "order": 71,
          "ingredientId": 286350,
          "description": "",
          "notes": "",
          "quantity": [
            {
              "servingSizeOrder": 1,
              "servingSizeQuantity": 43,
              "operator": "=",
              "quantity": 300,
              "unit": "mg",
              "dailyValueTargetGroup": [],
              "servingSizeUnit": "Gram(s)"
            }
          ],
          "nestedRows": [],
          "name": "Histidine",
          "category": "amino acid",
          "ingredientGroup": "Histidine",
          "uniiCode": "4QD397987E",
          "alternateNames": [],
          "forms": []
        },
        {
          "order": 72,
          "ingredientId": 285975,
          "description": "",
          "notes": "",
          "quantity": [
            {
              "servingSizeOrder": 1,
              "servingSizeQuantity": 43,
              "operator": "=",
              "quantity": 600,
              "unit": "mg",
              "dailyValueTargetGroup": [],
              "servingSizeUnit": "Gram(s)"
            }
          ],
          "nestedRows": [],
          "name": "Isoleucine",
          "category": "amino acid",
          "ingredientGroup": "Isoleucine",
          "uniiCode": "04Y7590D77",
          "alternateNames": [],
          "forms": []
        },
        {
          "order": 73,
          "ingredientId": 285978,
          "description": "",
          "notes": "",
          "quantity": [
            {
              "servingSizeOrder": 1,
              "servingSizeQuantity": 43,
              "operator": "=",
              "quantity": 1100,
              "unit": "mg",
              "dailyValueTargetGroup": [],
              "servingSizeUnit": "Gram(s)"
            }
          ],
          "nestedRows": [],
          "name": "Leucine",
          "category": "amino acid",
          "ingredientGroup": "Leucine",
          "uniiCode": "GMW67QNF9C",
          "alternateNames": [],
          "forms": []
        },
        {
          "order": 74,
          "ingredientId": 287296,
          "description": "",
          "notes": "",
          "quantity": [
            {
              "servingSizeOrder": 1,
              "servingSizeQuantity": 43,
              "operator": "=",
              "quantity": 1000,
              "unit": "mg",
              "dailyValueTargetGroup": [],
              "servingSizeUnit": "Gram(s)"
            }
          ],
          "nestedRows": [],
          "name": "Lysine",
          "category": "amino acid",
          "ingredientGroup": "Lysine",
          "uniiCode": "K3Z4F929H6",
          "alternateNames": [],
          "forms": []
        },
        {
          "order": 75,
          "ingredientId": 286814,
          "description": "",
          "notes": "",
          "quantity": [
            {
              "servingSizeOrder": 1,
              "servingSizeQuantity": 43,
              "operator": "=",
              "quantity": 100,
              "unit": "mg",
              "dailyValueTargetGroup": [],
              "servingSizeUnit": "Gram(s)"
            }
          ],
          "nestedRows": [],
          "name": "Methionine",
          "category": "amino acid",
          "ingredientGroup": "METHIONINE",
          "uniiCode": "AE28F7PNPL",
          "alternateNames": [],
          "forms": []
        },
        {
          "order": 76,
          "ingredientId": 287507,
          "description": "",
          "notes": "",
          "quantity": [
            {
              "servingSizeOrder": 1,
              "servingSizeQuantity": 43,
              "operator": "=",
              "quantity": 700,
              "unit": "mg",
              "dailyValueTargetGroup": [],
              "servingSizeUnit": "Gram(s)"
            }
          ],
          "nestedRows": [],
          "name": "Phenylalanine",
          "category": "amino acid",
          "ingredientGroup": "Phenylalanine",
          "uniiCode": "47E5O17Y3R",
          "alternateNames": [],
          "forms": []
        },
        {
          "order": 77,
          "ingredientId": 287543,
          "description": "",
          "notes": "",
          "quantity": [
            {
              "servingSizeOrder": 1,
              "servingSizeQuantity": 43,
              "operator": "=",
              "quantity": 700,
              "unit": "mg",
              "dailyValueTargetGroup": [],
              "servingSizeUnit": "Gram(s)"
            }
          ],
          "nestedRows": [],
          "name": "Proline",
          "category": "amino acid",
          "ingredientGroup": "Proline",
          "uniiCode": "9DLQ4CIU6V",
          "alternateNames": [],
          "forms": []
        },
        {
          "order": 78,
          "ingredientId": 287679,
          "description": "",
          "notes": "",
          "quantity": [
            {
              "servingSizeOrder": 1,
              "servingSizeQuantity": 43,
              "operator": "=",
              "quantity": 700,
              "unit": "mg",
              "dailyValueTargetGroup": [],
              "servingSizeUnit": "Gram(s)"
            }
          ],
          "nestedRows": [],
          "name": "Serine",
          "category": "amino acid",
          "ingredientGroup": "Serine",
          "uniiCode": "452VLY9402",
          "alternateNames": [],
          "forms": []
        },
        {
          "order": 79,
          "ingredientId": 287685,
          "description": "",
          "notes": "",
          "quantity": [
            {
              "servingSizeOrder": 1,
              "servingSizeQuantity": 43,
              "operator": "=",
              "quantity": 500,
              "unit": "mg",
              "dailyValueTargetGroup": [],
              "servingSizeUnit": "Gram(s)"
            }
          ],
          "nestedRows": [],
          "name": "Threonine",
          "category": "amino acid",
          "ingredientGroup": "THREONINE",
          "uniiCode": "2ZD004190S",
          "alternateNames": [],
          "forms": []
        },
        {
          "order": 80,
          "ingredientId": 287695,
          "description": "",
          "notes": "",
          "quantity": [
            {
              "servingSizeOrder": 1,
              "servingSizeQuantity": 43,
              "operator": "=",
              "quantity": 100,
              "unit": "mg",
              "dailyValueTargetGroup": [],
              "servingSizeUnit": "Gram(s)"
            }
          ],
          "nestedRows": [],
          "name": "Tryptophan",
          "category": "amino acid",
          "ingredientGroup": "Tryptophan",
          "uniiCode": "8DUH1N11BX",
          "alternateNames": [],
          "forms": []
        },
        {
          "order": 81,
          "ingredientId": 287706,
          "description": "",
          "notes": "",
          "quantity": [
            {
              "servingSizeOrder": 1,
              "servingSizeQuantity": 43,
              "operator": "=",
              "quantity": 500,
              "unit": "mg",
              "dailyValueTargetGroup": [],
              "servingSizeUnit": "Gram(s)"
            }
          ],
          "nestedRows": [],
          "name": "Tyrosine",
          "category": "amino acid",
          "ingredientGroup": "Tyrosine",
          "uniiCode": "42HK56048U",
          "alternateNames": [],
          "forms": []
        },
        {
          "order": 82,
          "ingredientId": 285977,
          "description": "",
          "notes": "",
          "quantity": [
            {
              "servingSizeOrder": 1,
              "servingSizeQuantity": 43,
              "operator": "=",
              "quantity": 700,
              "unit": "mg",
              "dailyValueTargetGroup": [],
              "servingSizeUnit": "Gram(s)"
            }
          ],
          "nestedRows": [],
          "name": "Valine",
          "category": "amino acid",
          "ingredientGroup": "Valine",
          "uniiCode": "HG18B9YRS7",
          "alternateNames": [],
          "forms": []
        }
      ],
      "name": "Amino Acid Profile",
      "category": "other",
      "ingredientGroup": "Header",
      "uniiCode": "1",
      "alternateNames": [],
      "forms": []
    }
  ],
  "otheringredients": {
    "text": null,
    "ingredients": [
      {
        "order": 1,
        "ingredientId": 246740,
        "name": "Flavor",
        "category": "other",
        "ingredientGroup": "Flavor",
        "uniiCode": null,
        "alternateNames": [],
        "forms": [
          {
            "order": 1,
            "ingredientId": 245810,
            "prefix": null,
            "percent": null,
            "name": "organic French Vanilla flavor"
          },
          {
            "order": 2,
            "ingredientId": 246719,
            "prefix": null,
            "percent": null,
            "name": "organic natural source Flavor"
          },
          {
            "order": 3,
            "ingredientId": 245811,
            "prefix": null,
            "percent": null,
            "name": "organic goodest Cream flavor"
          }
        ]
      },
      {
        "order": 2,
        "ingredientId": 246625,
        "name": "Organic Vegan Creamer Blend",
        "category": "other",
        "ingredientGroup": "Flavor",
        "uniiCode": null,
        "alternateNames": [],
        "forms": []
      },
      {
        "order": 3,
        "ingredientId": 83131,
        "name": "organic Guar Gum",
        "category": "fiber",
        "ingredientGroup": "Guar",
        "uniiCode": null,
        "alternateNames": [],
        "forms": []
      }
    ]
  },
  "offMarket": 0,
  "entryDate": "2020-05-22"
}