<?xml version="1.0" encoding="UTF-8" standalone="no"?>
<!-- Created with Inkscape (http://www.inkscape.org/) -->

<svg
   width="210mm"
   height="297mm"
   viewBox="0 0 210 297"
   version="1.1"
   id="svg1"
   inkscape:version="1.3 (0e150ed, 2023-07-21)"
   sodipodi:docname="arch_inkscape.svg"
   xmlns:inkscape="http://www.inkscape.org/namespaces/inkscape"
   xmlns:sodipodi="http://sodipodi.sourceforge.net/DTD/sodipodi-0.dtd"
   xmlns="http://www.w3.org/2000/svg"
   xmlns:svg="http://www.w3.org/2000/svg">
  <sodipodi:namedview
     id="namedview1"
     pagecolor="#ffffff"
     bordercolor="#000000"
     borderopacity="0.25"
     inkscape:showpageshadow="2"
     inkscape:pageopacity="0.0"
     inkscape:pagecheckerboard="0"
     inkscape:deskcolor="#d1d1d1"
     inkscape:document-units="mm"
     inkscape:zoom="1.0280428"
     inkscape:cx="300.08479"
     inkscape:cy="339.96639"
     inkscape:window-width="1452"
     inkscape:window-height="991"
     inkscape:window-x="26"
     inkscape:window-y="23"
     inkscape:window-maximized="0"
     inkscape:current-layer="layer1" />
  <defs
     id="defs1" />
  <g
     inkscape:label="Layer 1"
     inkscape:groupmode="layer"
     id="layer1">
    <text
       xml:space="preserve"
       style="font-size:3.175px;fill:#000000;stroke-width:0.264583"
       x="23.424335"
       y="69.99453"
       id="text1"><tspan
         sodipodi:role="line"
         id="tspan1"
         style="stroke-width:0.264583"
         x="23.424335"
         y="69.99453">intro</tspan></text>
    <text
       xml:space="preserve"
       style="font-size:3.175px;fill:#000000;stroke-width:0.264583"
       x="71.556808"
       y="71.819214"
       id="text2"><tspan
         sodipodi:role="line"
         id="tspan2"
         style="stroke-width:0.264583"
         x="71.556808"
         y="71.819214">aggregator</tspan></text>
    <text
       xml:space="preserve"
       style="font-size:3.175px;fill:#000000;stroke-width:0.264583"
       x="155.30736"
       y="43.591377"
       id="text3"><tspan
         sodipodi:role="line"
         id="tspan3"
         style="stroke-width:0.264583"
         x="155.30736"
         y="43.591377">health scan</tspan></text>
    <path
       style="fill:#000000;stroke-width:0.264583"
       id="path3"
       d="m 27.574324,60.197416 c -1.596626,0.0436 -3.183115,0.243332 -4.774197,0.37323 -1.945706,0.166946 -3.88371,0.366786 -5.816756,0.643178 -1.077484,0.242729 -2.084774,0.751006 -2.890076,1.514253 -0.373626,0.354115 -0.716404,0.808249 -1.037455,1.207989 -0.918297,1.171366 -1.376262,2.536518 -1.58931,3.989218 -0.197268,1.426835 -0.133725,2.849375 0.0842,4.267068 0.339217,2.11052 1.723438,3.675705 3.105108,5.209177 1.754876,1.759162 3.875728,2.764108 6.136669,3.884549 0.396756,0.196615 0.841084,0.278741 1.268587,0.394129 0.951826,0.25691 1.488244,0.328665 2.446108,0.49517 2.539825,0.349957 5.114623,0.238779 7.665346,0.0886 1.45905,-0.09973 2.949319,-0.169611 4.349914,-0.635293 0.744601,-0.247574 1.051891,-0.444082 1.737493,-0.804694 0.927097,-0.626035 1.860184,-1.267102 2.561571,-2.151864 0.44168,-0.557151 0.46605,-0.661619 0.808646,-1.281213 0.607695,-1.247727 0.803153,-2.619732 0.820814,-3.992753 0.02397,-1.338802 -0.391856,-2.611532 -0.89417,-3.834413 -0.380862,-1.014666 -1.099899,-1.789639 -1.864537,-2.52771 -0.751983,-0.740436 -1.679734,-1.265248 -2.580129,-1.802011 -0.277299,-0.158676 -0.550177,-0.324932 -0.826831,-0.484714 -12.336285,-7.124845 7.705304,4.433575 -4.554291,-2.621618 -0.121526,-0.06994 -0.242369,-0.141052 -0.363554,-0.21158 -0.70816,-0.431813 -1.486447,-0.71973 -2.263449,-0.999249 -0.583912,-0.292007 -1.199394,-0.455345 -1.844437,-0.525089 0,0 3.142908,2.352632 3.142908,2.352632 v 0 c 0.616821,0.111519 1.195891,0.335 1.773325,0.575371 0.765421,0.29251 1.520442,0.609764 2.218082,1.045186 0.120298,0.06767 0.480166,0.272492 0.360897,0.20302 -0.975773,-0.568372 -3.909423,-2.262573 -2.930446,-1.699741 12.474509,7.171822 -2.078186,-1.224831 1.25557,0.732284 0.141591,0.08313 0.283543,0.165638 0.425317,0.248455 0.900586,0.506325 1.820868,1.025977 2.596193,1.712439 0.767939,0.704612 1.556321,1.410501 1.960321,2.398363 0.535356,1.166468 0.975064,2.397958 0.976556,3.697607 0.0057,1.312389 -0.154104,2.631618 -0.712853,3.834421 -0.812486,1.48145 -1.767219,2.385031 -3.213645,3.267673 -0.707517,0.362337 -0.907064,0.500888 -1.675914,0.744575 -1.370049,0.434234 -2.820664,0.503473 -4.241437,0.623504 -2.546128,0.157326 -5.109665,0.204258 -7.640354,-0.177705 -0.941129,-0.169225 -1.452179,-0.235093 -2.384177,-0.514519 -0.422812,-0.126767 -1.54505,-0.765816 -1.249793,-0.437693 0.528367,0.587182 1.323829,0.862703 1.999874,1.271262 0.67048,0.405197 -2.640126,-1.654058 -1.858531,-1.438552 -1.348732,-1.457722 -2.722708,-2.942627 -3.094451,-4.964351 -0.224903,-1.379241 -0.291576,-2.763097 -0.11599,-4.154937 0.195183,-1.388332 0.574037,-2.707016 1.467072,-3.823539 0.314021,-0.388006 0.624086,-0.800558 0.993405,-1.14047 0.774538,-0.71287 1.740233,-1.154153 2.766777,-1.354633 1.906553,-0.302543 3.827531,-0.478723 5.748972,-0.658968 1.646962,-0.127786 3.29824,-0.315884 4.952055,-0.207476 z" />
    <path
       style="fill:#000000;stroke-width:0.264583"
       id="path4"
       d="m 75.066862,62.190914 c -1.682353,0.03932 -3.362007,0.180576 -5.026181,0.426884 -1.296469,0.205796 -2.608683,0.345012 -3.866478,0.741365 -0.709303,0.223518 -0.820208,0.309161 -1.477875,0.634061 -1.497732,0.854953 -2.415302,2.011508 -3.272142,3.472553 -0.455459,0.957064 -0.92367,1.988995 -0.962133,3.069365 -0.0072,0.201943 0.01331,0.403921 0.01998,0.605883 0.123468,1.57322 0.77425,2.290857 1.783175,3.42212 1.28742,1.311596 2.66627,2.533042 4.165098,3.596947 1.919642,1.093322 3.784496,2.429582 5.905584,3.145436 1.147599,0.387305 2.320941,0.605306 3.511071,0.808857 2.381409,0.309359 4.788333,0.350946 7.186653,0.373888 2.02973,-0.01595 4.05944,0.0046 6.08911,0.01728 1.27045,0.06112 2.4992,-0.291904 3.66484,-0.762715 1.31661,-0.690406 2.51154,-1.563883 3.63349,-2.532925 0.93045,-0.880139 1.67794,-1.910336 2.33511,-3.002925 0.65602,-0.931542 0.96156,-2.002444 1.14471,-3.111307 0.208286,-1.130567 -0.0828,-2.177632 -0.51609,-3.212216 -0.56617,-1.219176 -1.51415,-2.172907 -2.50723,-3.051715 -2.26786,-1.61395 -4.58657,-2.902961 -7.25772,-3.547234 -1.3785,-0.332185 -2.77624,-0.587677 -4.18376,-0.759778 -1.16572,-0.09208 -2.32096,-0.273542 -3.48846,-0.344847 -1.07581,-0.03054 -2.14814,-0.05459 -3.22083,-0.14388 -0.871657,-0.08921 -1.745819,-0.143603 -2.621068,-0.180208 -0.279406,-0.01127 -0.559017,-0.01418 -0.838597,-0.01701 0,0 3.179723,2.315451 3.179723,2.315451 v 0 c 0.272616,0.0031 0.545234,0.0065 0.817769,0.01429 0.856033,0.02654 1.710243,0.08576 2.563493,0.159317 1.0761,0.08509 2.15335,0.08178 3.23071,0.145986 1.1532,0.09171 2.30158,0.229574 3.45257,0.344559 1.39234,0.179985 2.77472,0.43747 4.1356,0.784109 0.6972,0.190695 1.3831,0.392541 2.04627,0.684942 0.22034,0.09715 0.85466,0.442111 0.65008,0.315087 -1.55124,-0.963178 -3.77115,-2.164519 -2.01831,-1.209519 1.00082,0.823214 1.94976,1.729293 2.56464,2.885776 0.44163,0.987838 0.76557,1.906387 0.58935,3.007551 -0.14933,1.068713 -0.42156,2.091192 -1.05165,2.988246 -0.6465,1.046853 -1.33149,2.078085 -2.24099,2.919413 -1.09971,0.940604 -2.26591,1.807596 -3.59293,2.405451 -1.13885,0.430747 -2.32574,0.714097 -3.55269,0.668573 -2.00378,0.02716 -4.00783,0.06699 -6.0118,0.03286 -2.380892,-0.02281 -4.77236,-0.04046 -7.130618,-0.409416 -1.561513,-0.29065 -3.067661,-0.646298 -4.514728,-1.321631 -0.299154,-0.139613 -1.160013,-0.629285 -0.879872,-0.454625 0.797642,0.49731 1.622769,0.949121 2.434153,1.423683 -1.514311,-1.014307 -2.878193,-2.219622 -4.169267,-3.504692 -0.750308,-0.811641 -0.297812,-0.297191 -0.964276,-1.111562 -0.130837,-0.159875 -0.28556,-0.302221 -0.395679,-0.47701 -0.293437,-0.465751 -0.39052,-1.042638 -0.4874,-1.57168 -0.07545,-1.293739 0.21027,-2.346291 0.792091,-3.507529 0.825495,-1.428157 1.686232,-2.470644 3.156651,-3.27914 0.635215,-0.300775 0.737629,-0.375618 1.417188,-0.588954 1.233204,-0.387141 2.522109,-0.530979 3.792966,-0.735589 1.716281,-0.222055 3.446799,-0.354479 5.17811,-0.253119 z" />
    <path
       style="fill:#000000;stroke-width:0.264583"
       id="path5"
       d="m 167.13791,35.641444 c -1.50436,0.06606 -2.99572,0.278572 -4.48877,0.462494 -2.40566,0.274135 -4.82829,0.335839 -7.24711,0.372502 -1.88115,0.0097 -3.76241,0.0094 -5.64356,-0.0016 -0.92772,0.04536 -1.97733,-0.178234 -2.85671,0.233187 -0.12427,0.05814 -0.23167,0.147045 -0.34751,0.22057 -0.74738,0.614749 -0.89124,1.532271 -0.99884,2.440104 -0.2029,1.421003 0.20757,2.57787 0.93428,3.776652 0.51152,0.67052 1.17134,1.168212 1.90668,1.571601 3.44666,1.890752 3.36297,2.159307 6.2383,2.704269 2.21633,0.389832 4.46448,0.313632 6.70169,0.246854 2.64872,-0.170079 5.29791,0.0295 7.93573,0.266991 2.51141,0.331891 5.04214,0.264769 7.56765,0.320879 1.71706,0.01807 3.45204,0.04857 5.16291,-0.129567 1.02339,-0.05693 1.52225,-0.491228 2.15097,-1.254257 0.78811,-1.071123 1.43566,-2.235708 2.11817,-3.374755 0.35056,-0.722659 1.05791,-1.59363 1.22205,-2.391029 0.0276,-0.134025 0.0163,-0.273185 0.0244,-0.409776 -0.0613,-0.149752 -0.0946,-0.314386 -0.18401,-0.449252 -0.21519,-0.324511 -0.66894,-0.668142 -0.98871,-0.854001 -2.5091,-1.458325 -3.31324,-2.13007 -5.58134,-2.751934 -1.79138,-0.388003 -3.62267,-0.523203 -5.4376,-0.752332 -1.2765,-0.147897 -2.55166,-0.30026 -3.82837,-0.44645 -1.01977,-0.132993 -2.03492,-0.143476 -3.05716,-0.06264 -0.63977,0.07732 -1.29129,0.05376 -1.92645,0.163341 0,0 3.21731,2.263526 3.21731,2.263526 v 0 c 0.61533,-0.08103 1.23579,-0.12006 1.85386,-0.174239 1.00393,-0.05571 2.0058,-0.0058 3.00479,0.110019 1.25909,0.138674 2.51744,0.281723 3.77756,0.411168 1.80178,0.196543 3.62011,0.341159 5.38133,0.791858 0.28418,0.09198 0.5726,0.171731 0.85253,0.275932 0.25669,0.09555 0.98308,0.475326 0.75566,0.322699 -0.82982,-0.556903 -1.71426,-1.027764 -2.57155,-1.541373 -0.3413,-0.20448 0.68915,0.407361 0.98727,0.670854 0.091,0.08045 0.16893,0.174649 0.25339,0.261974 0.0178,0.09642 0.0624,0.191633 0.0533,0.289261 -0.0118,0.127175 -0.0708,0.245637 -0.114,0.365813 -0.25209,0.700461 -0.62676,1.350394 -1.00341,1.989082 -0.6697,1.120143 -1.30349,2.272983 -2.12141,3.293975 -0.601,0.651238 -1.08702,0.949238 -1.98332,1.018517 -1.65571,0.181848 -3.32675,0.208049 -4.99092,0.196926 -2.51006,-0.01924 -5.01872,-0.06725 -7.51873,-0.315822 -2.67081,-0.203753 -5.34674,-0.456158 -8.0272,-0.281766 -2.2217,0.07267 -4.45496,0.104416 -6.64946,-0.316743 -0.35766,-0.07978 -0.7192,-0.143827 -1.07299,-0.239347 -0.33612,-0.09075 -1.25822,-0.546285 -0.99459,-0.318889 0.68862,0.593979 1.55336,0.947118 2.30919,1.452816 0.2464,0.164859 -0.529,-0.269814 -0.77906,-0.429061 -0.22158,-0.141103 -0.43126,-0.30125 -0.63264,-0.469929 -0.18046,-0.151152 -0.34046,-0.32516 -0.51068,-0.487741 -0.7361,-1.063078 -1.22131,-2.200503 -1.01511,-3.519125 0.0964,-0.778177 0.18562,-1.599647 0.85435,-2.108679 0.92194,-0.474525 1.99199,-0.316278 2.99513,-0.351851 1.85625,-0.0093 3.71272,-0.0086 5.56842,-0.06229 2.43762,-0.05904 4.87772,-0.126841 7.30498,-0.375166 1.53917,-0.169886 3.08562,-0.374835 4.63775,-0.300559 z" />
    <text
       xml:space="preserve"
       style="font-size:3.175px;fill:#000000;stroke-width:0.264583"
       x="153.71475"
       y="147.74574"
       id="text3-3"><tspan
         sodipodi:role="line"
         id="tspan3-6"
         style="stroke-width:0.264583"
         x="153.71475"
         y="147.74574">health scan</tspan></text>
    <path
       style="fill:#000000;stroke-width:0.264583"
       id="path5-5"
       d="m 165.54529,139.79582 c -1.50436,0.0661 -2.99572,0.27857 -4.48877,0.46249 -2.40566,0.27414 -4.82829,0.33584 -7.24711,0.3725 -1.88115,0.01 -3.76241,0.009 -5.64356,-0.002 -0.92772,0.0454 -1.97733,-0.17823 -2.85671,0.23319 -0.12427,0.0581 -0.23167,0.14705 -0.34751,0.22057 -0.74738,0.61475 -0.89124,1.53227 -0.99884,2.44011 -0.2029,1.421 0.20757,2.57787 0.93428,3.77665 0.51152,0.67052 1.17134,1.16821 1.90668,1.5716 3.44666,1.89075 3.36297,2.15931 6.2383,2.70427 2.21633,0.38983 4.46448,0.31363 6.70169,0.24685 2.64872,-0.17008 5.29791,0.0295 7.93573,0.26699 2.51141,0.33189 5.04214,0.26477 7.56765,0.32088 1.71706,0.0181 3.45204,0.0486 5.16291,-0.12957 1.02339,-0.0569 1.52225,-0.49122 2.15097,-1.25425 0.78811,-1.07113 1.43566,-2.23571 2.11817,-3.37476 0.35056,-0.72266 1.05791,-1.59363 1.22205,-2.39103 0.0276,-0.13402 0.0163,-0.27318 0.0244,-0.40977 -0.0613,-0.14975 -0.0946,-0.31439 -0.18401,-0.44925 -0.21519,-0.32452 -0.66894,-0.66815 -0.98871,-0.85401 -2.5091,-1.45832 -3.31324,-2.13007 -5.58134,-2.75193 -1.79138,-0.388 -3.62267,-0.5232 -5.4376,-0.75233 -1.2765,-0.1479 -2.55166,-0.30026 -3.82837,-0.44645 -1.01977,-0.13299 -2.03492,-0.14348 -3.05716,-0.0626 -0.63977,0.0773 -1.29129,0.0538 -1.92645,0.16334 0,0 3.21731,2.26353 3.21731,2.26353 v 0 c 0.61533,-0.081 1.23579,-0.12006 1.85386,-0.17424 1.00393,-0.0557 2.0058,-0.006 3.00479,0.11002 1.25909,0.13867 2.51744,0.28172 3.77756,0.41116 1.80178,0.19655 3.62011,0.34116 5.38133,0.79186 0.28418,0.092 0.5726,0.17173 0.85253,0.27593 0.25669,0.0956 0.98308,0.47533 0.75566,0.3227 -0.82982,-0.5569 -1.71426,-1.02776 -2.57155,-1.54137 -0.3413,-0.20448 0.68915,0.40736 0.98727,0.67085 0.091,0.0804 0.16893,0.17465 0.25339,0.26198 0.0178,0.0964 0.0624,0.19163 0.0533,0.28926 -0.0118,0.12717 -0.0708,0.24564 -0.114,0.36581 -0.25209,0.70046 -0.62676,1.3504 -1.00341,1.98908 -0.6697,1.12015 -1.30349,2.27299 -2.12141,3.29398 -0.601,0.65124 -1.08702,0.94924 -1.98332,1.01852 -1.65571,0.18184 -3.32675,0.20804 -4.99092,0.19692 -2.51006,-0.0192 -5.01872,-0.0673 -7.51873,-0.31582 -2.67081,-0.20375 -5.34674,-0.45616 -8.0272,-0.28177 -2.2217,0.0727 -4.45496,0.10442 -6.64946,-0.31674 -0.35766,-0.0798 -0.7192,-0.14383 -1.07299,-0.23935 -0.33612,-0.0907 -1.25822,-0.54628 -0.99459,-0.31889 0.68862,0.59398 1.55336,0.94712 2.30919,1.45282 0.2464,0.16486 -0.529,-0.26981 -0.77906,-0.42906 -0.22158,-0.1411 -0.43126,-0.30125 -0.63264,-0.46993 -0.18046,-0.15115 -0.34046,-0.32516 -0.51068,-0.48774 -0.7361,-1.06308 -1.22131,-2.2005 -1.01511,-3.51913 0.0964,-0.77817 0.18562,-1.59964 0.85435,-2.10867 0.92194,-0.47453 1.99199,-0.31628 2.99513,-0.35186 1.85625,-0.009 3.71272,-0.009 5.56842,-0.0623 2.43762,-0.059 4.87772,-0.12684 7.30498,-0.37516 1.53917,-0.16989 3.08562,-0.37484 4.63775,-0.30056 z" />
    <path
       style="fill:#000000;stroke-width:0.264583"
       d="m 156.3338,78.977201 c -1.39831,0.575312 -1.11793,1.028237 -1.11793,2.19465 0,1.755782 2.39022,1.527106 3.78408,1.527106 0.31459,0 0.97915,0.141726 1.23053,0 0.25377,-0.143068 0.45297,-2.297629 0.23123,-2.519373 -0.0607,-0.06066 -0.18087,0.03884 -0.25736,0 -0.33876,-0.172024 -0.35768,-0.616816 -0.51474,-0.775116 -0.31542,-0.317912 -0.97023,-0.46456 -1.28582,-0.777123 -0.061,-0.06037 0.0597,-0.19575 0,-0.257366 -0.0947,-0.09772 -0.2791,-0.04305 -0.40817,0 -0.55946,0.186592 -1.10788,0.404815 -1.66182,0.607222 z"
       id="path6" />
    <path
       style="fill:#000000;stroke-width:0.264583"
       d="m 166.09763,79.684958 c -1.94552,0.261033 -0.86485,0.37469 -1.33006,1.212435 -0.0417,0.075 -0.19623,-0.06018 -0.25737,0 -0.0293,0.02888 -0.44904,0.917085 -0.25435,1.042535 0.15984,0.102992 0.53445,-0.06321 0.7168,0 0.33895,0.11748 3.07602,1.169207 3.36084,0.844481 0.0819,-0.09336 0.84947,-1.120904 0.70575,-1.251643 -0.34662,-0.315317 0.0612,0.63981 -0.40113,-0.174929 -0.19781,-0.348594 0.0162,-0.612275 -0.22117,-0.918877 -0.28706,-0.3708 -2.06724,-0.72014 -2.31931,-0.754002 z"
       id="path7" />
    <path
       style="fill:#000000;stroke-width:0.264583"
       d="m 174.27201,80.028784 c -0.9375,0.580218 -1.23573,0.437611 -1.49895,1.232541 -0.10855,0.327813 0.12794,1.404297 0.21514,1.519063 0.22506,0.296203 3.8308,1.178327 4.17416,0.971155 0.18979,-0.114514 0.34678,-0.296108 0.44335,-0.49563 0.1882,-0.388856 0.86983,-1.718919 0.51574,-2.252959 -0.34485,-0.520092 -1.32828,-2.699623 -2.45906,-1.993583 -0.48746,0.304366 -0.92692,0.679609 -1.39038,1.019413 z"
       id="path8" />
    <path
       style="fill:none;stroke-width:0.264583;stroke:#000000;stroke-opacity:1"
       d="m 144.99914,39.422249 c -0.96253,-0.07733 -1.32609,-0.116609 -1.99811,0.388059 -0.75997,0.570715 -0.55005,0.883241 -0.92641,1.570837 -0.0655,0.119623 -0.21773,0.173109 -0.28954,0.289036 -0.18655,0.301114 -0.23801,1.216232 -0.12868,1.544196 0.0827,0.248028 0.86132,0.930142 1.06716,1.070684 0.63966,0.436745 1.31982,0.588113 2.0348,0.8671 0.23456,0.09153 0.44498,0.241433 0.68413,0.320202 0.13132,0.04325 2.5369,0.06494 2.73301,0 0.53504,-0.177197 0.73215,-0.600496 1.1692,-0.909328 0.67402,-0.476277 0.38699,-0.01662 0.96814,-0.581586 0.35526,-0.345377 0.15115,-0.510884 0.28552,-0.770591 0.24916,-0.481574 0.26444,-0.724715 0.12717,-1.27376 -0.14802,-0.592095 0.17623,-0.320191 -0.25837,-0.899274 -0.058,-0.07731 -0.0606,-0.191307 -0.12868,-0.259879 -0.28676,-0.288628 -0.80249,-0.167275 -1.15061,-0.220673 -0.40199,-0.06166 -0.49188,-0.176694 -0.87364,-0.286017 -0.15155,-0.0434 -0.34566,0.03628 -0.49814,0 -0.14417,-0.03431 -0.27185,-0.122825 -0.41621,-0.156329 -0.12535,-0.02909 -0.27095,0.05755 -0.38605,0 -0.0543,-0.02713 -0.0711,-0.109723 -0.12868,-0.128683 -0.12405,-0.04082 -0.51636,0 -0.64844,0 -0.33551,0 -1.01725,-0.432049 -1.23757,-0.563994 z"
       id="path9" />
    <path
       style="fill:none;stroke:#000000;stroke-width:0.264583;stroke-opacity:1"
       d="m 103.11733,67.699842 c -0.17831,0.354118 -0.48346,0.696923 -0.61124,1.085262 -0.082,0.249235 -0.10267,1.274416 0,1.473319 0.1207,0.233818 0.68564,0.293108 0.8857,0.364937 0.30918,0.111009 0.57037,0.05161 0.87866,0.128683 1.31833,0.329581 2.69123,0.01447 3.47897,-1.171718 0.007,-0.01061 0.25304,-0.244835 0.25938,-0.257368 0.0571,-0.112879 0,-0.253008 0,-0.379513 0,-0.324382 0.0843,-0.688401 -0.22721,-0.899776 -0.0858,-0.0582 -0.20778,-0.05691 -0.2835,-0.127678 -0.0709,-0.06626 -0.0633,-0.190508 -0.1312,-0.259879 -0.0133,-0.01357 -1.04126,-0.540615 -1.04957,-0.543385 -0.21969,-0.07323 -1.8176,-0.06913 -2.00062,0 -0.36158,0.136586 -0.8294,0.415927 -1.19937,0.587116 z"
       id="path10" />
    <path
       style="fill:none;stroke:#000000;stroke-width:0.264583;stroke-opacity:1"
       d="m 107.50613,67.815959 c 0.82234,-0.552209 1.79367,-1.03469 2.45654,-1.791509 0.15443,-0.176319 0.26056,-0.3937 0.42727,-0.558464 0.18134,-0.179226 0.43928,-0.273064 0.60772,-0.464466 0.19764,-0.224586 0.27725,-0.536392 0.47251,-0.76305 0.1155,-0.134075 0.30097,-0.187513 0.44034,-0.296574 0.17259,-0.135065 0.31468,-0.307764 0.49362,-0.434306 0.55363,-0.391522 1.10723,-0.788101 1.70052,-1.116425 1.01198,-0.560017 0.53584,-0.03866 1.36927,-0.613254 0.24826,-0.171159 0.44806,-0.407707 0.70122,-0.571534 0.75787,-0.490443 1.59402,-0.862463 2.33992,-1.384348 1.05563,-0.73859 2.06255,-1.540753 3.11252,-2.284627 1.15304,-0.816893 0.15361,-0.09389 1.20691,-0.56701 0.52461,-0.23564 0.33162,-0.336447 0.83343,-0.701725 0.15817,-0.115144 0.36573,-0.14896 0.52478,-0.262895 0.36755,-0.263287 0.60101,-0.683062 0.95909,-0.959091 0.17002,-0.131059 0.39695,-0.175205 0.5655,-0.308137 2.61316,-2.060815 -1.05884,0.548921 1.19736,-1.060127 1.08477,-0.773623 2.2043,-1.512818 3.31409,-2.24391 0.83609,-0.550791 1.51045,-1.323835 2.36103,-1.857356 0.98218,-0.616064 0.0928,0.166399 1.24511,-0.697704 0.40393,-0.3029 0.75018,-0.63124 1.17725,-0.916868 0.29176,-0.195133 0.64321,-0.300469 0.91234,-0.525791 0.1198,-0.100293 0.14983,-0.279167 0.25988,-0.39007 0.15752,-0.15875 0.34626,-0.283138 0.51976,-0.424251 0.63934,-0.519999 0.28317,-0.0682 1.00433,-0.580583 0.18031,-0.128106 0.30942,-0.319591 0.4896,-0.447877 0.42466,-0.302349 0.99041,-0.554466 1.41501,-0.804772 0.57126,-0.336764 1.52603,-1.277279 2.16851,-1.277279"
       id="path11" />
    <path
       style="fill:none;stroke:#000000;stroke-width:0.264583;stroke-opacity:1"
       d="m 105.71613,76.94592 c -1.65776,0.150601 -0.9608,0.131197 -2.08758,0.131197 -0.82534,0 -0.91183,0.360137 -1.32453,0.983218 -0.13935,0.210378 -0.29689,0.251769 -0.38605,0.519255 -0.0716,0.214815 0,0.540573 0,0.772099 0,0.148913 -0.0674,0.508551 0,0.643417 0.0973,0.194635 1.05448,0.89296 1.22249,0.93496 0.12484,0.03121 0.25947,-0.0232 0.38605,0 0.11192,0.02051 0.20373,0.111268 0.31617,0.128683 0.2017,0.03124 2.3685,-0.07639 2.42337,-0.128683 0.0296,-0.02821 -0.0234,-0.08911 0,-0.12265 0.13106,-0.188108 0.32128,-0.60266 0.43229,-0.747969 0.12326,-0.161338 -0.0918,-0.557747 0,-0.74395 0.10433,-0.211609 0.19534,-0.436944 0.12416,-0.717307 -0.0675,-0.265758 -0.19332,-0.508362 -0.25988,-0.774612 -0.062,-0.248193 0.0759,-0.551789 -0.12868,-0.73641 -0.18104,-0.163375 -0.48015,-0.08664 -0.71781,-0.141248 z"
       id="path12" />
    <path
       style="fill:none;stroke:#000000;stroke-width:0.264583;stroke-opacity:1"
       d="m 106.18361,80.984859 c 0.37406,1.507416 1.65706,2.536838 2.25798,3.919805 1.00179,2.305497 1.13761,4.92089 1.79453,7.315832 0.74117,2.702086 1.88028,5.292016 2.79333,7.937134 0.77068,2.23267 1.5104,4.47967 2.23385,6.72318 0.23254,0.72111 0.67133,1.36501 0.89928,2.08758 0.10319,0.32711 0.0339,0.69687 0.15733,1.0169 0.12516,0.32455 0.40694,0.56668 0.57154,0.87313 0.17991,0.33498 0.30562,0.69637 0.45843,1.04455 0.26708,0.41503 0.56565,0.81143 0.80125,1.24511 0.20486,0.37708 0.60451,1.55636 0.88973,1.94784 0.20246,0.2779 0.52823,0.44929 0.73389,0.72484 0.25313,0.33915 0.40041,0.74674 0.62984,1.10235 0.23888,0.37025 0.54078,0.6978 0.77311,1.07219 0.0191,0.0308 0.86468,1.74182 0.88519,1.77141 0.14746,0.21264 0.36695,0.36494 0.55043,0.5474 0.20006,0.30496 0.40938,0.60403 0.60018,0.91486 0.21903,0.35681 0.39744,0.73835 0.62884,1.08727 0.17443,0.26301 0.42767,0.47072 0.58561,0.74395 0.28852,0.49912 0.37592,1.10679 0.70826,1.57787 0.1101,0.15606 0.28128,0.25978 0.40515,0.40515 0.55556,0.65206 0.98328,1.41455 1.51655,2.08055 0.25484,0.31826 0.56755,0.58676 0.82638,0.90178 0.48866,0.59476 0.82582,1.29509 1.32252,1.88199 0.0153,0.0181 0.80767,0.80415 0.8098,0.80729 0.13076,0.19242 0.14064,0.44788 0.25938,0.64794 0.22942,0.38655 0.51288,0.69737 0.77712,1.04856 0.1396,0.18553 0.10938,0.46812 0.25687,0.64744 0.14717,0.17893 0.38461,0.26344 0.5474,0.42827 0.13891,0.18264 0.27781,0.36527 0.41671,0.54791 0.0875,0.0437 0.19292,0.0624 0.2624,0.1312 0.0305,0.0302 -0.0308,0.0988 0,0.12868 0.11492,0.11148 0.28959,0.14851 0.40263,0.26189 0.42415,0.42543 0.69014,1.0211 1.0722,1.48488 0.59218,0.71886 1.45316,1.1907 2.15946,1.78096 0.28869,0.24125 0.45425,0.60901 0.65296,0.78164 0.14712,0.12782 0.70432,0.26173 0.82991,0.38857 0.0668,0.0675 0.0858,0.16956 0.12868,0.25435 0.0873,0.0436 0.19291,0.0617 0.26189,0.13069 0.25463,0.25463 0.66224,0.75291 0.82237,1.08225 0.23076,0.47459 0.009,-0.10758 0.25535,0.12667 0.0153,0.0145 0.0678,0.23513 0.0834,0.24228 0.19219,0.0878 0.46395,0.0372 0.62129,0.35187 0.0375,0.0749 -0.0753,0.21459 0,0.25133 0.0753,0.0368 0.16756,0 0.25134,0 0.19285,0.19336 0.38457,0.38786 0.57857,0.58008 0.17615,0.17454 1.13445,1.13553 1.27728,1.13553"
       id="path13" />
    <path
       style="fill:none;stroke:#000000;stroke-width:0.264583;stroke-opacity:1"
       d="m 142.82309,141.85997 c -0.97607,0.18746 -0.61484,0.55437 -1.09783,1.04204 -0.0302,0.0305 -0.0974,-0.0294 -0.12868,0 -0.10494,0.0988 -0.0232,0.47186 -0.0975,0.58862 -0.0289,0.0454 -0.0979,0.0561 -0.12416,0.10305 -0.0629,0.11256 0.0831,0.39742 0,0.48909 -0.0261,0.0288 -0.0879,-0.0262 -0.11662,0 -0.01,0.009 -0.0109,0.30818 0,0.31769 0.18615,0.16197 0.52113,0.16095 0.83745,0.32472 0.92165,0.4772 -0.051,0.14546 0.80678,0.42023 0.41543,0.13308 1.26978,0.50871 1.56933,0.50871 0.21885,0 0.19587,-0.18011 0.37197,-0.23726 0.34896,-0.11325 0.79349,-0.0752 1.15815,-0.12869 0.083,-0.0122 1.10014,-0.29409 1.1501,-0.38404 0.0359,-0.0646 -0.0255,-0.15231 0,-0.22167 0.006,-0.0151 0.25348,-0.24468 0.25989,-0.25737 0.0541,-0.10715 0.17251,-0.75411 0.10354,-0.89123 -0.27967,-0.55607 -0.88832,-1.37727 -1.42003,-1.73521 -0.0796,-0.0536 -0.18955,-0.0609 -0.25737,-0.12868 -0.0303,-0.0303 0.0301,-0.0982 0,-0.12869 -0.13856,-0.1402 -1.47119,-0.24932 -1.73119,-0.24932 -0.14656,0 -0.70314,-0.0965 -0.79823,0 -0.17488,0.17739 -0.32372,0.37868 -0.48558,0.56801 z"
       id="path14" />
    <path
       style="fill:none;stroke:#000000;stroke-width:0.264583;stroke-opacity:1"
       d="m 44.151338,69.959127 c -0.423056,0.117392 -1.608722,0.408746 -1.608722,1.088358 0,0.437467 -0.266785,0.471704 -0.156393,1.023667 0.0993,0.496512 0.464672,0.841148 0.58079,1.310151 0.04628,0.186939 0.03885,0.591211 0.179853,0.732208 0.217908,0.217908 0.948526,0.490254 1.256834,0.552352 0.523965,0.105537 2.69988,0.200816 2.991384,-0.363969 0.09234,-0.178906 0.807281,-2.084856 0.718699,-2.262021 -0.17185,-0.343701 -0.291484,-0.870553 -0.718699,-1.086225 -0.05521,-0.02787 -0.123692,0 -0.185541,0 -0.136488,-0.07132 -0.28116,-0.128802 -0.409467,-0.213974 -0.238625,-0.158404 -0.447929,-0.627248 -0.715856,-0.715857 -0.115187,-0.03809 -0.248873,0.03837 -0.363969,0 -0.888855,-0.296283 0.05695,-0.432853 -1.568913,-0.06469 z"
       id="path15" />
    <path
       style="fill:none;stroke:#000000;stroke-width:0.264583;stroke-opacity:1"
       d="m 63.144632,69.511272 c -0.77983,0.893815 -1.972754,-0.301771 -2.864136,0 -0.321733,0.108921 -0.852556,0.304072 -1.0976,0.548801 -0.32912,0.328695 -0.08706,0.533315 -0.181986,0.902105 -0.238162,0.925274 -0.07899,-0.03184 -0.371078,0.54951 -0.193524,0.385178 -0.612227,2.096651 -0.363971,2.588316 0.290753,0.575823 1.36467,0.955849 1.886675,1.093332 0.189733,0.04997 0.39738,-0.0439 0.58861,0 0.08084,0.01855 0.09742,0.149953 0.176298,0.175588 0.259799,0.08443 1.519301,0.133845 1.788575,0 0.626695,-0.311502 0.981723,-0.173548 1.611564,-0.332692 0.538258,-0.136004 1.291145,-0.905036 1.487871,-1.302332 0.122185,-0.246753 0.455642,-0.328001 0.577945,-0.587896 0.08175,-0.173726 0.07576,-0.986491 0,-1.180063 -0.08444,-0.215739 -0.53503,-0.385543 -0.660405,-0.557329 -0.216077,-0.296058 -0.416703,-0.824582 -0.825333,-1.036463 -0.05995,-0.03109 -0.155181,0.04809 -0.2026,0 -0.0712,-0.0722 -0.166071,-0.409046 -0.400227,-0.56515 -0.408988,-0.272658 -0.604221,-0.216741 -1.150202,-0.295727 z"
       id="path16" />
    <path
       style="fill:none;stroke:#000000;stroke-width:0.264583;stroke-opacity:1"
       d="m 47.955258,72.36901 c 3.518889,-0.360736 6.953699,-0.351886 10.528845,-0.351886"
       id="path17" />
  </g>
</svg>
