{
    "private key": {
        "DER hexadecimal string": "3047020100300506032B6571043B04392468EF2468EF2468EF2468EF2468EF2468EF2468EF2468EF2468EF2468EF2468EF2468EF2468EF2468EF2468EF2468EF2468EF2468EF2468EF"
    }
}