<?xml version="1.0" encoding="UTF-8" standalone="no"?>
<!-- Created with Inkscape (http://www.inkscape.org/) -->

<svg
   width="210mm"
   height="297mm"
   viewBox="0 0 210 297"
   version="1.1"
   id="svg1"
   inkscape:version="1.3 (0e150ed, 2023-07-21)"
   sodipodi:docname="instrument.svg"
   xmlns:inkscape="http://www.inkscape.org/namespaces/inkscape"
   xmlns:sodipodi="http://sodipodi.sourceforge.net/DTD/sodipodi-0.dtd"
   xmlns="http://www.w3.org/2000/svg"
   xmlns:svg="http://www.w3.org/2000/svg">
  <sodipodi:namedview
     id="namedview1"
     pagecolor="#ffffff"
     bordercolor="#000000"
     borderopacity="0.25"
     inkscape:showpageshadow="2"
     inkscape:pageopacity="0.0"
     inkscape:pagecheckerboard="0"
     inkscape:deskcolor="#d1d1d1"
     inkscape:document-units="mm"
     inkscape:zoom="1.4342733"
     inkscape:cx="390.79024"
     inkscape:cy="292.48261"
     inkscape:window-width="1920"
     inkscape:window-height="1011"
     inkscape:window-x="0"
     inkscape:window-y="0"
     inkscape:window-maximized="1"
     inkscape:current-layer="layer1" />
  <defs
     id="defs1" />
  <g
     inkscape:label="Layer 1"
     inkscape:groupmode="layer"
     id="layer1">
    <rect
       style="fill:#ffffff;stroke:#000000;stroke-width:0.186;stroke-opacity:1"
       id="rect1"
       width="169.59035"
       height="93.507156"
       x="13.646608"
       y="26.631712" />
    <rect
       style="fill:#ffffff;stroke:#000000;stroke-width:0.186;stroke-opacity:1"
       id="rect2"
       width="43.505135"
       height="14.053023"
       x="134.80006"
       y="30.57336" />
    <rect
       style="fill:#ffffff;stroke:#000000;stroke-width:0.186;stroke-opacity:1"
       id="rect3"
       width="42.627457"
       height="69.38311"
       x="135.25981"
       y="46.515781" />
    <text
       xml:space="preserve"
       style="font-size:3.175px;font-family:sans-serif;-inkscape-font-specification:sans-serif;fill:#ffffff;stroke:#000000;stroke-width:0.186;stroke-opacity:1"
       x="150.08104"
       y="50.124668"
       id="text3"><tspan
         sodipodi:role="line"
         id="tspan3"
         style="stroke-width:0.186"
         x="150.08104"
         y="50.124668">trustees</tspan></text>
    <text
       xml:space="preserve"
       style="font-size:3.175px;font-family:sans-serif;-inkscape-font-specification:sans-serif;fill:#ffffff;stroke:#000000;stroke-width:0.186;stroke-opacity:1"
       x="144.36195"
       y="43.652706"
       id="text3-5"><tspan
         sodipodi:role="line"
         id="tspan3-3"
         style="stroke-width:0.186"
         x="144.36195"
         y="43.652706">connection status</tspan></text>
    <text
       xml:space="preserve"
       style="font-size:3.175px;font-family:sans-serif;-inkscape-font-specification:sans-serif;fill:#ffffff;stroke:#000000;stroke-width:0.186;stroke-opacity:1"
       x="148.29968"
       y="37.8265"
       id="text3-5-9"><tspan
         sodipodi:role="line"
         id="tspan3-3-1"
         style="stroke-width:0.186"
         x="148.29968"
         y="37.8265">disconnected</tspan></text>
  </g>
</svg>
