<svg width="19" height="18" viewBox="0 0 19 17" fill="none" xmlns="http://www.w3.org/2000/svg">
<line y1="-1" x2="12.8232" y2="-1" transform="matrix(0.713886 0.700236 -0.713886 0.700236 4.15869 4.89917)" stroke="#DDDDDD" stroke-width="2"/>
<line y1="-1" x2="12.8232" y2="-1" transform="matrix(0.713886 -0.700236 0.713886 0.700236 5.01172 13.8788)" stroke="#DDDDDD" stroke-width="2"/>
</svg>
