<svg width="20" height="20" viewBox="0 0 20 20" fill="none" xmlns="http://www.w3.org/2000/svg">
<path fill-rule="evenodd" clip-rule="evenodd" d="M7.96997 13.1847V15.7747H5.96997V13.1847H7.96997Z" />
<path fill-rule="evenodd" clip-rule="evenodd" d="M7.96997 2.70459V5.29459H5.96997V2.70459H7.96997Z" />
<path fill-rule="evenodd" clip-rule="evenodd" d="M2.31006 17.7646V0.764648H0.310059V19.7646H19.3101V17.7646H2.31006Z" />
<path fill-rule="evenodd" clip-rule="evenodd" d="M4.38013 4.95459H9.88013V13.7646H4.38013V4.95459ZM6.38013 6.95459V11.7646H7.88013V6.95459H6.38013Z" />
<path fill-rule="evenodd" clip-rule="evenodd" d="M15.9502 9.9646V12.7746H13.9502V9.9646H15.9502Z" />
<path fill-rule="evenodd" clip-rule="evenodd" d="M15.9502 1.80469V4.29469H13.9502V1.80469H15.9502Z" />
<path fill-rule="evenodd" clip-rule="evenodd" d="M12.3601 3.77466H17.8601V10.9147H12.3601V3.77466ZM14.3601 5.77466V8.91466H15.8601V5.77466H14.3601Z" />
</svg>
