<?xml version="1.0" encoding="UTF-8"?>
<svg width="24px" height="24px" viewBox="0 0 24 24" version="1.1" xmlns="http://www.w3.org/2000/svg" xmlns:xlink="http://www.w3.org/1999/xlink">

        <g transform="translate(0.000000, 3.000000)">
            <path d="M5.73356272,5.17867768 C7.04573794,4.74053187 6.25634585,4.01590612 6.52921569,3.64051859 C6.664868,3.45398702 7.34991216,3.11985726 8.05999983,2.7008876 C8.7846962,2.27436369 9.53443608,1.76416208 9.70034929,1.57414394 C10.0280018,1.19817533 11.0667854,1.07323985 11.4492206,1.01048157 C11.8321775,0.948304373 12.105569,1.13599813 13.1443527,0.948304373 C13.7631359,0.83615299 13.9723535,0.421250997 14.3469626,0.196948243 C14.6010499,0.0447012886 14.9422675,0.0592286703 15.4947899,0.00925447219 C16.8617478,-0.11626209 19.1574022,1.07323985 19.5403591,1.26093361 C19.9227943,1.44920846 22.3827967,1.44920846 22.65671,1.38645018 C22.9295799,1.32369189 23.7497546,0.948304373 23.9683635,1.7618377 C24.1869725,2.57595212 23.2029714,2.45043555 23.1481888,3.32730827 C23.0934061,4.20359987 22.4381011,5.20540806 21.8360135,5.20540806 C21.2349695,5.20540806 20.1967076,5.64355387 19.9227943,6.33215173 C19.6499244,7.02074953 20.9558387,10.4085347 20.9558387,10.4085347 C20.9558387,10.4085347 21.6017524,10.4730364 21.913231,10.98963 C22.0582747,11.2307846 22.2690575,11.868246 22.4349707,12.1518204 C23.0083626,13.1338714 23.1481888,14.1757752 23.1481888,14.4715526 C23.1481888,15.0346339 22.7657537,14.9724567 22.3285358,15.285086 C21.8913179,15.5982963 21.6174046,17.1010086 21.2892304,17.4142189 C20.9615779,17.7268482 20.5243601,17.2259441 19.9227943,17.0382504 C19.3217502,16.8505565 18.5892277,17.775079 18.2610535,17.9627729 C17.9328793,18.1504666 17.5175745,17.6019126 17.1894002,16.9127337 C16.8617478,16.2241359 16.041573,15.285086 15.6043552,14.9724567 C15.1671373,14.6592464 13.8001795,13.9078902 13.3629616,13.6574382 C12.9252221,13.4069862 12.2693954,13.845132 11.3949596,14.2832778 C10.5200022,14.7214236 9.97374091,14.534311 9.80939287,14.2832778 C9.64556663,14.0328258 10.4652196,12.154726 10.5200022,11.8415156 C10.5747849,11.5288864 10.5753067,11.1465257 10.4349587,10.98963 C9.39147942,9.82743959 9.30695759,11.1325794 8.86973976,11.5707253 C8.43252193,12.008871 8.71634831,11.7793384 8.05999983,11.3406115 C7.40417309,10.9030469 7.1307815,10.4015617 6.96643352,9.77572208 C6.80260726,9.14930137 6.14678052,8.58622008 6.31060678,8.21083264 C6.47495476,7.83486396 6.41965036,7.27178268 6.25634585,6.70812028 C6.09199786,6.144458 6.17130229,5.94746667 5.73356272,5.75977291 C5.29634489,5.57207915 5.73356272,5.17867768 5.73356272,5.17867768 Z M3.12841229,4.18616701 C3.40962996,4.18616701 3.52180399,4.31110249 3.80302166,4.49937735 C4.08423934,4.6870711 4.59032679,5.12521691 4.59032679,5.12521691 C4.59032679,5.12521691 4.81467485,5.43842725 4.81467485,5.81381476 C4.81467485,6.18978333 4.30910912,6.50241258 4.30910912,6.50241258 C4.30910912,6.50241258 3.80302166,6.87838125 3.63449976,7.12825218 C3.46545611,7.37928533 3.40962996,7.50422085 3.07258615,7.50422085 C2.7350206,7.50422085 2.34110716,6.94055846 2.22893313,6.43965438 C2.1167591,5.93933134 0.976757968,5.68829819 0.976757968,5.68829819 C0.976757968,5.68829819 0.695540294,5.31291067 1.14527987,5.1879752 C1.59501945,5.06245863 2.28528102,5.12521691 2.39797678,4.93694206 C2.50962906,4.7492483 2.79136848,4.18616701 3.12841229,4.18616701 Z M0.0927223038,10.7149463 C0.261244212,10.3395588 0.0368961612,9.77589638 0.318113833,9.58820266 C0.59880977,9.39992782 1.16124511,9.46268602 1.44194104,9.14947578 C1.72315871,8.83684654 2.56628999,8.39811955 2.7348119,8.39811955 C2.90385554,8.39811955 4.02768276,9.10473145 4.36472657,9.04197313 C4.70229212,8.97921482 4.85150966,8.61138153 5.24490136,8.61138153 C5.63829306,8.61138153 5.85168458,9.38888702 5.73898881,9.82761389 C5.62629304,10.2657597 5.09568382,10.652188 4.5901181,11.0281566 C4.08403063,11.4035441 4.32455261,11.9672065 3.03168176,12.0293837 C2.30072451,12.0293837 2.02002858,13.2816439 2.02002858,13.2816439 C2.02002858,13.2816439 2.02002858,14.6140953 1.51446285,14.7396118 C1.00837539,14.8645474 0.951505774,14.5519181 1.00837539,14.300885 C1.06420153,14.0504329 1.570289,13.0939502 1.45759323,12.6558043 C1.3454192,12.2170775 0.0368961612,11.8416899 0.0368961612,11.5284797 C0.0368961612,11.2158504 -0.0757996031,11.0903338 0.0927223038,10.7149463 Z" ></path>
        </g>

</svg>
