<?xml version="1.0" encoding="UTF-8"?>
<svg width="24px" height="24px" viewBox="0 0 24 24" version="1.1" xmlns="http://www.w3.org/2000/svg" xmlns:xlink="http://www.w3.org/1999/xlink">
    <g  stroke="none" stroke-width="1" fill="none" fill-rule="evenodd">
        <path d="M16.6444444,20.4444444 L14.4111111,16.5777778 C15.5,15.7777778 16.2555556,14.5333333 16.4111111,13.1111111 L20.8888889,13.1111111 C20.7,16.1777778 19.0555556,18.8444444 16.6444444,20.4444444 L16.6444444,20.4444444 Z M13.1111111,6.47777778 L13.1111111,2 C17.8888889,2.28888889 21.7111111,6.11111111 22,10.8888889 L17.5222222,10.8888889 C17.2666667,8.56666667 15.4333333,6.73333333 13.1111111,6.47777778 L13.1111111,6.47777778 Z M6.44444444,12.5555556 C6.44444444,13.2666667 6.58888889,13.9444444 6.86666667,14.5555556 L3,16.7888889 C2.35555556,15.5111111 2,14.0777778 2,12.5555556 C2,7.52222222 5.93333333,3.41111111 10.8888889,3.11111111 L10.8888889,7.58888889 C8.38888889,7.86666667 6.44444444,9.97777778 6.44444444,12.5555556 L6.44444444,12.5555556 Z M11.4444444,22 C8.14444444,22 5.24444444,20.3333333 3.55555556,17.7555556 L7.42222222,15.5222222 C8.33333333,16.7555556 9.77777778,17.5555556 11.4444444,17.5555556 C12.1555556,17.5555556 12.8333333,17.4111111 13.4444444,17.1333333 L15.6777778,21 C14.4,21.6444444 12.9666667,22 11.4444444,22 Z"></path>
    </g>
</svg>