<svg width="20" height="20" viewBox="0 0 20 20" fill="none" xmlns="http://www.w3.org/2000/svg">
<path fill-rule="evenodd" clip-rule="evenodd" d="M2.52002 17.7646V0.764648H0.52002V19.7646H19.52V17.7646H2.52002Z" />
<path fill-rule="evenodd" clip-rule="evenodd" d="M18.7863 5.34142L15.0263 11.5714L13.314 10.538L17.074 4.30798L18.7863 5.34142Z" />
<path fill-rule="evenodd" clip-rule="evenodd" d="M11.5796 12.519L7.60962 9.37896L8.85032 7.8103L12.8203 10.9503L11.5796 12.519Z" />
<path fill-rule="evenodd" clip-rule="evenodd" d="M1.33203 9.81571L4.55203 7.47571L5.72778 9.09361L2.50778 11.4336L1.33203 9.81571Z" />
<path d="M13.4901 14.6947C14.8156 14.6947 15.8901 13.6201 15.8901 12.2947C15.8901 10.9692 14.8156 9.89465 13.4901 9.89465C12.1646 9.89465 11.0901 10.9692 11.0901 12.2947C11.0901 13.6201 12.1646 14.6947 13.4901 14.6947Z" />
<path d="M6.54991 10.2247C7.87539 10.2247 8.94991 9.15017 8.94991 7.82468C8.94991 6.4992 7.87539 5.42468 6.54991 5.42468C5.22443 5.42468 4.1499 6.4992 4.1499 7.82468C4.1499 9.15017 5.22443 10.2247 6.54991 10.2247Z" />
</svg>
