[
  {
    "id": 158,
    "code": "Information and communication technology ",
    "name": "Info- ja kommunikatsiooni&shy;tehnoloogia"
  },
  {
    "id": 150,
    "code": "Tourism industry",
    "name": "Turismindus"
  },
  {
    "id": 155,
    "code": "Construction and real estate",
    "name": "Ehitus ja kinnisvara"
  },
  {
    "id": 152,
    "code": "Commerce",
    "name": "Kaubandus"
  },
  {
    "id": 154,
    "code": "Marine industry",
    "name": "Merendus"
  },
  {
    "id": 153,
    "code": "Forestry and timber industry",
    "name": "Metsandus ja puidutööstus"
  },
  {
    "id": 156,
    "code": "Banking and insurance",
    "name": "Pangandus ja kindlustus"
  },
  {
    "id": 157,
    "code": "Accountancy",
    "name": "Raamatupidamine"
  },
  {
    "id": 151,
    "code": "Food industry",
    "name": "Toiduainetööstus"
  },
  {
    "id": 138,
    "code": "Youth monitoring",
    "name": "Noorteseire"
  },
  {
    "id": 139,
    "code": "Ministry of Justice",
    "name": "Justiitsministeerium"
  },
  {
    "id": 140,
    "code": "Ministry of Defence",
    "name": "Kaitseministeerium"
  },
  {
    "id": 141,
    "code": "Ministry of the Environment",
    "name": "Keskkonnaministeerium"
  },
  {
    "id": 142,
    "code": "Cohesive Estonia",
    "name": "Sidus Eestis"
  },
  {
    "id": 144,
    "code": "Ministry of Rural Affairs",
    "name": "Maaeluministeerium"
  },
  {
    "id": 143,
    "code": "Ministry of Economic Affairs and Communications",
    "name": "Majandus- ja kommunikatsiooniministeerium"
  },
  {
    "id": 145,
    "code": "Ministry of Finance",
    "name": "Rahandusministeerium"
  },
  {
    "id": 149,
    "code": "Sustainable development",
    "name": "Säästev areng"
  },
  {
    "id": 146,
    "code": "Ministry of the Interior",
    "name": "Siseministeerium"
  },
  {
    "id": 148,
    "code": "Ministry of Foreign Affairs",
    "name": "Välisministeerium"
  },
  {
    "id": 1,
    "code": "Whole",
    "name": "Kogu Eesti"
  },
  {
    "id": 2,
    "code": "HARJU_county",
    "name": "HARJU MAAKOND"
  },
  {
    "id": 19,
    "code": "HIIU_county",
    "name": "HIIU MAAKOND"
  },
  {
    "id": 21,
    "code": "IDA_county",
    "name": "IDA-VIRU MAAKOND"
  },
  {
    "id": 30,
    "code": "JOGEVA_county",
    "name": "JÕGEVA MAAKOND"
  },
  {
    "id": 34,
    "code": "JARVA_county",
    "name": "JÄRVA MAAKOND"
  },
  {
    "id": 38,
    "code": "LAANE_county",
    "name": "LÄÄNE MAAKOND"
  },
  {
    "id": 42,
    "code": "LAANE_VIRU",
    "name": "LÄÄNE-VIRU MAAKOND"
  },
  {
    "id": 51,
    "code": "POLVA_county",
    "name": "PÕLVA MAAKOND"
  },
  {
    "id": 55,
    "code": "PARNU_county",
    "name": "PÄRNU MAAKOND"
  },
  {
    "id": 63,
    "code": "RAPLA_county",
    "name": "RAPLA MAAKOND"
  },
  {
    "id": 68,
    "code": "SAARE_county",
    "name": "SAARE MAAKOND"
  },
  {
    "id": 72,
    "code": "TARTU_county",
    "name": "TARTU MAAKOND"
  },
  {
    "id": 81,
    "code": "VALGA_county",
    "name": "VALGA MAAKOND"
  },
  {
    "id": 85,
    "code": "VILJANDI_county",
    "name": "VILJANDI MAAKOND"
  },
  {
    "id": 90,
    "code": "VORU_county",
    "name": "VÕRU MAAKOND"
  }
]
