<svg width="20" height="20" viewBox="0 0 20 20" fill="none" xmlns="http://www.w3.org/2000/svg">
<path fill-rule="evenodd" clip-rule="evenodd" d="M2.07007 17.7646V0.764648H0.0700684V19.7646H19.0701V17.7646H2.07007Z" />
<path fill-rule="evenodd" clip-rule="evenodd" d="M3.90015 7.88464H9.69016V18.5846H7.69016V9.88464H5.90015V18.5046H3.90015V7.88464Z" />
<path fill-rule="evenodd" clip-rule="evenodd" d="M11.48 2.47461H17.27V18.5846H15.27V4.47461H13.48V18.4546H11.48V2.47461Z" />
<path d="M15.78 9.17468H12.76V18.1447H15.78V9.17468Z" />
<path d="M8.15012 12.7046H5.13013V18.6546H8.15012V12.7046Z" />
</svg>
