<?xml version="1.0" encoding="UTF-8"?>
<svg width="24px" height="24px" viewBox="0 0 24 24" version="1.1" xmlns="http://www.w3.org/2000/svg" xmlns:xlink="http://www.w3.org/1999/xlink">
    <g  stroke="none" stroke-width="1" fill="none" fill-rule="evenodd">
        <path d="M3,3 L11,3 L11,9 L3,9 L3,3 Z M12,9 L12,3 L21,3 L21,9 L12,9 Z M16,10 L16,14 L3,14 L3,10 L16,10 Z M21,10 L21,14 L17,14 L17,10 L21,10 Z M3,18 L3,15.0011968 L8,15 L8,18 L3,18 Z M9,18 L9,15.0011968 L21,15 L21,18 L9,18 Z M3,21 L3,19 L14,19 L14,21 L3,21 Z M21,19 L21,21 L15,21 L15,19 L21,19 Z" transform="translate(12.000000, 12.000000) scale(-1, 1) rotate(-270.000000) translate(-12.000000, -12.000000) "></path>
    </g>
</svg>