<?xml version="1.0" encoding="UTF-8"?>
<svg width="77px" height="90px" viewBox="0 0 77 90" version="1.1" xmlns="http://www.w3.org/2000/svg" xmlns:xlink="http://www.w3.org/1999/xlink">
    <!-- Generator: Sketch 54.1 (76490) - https://sketchapp.com -->
    <title>cash-payment-bag-2_SVG</title>
    <desc>Created with Sketch.</desc>
    <g id="Page-1" stroke="none" stroke-width="1" fill="none" fill-rule="evenodd" stroke-linecap="round" stroke-linejoin="round">
        <g id="Buttons" transform="translate(-1594.000000, -111.000000)" stroke="#33295C" stroke-width="2">
            <g id="Group-Copy-10" transform="translate(1504.000000, 64.000000)">
                <g id="cash-payment-bag-2" transform="translate(91.000000, 48.000000)">
                    <path d="M39.4472727,49.6410256 L12.4018182,45.8803419" id="Path"></path>
                    <path d="M62.6290909,49.6410256 L39.4472727,49.6410256" id="Path"></path>
                    <path d="M45.2272727,15.7948718 L62.4784091,15.7948718 C63.7699398,15.7946837 64.976155,16.4226438 65.6929545,17.4683761 L66.9795455,19.3487179 C67.8457709,20.6124463 67.8457709,22.2593485 66.9795455,23.5230769 L65.975,24.9897436 C65.1087745,26.253472 65.1087745,27.9003742 65.975,29.1641026 L66.9795455,30.6307692 C67.8457709,31.8944976 67.8457709,33.5413998 66.9795455,34.8051282 L65.5925,36.8283761 C64.9318779,37.7944353 64.7664796,39.0032553 65.1443182,40.1039316 L65.8784091,42.2550427 C66.2562476,43.3557191 66.0908494,44.5645391 65.4302273,45.5305983 L62.6136364,49.6410256" id="Path"></path>
                    <path d="M12.3863636,27.0769231 L24.2747727,23.7712821 C25.3163067,23.4822279 26.1853775,22.7809387 26.6702273,21.8382906 L31.1443182,13.1623932 C31.5196972,12.4361381 32.1252266,11.846744 32.8713636,11.4813675 L40.9772727,7.52136752" id="Path"></path>
                    <path d="M40.6411364,0.752136752 C39.9713207,0.75215863 39.3493178,1.08990167 38.997435,1.64465467 C38.6455522,2.19940766 38.6140135,2.89199107 38.9140909,3.47487179 L45.2272727,15.7948718 L56.8181818,15.7948718 L63.1468182,3.47487179 C63.4442723,2.89734672 63.4163032,2.2116264 63.0727474,1.65887194 C62.7291917,1.10611747 62.1181597,0.763734882 61.4545455,0.752136752 L40.6411364,0.752136752 Z" id="Path"></path>
                    <polyline id="Path" points="0.810909091 23.3162393 12.4018182 23.3162393 12.4018182 49.6410256 0.810909091 49.6410256"></polyline>
                    <path d="M60.7320455,49.6823932 C68.695,51.8147009 74.22,64.2475214 74.22,72.2051282 C74.22,83.1111111 63.8422727,87.2478632 51.0381818,87.2478632 C38.2340909,87.2478632 27.8563636,83.1111111 27.8563636,72.2051282 C27.8563636,64.2475214 33.3813636,51.8184615 41.3443182,49.6823932" id="Path"></path>
                    <path d="M51.0381818,75.965812 L51.0381818,79.7264957" id="Path"></path>
                    <path d="M51.0381818,57.1623932 L51.0381818,60.9230769" id="Path"></path>
                    <path d="M43.2954545,75.965812 L54.8863636,75.965812 C57.0201911,75.965812 58.75,74.2820965 58.75,72.2051282 C58.75,70.1281599 57.0201911,68.4444444 54.8863636,68.4444444 L47.1590909,68.4444444 C45.0252635,68.4444444 43.2954545,66.760729 43.2954545,64.6837607 C43.2954545,62.6067924 45.0252635,60.9230769 47.1590909,60.9230769 L58.75,60.9230769" id="Path"></path>
                </g>
            </g>
        </g>
    </g>
</svg>