(export (version D)
  (design
    (source "/home/core2idiot/Projects/SeniorProject/Electrical Design/teensy-thumb-keyboard/hardware/v1.1/teensythumbboard.sch")
    (date "Mon 25 Nov 2019 04:09:37 PM PST")
    (tool "Eeschema 5.1.4")
    (sheet (number 1) (name /) (tstamps /)
      (title_block
        (title "Teensy Thumb Board")
        (company)
        (rev 1.1)
        (date 2018-11-11)
        (source teensythumbboard.sch)
        (comment (number 1) (value ""))
        (comment (number 2) (value ""))
        (comment (number 3) (value ""))
        (comment (number 4) (value "")))))
  (components
    (comp (ref SW1)
      (value SW_Left)
      (footprint Button_Switch_THT:SW_PUSH_6mm)
      (libsource (lib teensythumbboard-rescue) (part SW_Push) (description ""))
      (sheetpath (names /) (tstamps /))
      (tstamp 5A91B5FA))
    (comp (ref SW2)
      (value SW_UP)
      (footprint Button_Switch_THT:SW_PUSH_6mm)
      (libsource (lib teensythumbboard-rescue) (part SW_Push) (description ""))
      (sheetpath (names /) (tstamps /))
      (tstamp 5A91BAED))
    (comp (ref SW3)
      (value SW_Down)
      (footprint Button_Switch_THT:SW_PUSH_6mm)
      (libsource (lib teensythumbboard-rescue) (part SW_Push) (description ""))
      (sheetpath (names /) (tstamps /))
      (tstamp 5A91BB18))
    (comp (ref SW4)
      (value SW_Right)
      (footprint Button_Switch_THT:SW_PUSH_6mm)
      (libsource (lib teensythumbboard-rescue) (part SW_Push) (description ""))
      (sheetpath (names /) (tstamps /))
      (tstamp 5A91BBAB))
    (comp (ref SW5)
      (value SW_0)
      (footprint Button_Switch_THT:SW_PUSH_6mm)
      (libsource (lib teensythumbboard-rescue) (part SW_Push) (description ""))
      (sheetpath (names /) (tstamps /))
      (tstamp 5A91BC26))
    (comp (ref SW6)
      (value SW_?)
      (footprint Button_Switch_THT:SW_PUSH_6mm)
      (libsource (lib teensythumbboard-rescue) (part SW_Push) (description ""))
      (sheetpath (names /) (tstamps /))
      (tstamp 5A91BCA7))
    (comp (ref SW7)
      (value SW_-)
      (footprint Button_Switch_THT:SW_PUSH_6mm)
      (libsource (lib teensythumbboard-rescue) (part SW_Push) (description ""))
      (sheetpath (names /) (tstamps /))
      (tstamp 5A91BD68))
    (comp (ref SW8)
      (value SW_+)
      (footprint Button_Switch_THT:SW_PUSH_6mm)
      (libsource (lib teensythumbboard-rescue) (part SW_Push) (description ""))
      (sheetpath (names /) (tstamps /))
      (tstamp 5A91BDE1))
    (comp (ref SW9)
      (value SW_;)
      (footprint Button_Switch_THT:SW_PUSH_6mm)
      (libsource (lib teensythumbboard-rescue) (part SW_Push) (description ""))
      (sheetpath (names /) (tstamps /))
      (tstamp 5A91C44D))
    (comp (ref SW10)
      (value SW_')
      (footprint Button_Switch_THT:SW_PUSH_6mm)
      (libsource (lib teensythumbboard-rescue) (part SW_Push) (description ""))
      (sheetpath (names /) (tstamps /))
      (tstamp 5A91C49E))
    (comp (ref SW11)
      (value SW_7)
      (footprint Button_Switch_THT:SW_PUSH_6mm)
      (libsource (lib teensythumbboard-rescue) (part SW_Push) (description ""))
      (sheetpath (names /) (tstamps /))
      (tstamp 5A91E250))
    (comp (ref SW12)
      (value SW_8)
      (footprint Button_Switch_THT:SW_PUSH_6mm)
      (libsource (lib teensythumbboard-rescue) (part SW_Push) (description ""))
      (sheetpath (names /) (tstamps /))
      (tstamp 5A91E25C))
    (comp (ref SW13)
      (value SW_9)
      (footprint Button_Switch_THT:SW_PUSH_6mm)
      (libsource (lib teensythumbboard-rescue) (part SW_Push) (description ""))
      (sheetpath (names /) (tstamps /))
      (tstamp 5A91E262))
    (comp (ref SW14)
      (value SW_4)
      (footprint Button_Switch_THT:SW_PUSH_6mm)
      (libsource (lib teensythumbboard-rescue) (part SW_Push) (description ""))
      (sheetpath (names /) (tstamps /))
      (tstamp 5A91E274))
    (comp (ref SW15)
      (value SW_5)
      (footprint Button_Switch_THT:SW_PUSH_6mm)
      (libsource (lib teensythumbboard-rescue) (part SW_Push) (description ""))
      (sheetpath (names /) (tstamps /))
      (tstamp 5A91E280))
    (comp (ref SW16)
      (value SW_6)
      (footprint Button_Switch_THT:SW_PUSH_6mm)
      (libsource (lib teensythumbboard-rescue) (part SW_Push) (description ""))
      (sheetpath (names /) (tstamps /))
      (tstamp 5A91E28C))
    (comp (ref SW17)
      (value SW_1)
      (footprint Button_Switch_THT:SW_PUSH_6mm)
      (libsource (lib teensythumbboard-rescue) (part SW_Push) (description ""))
      (sheetpath (names /) (tstamps /))
      (tstamp 5A91E298))
    (comp (ref SW18)
      (value SW_2)
      (footprint Button_Switch_THT:SW_PUSH_6mm)
      (libsource (lib teensythumbboard-rescue) (part SW_Push) (description ""))
      (sheetpath (names /) (tstamps /))
      (tstamp 5A91E29E))
    (comp (ref SW19)
      (value SW_3)
      (footprint Button_Switch_THT:SW_PUSH_6mm)
      (libsource (lib teensythumbboard-rescue) (part SW_Push) (description ""))
      (sheetpath (names /) (tstamps /))
      (tstamp 5A91E2A4))
    (comp (ref SW20)
      (value SW_Esc)
      (footprint Button_Switch_THT:SW_PUSH_6mm)
      (libsource (lib teensythumbboard-rescue) (part SW_Push) (description ""))
      (sheetpath (names /) (tstamps /))
      (tstamp 5A91E2AA))
    (comp (ref SW21)
      (value SW_Q)
      (footprint Button_Switch_THT:SW_PUSH_6mm)
      (libsource (lib teensythumbboard-rescue) (part SW_Push) (description ""))
      (sheetpath (names /) (tstamps /))
      (tstamp 5A91EBE5))
    (comp (ref SW22)
      (value SW_W)
      (footprint Button_Switch_THT:SW_PUSH_6mm)
      (libsource (lib teensythumbboard-rescue) (part SW_Push) (description ""))
      (sheetpath (names /) (tstamps /))
      (tstamp 5A91EBF1))
    (comp (ref SW23)
      (value SW_E)
      (footprint Button_Switch_THT:SW_PUSH_6mm)
      (libsource (lib teensythumbboard-rescue) (part SW_Push) (description ""))
      (sheetpath (names /) (tstamps /))
      (tstamp 5A91EBF7))
    (comp (ref SW24)
      (value SW_R)
      (footprint Button_Switch_THT:SW_PUSH_6mm)
      (libsource (lib teensythumbboard-rescue) (part SW_Push) (description ""))
      (sheetpath (names /) (tstamps /))
      (tstamp 5A91EC09))
    (comp (ref SW25)
      (value SW_T)
      (footprint Button_Switch_THT:SW_PUSH_6mm)
      (libsource (lib teensythumbboard-rescue) (part SW_Push) (description ""))
      (sheetpath (names /) (tstamps /))
      (tstamp 5A91EC15))
    (comp (ref SW26)
      (value SW_Y)
      (footprint Button_Switch_THT:SW_PUSH_6mm)
      (libsource (lib teensythumbboard-rescue) (part SW_Push) (description ""))
      (sheetpath (names /) (tstamps /))
      (tstamp 5A91EC21))
    (comp (ref SW27)
      (value SW_U)
      (footprint Button_Switch_THT:SW_PUSH_6mm)
      (libsource (lib teensythumbboard-rescue) (part SW_Push) (description ""))
      (sheetpath (names /) (tstamps /))
      (tstamp 5A91EC2D))
    (comp (ref SW28)
      (value SW_I)
      (footprint Button_Switch_THT:SW_PUSH_6mm)
      (libsource (lib teensythumbboard-rescue) (part SW_Push) (description ""))
      (sheetpath (names /) (tstamps /))
      (tstamp 5A91EC33))
    (comp (ref SW29)
      (value SW_O)
      (footprint Button_Switch_THT:SW_PUSH_6mm)
      (libsource (lib teensythumbboard-rescue) (part SW_Push) (description ""))
      (sheetpath (names /) (tstamps /))
      (tstamp 5A91EC39))
    (comp (ref SW30)
      (value SW_P)
      (footprint Button_Switch_THT:SW_PUSH_6mm)
      (libsource (lib teensythumbboard-rescue) (part SW_Push) (description ""))
      (sheetpath (names /) (tstamps /))
      (tstamp 5A91EC3F))
    (comp (ref SW31)
      (value SW_A)
      (footprint Button_Switch_THT:SW_PUSH_6mm)
      (libsource (lib teensythumbboard-rescue) (part SW_Push) (description ""))
      (sheetpath (names /) (tstamps /))
      (tstamp 5A91EC66))
    (comp (ref SW32)
      (value SW_S)
      (footprint Button_Switch_THT:SW_PUSH_6mm)
      (libsource (lib teensythumbboard-rescue) (part SW_Push) (description ""))
      (sheetpath (names /) (tstamps /))
      (tstamp 5A91EC72))
    (comp (ref SW33)
      (value SW_D)
      (footprint Button_Switch_THT:SW_PUSH_6mm)
      (libsource (lib teensythumbboard-rescue) (part SW_Push) (description ""))
      (sheetpath (names /) (tstamps /))
      (tstamp 5A91EC78))
    (comp (ref SW34)
      (value SW_F)
      (footprint Button_Switch_THT:SW_PUSH_6mm)
      (libsource (lib teensythumbboard-rescue) (part SW_Push) (description ""))
      (sheetpath (names /) (tstamps /))
      (tstamp 5A91EC8A))
    (comp (ref SW35)
      (value SW_G)
      (footprint Button_Switch_THT:SW_PUSH_6mm)
      (libsource (lib teensythumbboard-rescue) (part SW_Push) (description ""))
      (sheetpath (names /) (tstamps /))
      (tstamp 5A91EC96))
    (comp (ref SW36)
      (value SW_H)
      (footprint Button_Switch_THT:SW_PUSH_6mm)
      (libsource (lib teensythumbboard-rescue) (part SW_Push) (description ""))
      (sheetpath (names /) (tstamps /))
      (tstamp 5A91ECA2))
    (comp (ref SW37)
      (value SW_J)
      (footprint Button_Switch_THT:SW_PUSH_6mm)
      (libsource (lib teensythumbboard-rescue) (part SW_Push) (description ""))
      (sheetpath (names /) (tstamps /))
      (tstamp 5A91ECAE))
    (comp (ref SW38)
      (value SW_K)
      (footprint Button_Switch_THT:SW_PUSH_6mm)
      (libsource (lib teensythumbboard-rescue) (part SW_Push) (description ""))
      (sheetpath (names /) (tstamps /))
      (tstamp 5A91ECB4))
    (comp (ref SW39)
      (value SW_L)
      (footprint Button_Switch_THT:SW_PUSH_6mm)
      (libsource (lib teensythumbboard-rescue) (part SW_Push) (description ""))
      (sheetpath (names /) (tstamps /))
      (tstamp 5A91ECBA))
    (comp (ref SW40)
      (value SW_Fn)
      (footprint Button_Switch_THT:SW_PUSH_6mm)
      (libsource (lib teensythumbboard-rescue) (part SW_Push) (description ""))
      (sheetpath (names /) (tstamps /))
      (tstamp 5A91ECC0))
    (comp (ref SW41)
      (value SW_Shift)
      (footprint Button_Switch_THT:SW_PUSH_6mm)
      (libsource (lib teensythumbboard-rescue) (part SW_Push) (description ""))
      (sheetpath (names /) (tstamps /))
      (tstamp 5A91F147))
    (comp (ref SW42)
      (value SW_Z)
      (footprint Button_Switch_THT:SW_PUSH_6mm)
      (libsource (lib teensythumbboard-rescue) (part SW_Push) (description ""))
      (sheetpath (names /) (tstamps /))
      (tstamp 5A91F153))
    (comp (ref SW43)
      (value SW_X)
      (footprint Button_Switch_THT:SW_PUSH_6mm)
      (libsource (lib teensythumbboard-rescue) (part SW_Push) (description ""))
      (sheetpath (names /) (tstamps /))
      (tstamp 5A91F159))
    (comp (ref SW44)
      (value SW_C)
      (footprint Button_Switch_THT:SW_PUSH_6mm)
      (libsource (lib teensythumbboard-rescue) (part SW_Push) (description ""))
      (sheetpath (names /) (tstamps /))
      (tstamp 5A91F16B))
    (comp (ref SW45)
      (value SW_V)
      (footprint Button_Switch_THT:SW_PUSH_6mm)
      (libsource (lib teensythumbboard-rescue) (part SW_Push) (description ""))
      (sheetpath (names /) (tstamps /))
      (tstamp 5A91F177))
    (comp (ref SW46)
      (value SW_B)
      (footprint Button_Switch_THT:SW_PUSH_6mm)
      (libsource (lib teensythumbboard-rescue) (part SW_Push) (description ""))
      (sheetpath (names /) (tstamps /))
      (tstamp 5A91F183))
    (comp (ref SW47)
      (value SW_N)
      (footprint Button_Switch_THT:SW_PUSH_6mm)
      (libsource (lib teensythumbboard-rescue) (part SW_Push) (description ""))
      (sheetpath (names /) (tstamps /))
      (tstamp 5A91F18F))
    (comp (ref SW48)
      (value SW_M)
      (footprint Button_Switch_THT:SW_PUSH_6mm)
      (libsource (lib teensythumbboard-rescue) (part SW_Push) (description ""))
      (sheetpath (names /) (tstamps /))
      (tstamp 5A91F195))
    (comp (ref SW49)
      (value SW_Shift)
      (footprint Button_Switch_THT:SW_PUSH_6mm)
      (libsource (lib teensythumbboard-rescue) (part SW_Push) (description ""))
      (sheetpath (names /) (tstamps /))
      (tstamp 5A91F19B))
    (comp (ref SW50)
      (value SW_BkSpace)
      (footprint Button_Switch_THT:SW_PUSH_6mm)
      (libsource (lib teensythumbboard-rescue) (part SW_Push) (description ""))
      (sheetpath (names /) (tstamps /))
      (tstamp 5A91F1A1))
    (comp (ref SW51)
      (value SW_Tab)
      (footprint Button_Switch_THT:SW_PUSH_6mm)
      (libsource (lib teensythumbboard-rescue) (part SW_Push) (description ""))
      (sheetpath (names /) (tstamps /))
      (tstamp 5B47057F))
    (comp (ref SW52)
      (value SW_Ctrl)
      (footprint Button_Switch_THT:SW_PUSH_6mm)
      (libsource (lib teensythumbboard-rescue) (part SW_Push) (description ""))
      (sheetpath (names /) (tstamps /))
      (tstamp 5B47058B))
    (comp (ref SW53)
      (value SW_Super)
      (footprint Button_Switch_THT:SW_PUSH_6mm)
      (libsource (lib teensythumbboard-rescue) (part SW_Push) (description ""))
      (sheetpath (names /) (tstamps /))
      (tstamp 5B470591))
    (comp (ref SW54)
      (value SW_Alt)
      (footprint Button_Switch_THT:SW_PUSH_6mm)
      (libsource (lib teensythumbboard-rescue) (part SW_Push) (description ""))
      (sheetpath (names /) (tstamps /))
      (tstamp 5B4705A3))
    (comp (ref SW55)
      (value SW_Space)
      (footprint Button_Switch_THT:SW_PUSH_6mm)
      (libsource (lib teensythumbboard-rescue) (part SW_Push) (description ""))
      (sheetpath (names /) (tstamps /))
      (tstamp 5B4705AF))
    (comp (ref SW56)
      (value SW_Space)
      (footprint Button_Switch_THT:SW_PUSH_6mm)
      (libsource (lib teensythumbboard-rescue) (part SW_Push) (description ""))
      (sheetpath (names /) (tstamps /))
      (tstamp 5B4705BB))
    (comp (ref SW57)
      (value SW_Fn)
      (footprint Button_Switch_THT:SW_PUSH_6mm)
      (libsource (lib teensythumbboard-rescue) (part SW_Push) (description ""))
      (sheetpath (names /) (tstamps /))
      (tstamp 5B4705C7))
    (comp (ref SW58)
      (value SW_,)
      (footprint Button_Switch_THT:SW_PUSH_6mm)
      (libsource (lib teensythumbboard-rescue) (part SW_Push) (description ""))
      (sheetpath (names /) (tstamps /))
      (tstamp 5B4705CD))
    (comp (ref SW59)
      (value SW_.)
      (footprint Button_Switch_THT:SW_PUSH_6mm)
      (libsource (lib teensythumbboard-rescue) (part SW_Push) (description ""))
      (sheetpath (names /) (tstamps /))
      (tstamp 5B4705D3))
    (comp (ref SW60)
      (value SW_Ret)
      (footprint Button_Switch_THT:SW_PUSH_6mm)
      (libsource (lib teensythumbboard-rescue) (part SW_Push) (description ""))
      (sheetpath (names /) (tstamps /))
      (tstamp 5B4705D9))
    (comp (ref D10)
      (value D_Zener_Small)
      (footprint Diode_SMD:D_0805_2012Metric_Pad1.15x1.40mm_HandSolder)
      (libsource (lib teensythumbboard-rescue) (part D_Zener_Small) (description ""))
      (sheetpath (names /) (tstamps /))
      (tstamp 5A91C5FC))
    (comp (ref D9)
      (value D_Zener_Small)
      (footprint Diode_SMD:D_0805_2012Metric_Pad1.15x1.40mm_HandSolder)
      (libsource (lib teensythumbboard-rescue) (part D_Zener_Small) (description ""))
      (sheetpath (names /) (tstamps /))
      (tstamp 5A91C5A3))
    (comp (ref D8)
      (value D_Zener_Small)
      (footprint Diode_SMD:D_0805_2012Metric_Pad1.15x1.40mm_HandSolder)
      (libsource (lib teensythumbboard-rescue) (part D_Zener_Small) (description ""))
      (sheetpath (names /) (tstamps /))
      (tstamp 5A91C549))
    (comp (ref D7)
      (value D_Zener_Small)
      (footprint Diode_SMD:D_0805_2012Metric_Pad1.15x1.40mm_HandSolder)
      (libsource (lib teensythumbboard-rescue) (part D_Zener_Small) (description ""))
      (sheetpath (names /) (tstamps /))
      (tstamp 5A91C4F4))
    (comp (ref D6)
      (value D_Zener_Small)
      (footprint Diode_SMD:D_0805_2012Metric_Pad1.15x1.40mm_HandSolder)
      (libsource (lib teensythumbboard-rescue) (part D_Zener_Small) (description ""))
      (sheetpath (names /) (tstamps /))
      (tstamp 5A91BCF2))
    (comp (ref D5)
      (value D_Zener_Small)
      (footprint Diode_SMD:D_0805_2012Metric_Pad1.15x1.40mm_HandSolder)
      (libsource (lib teensythumbboard-rescue) (part D_Zener_Small) (description ""))
      (sheetpath (names /) (tstamps /))
      (tstamp 5A91BC63))
    (comp (ref D4)
      (value D_Zener_Small)
      (footprint Diode_SMD:D_0805_2012Metric_Pad1.15x1.40mm_HandSolder)
      (libsource (lib teensythumbboard-rescue) (part D_Zener_Small) (description ""))
      (sheetpath (names /) (tstamps /))
      (tstamp 5A91BBE2))
    (comp (ref D1)
      (value D_Zener_Small)
      (footprint Diode_SMD:D_0805_2012Metric_Pad1.15x1.40mm_HandSolder)
      (libsource (lib teensythumbboard-rescue) (part D_Zener_Small) (description ""))
      (sheetpath (names /) (tstamps /))
      (tstamp 5A91B709))
    (comp (ref D2)
      (value D_Zener_Small)
      (footprint Diode_SMD:D_0805_2012Metric_Pad1.15x1.40mm_HandSolder)
      (libsource (lib teensythumbboard-rescue) (part D_Zener_Small) (description ""))
      (sheetpath (names /) (tstamps /))
      (tstamp 5A91BB48))
    (comp (ref D3)
      (value D_Zener_Small)
      (footprint Diode_SMD:D_0805_2012Metric_Pad1.15x1.40mm_HandSolder)
      (libsource (lib teensythumbboard-rescue) (part D_Zener_Small) (description ""))
      (sheetpath (names /) (tstamps /))
      (tstamp 5A91BB7B))
    (comp (ref J1)
      (value "Internal USB")
      (footprint Connector_FFC-FPC:Molex_200528-0040_1x04-1MP_P1.00mm_Horizontal)
      (datasheet ~)
      (libsource (lib Connector_Generic) (part Conn_01x04) (description "Generic connector, single row, 01x04, script generated (kicad-library-utils/schlib/autogen/connector/)"))
      (sheetpath (names /) (tstamps /))
      (tstamp 5DCAFCAA))
    (comp (ref J2)
      (value "Testing USB")
      (footprint Connector_USB:USB_Micro-B_Molex-105017-0001)
      (fields
        (field (name Field4) CONN-09505))
      (libsource (lib SparkFun-Connectors) (part USB_MICRO-B_SMT) (description "USB Type Micro-B Connector Male/female and PTH/SMT variants SparkFun Products:<ul><li><a href= https://www.sparkfun.com/products/12035 >SparkFun microB USB Breakout</a></li><li><a href= https://www.sparkfun.com/products/10031 >SparkFun USB microB Plug Breakout</a></li><li><a href= https://www.sparkfun.com/products/13231 >SparkFun ESP8266 Thing</a></li></ul>"))
      (sheetpath (names /) (tstamps /))
      (tstamp 5DCB12D4))
    (comp (ref R4)
      (value 22)
      (footprint Resistor_SMD:R_0603_1608Metric_Pad1.05x0.95mm_HandSolder)
      (datasheet ~)
      (libsource (lib Device) (part R_Small_US) (description "Resistor, small US symbol"))
      (sheetpath (names /) (tstamps /))
      (tstamp 5DC7AFF1))
    (comp (ref R3)
      (value 22)
      (footprint Resistor_SMD:R_0603_1608Metric_Pad1.05x0.95mm_HandSolder)
      (datasheet ~)
      (libsource (lib Device) (part R_Small_US) (description "Resistor, small US symbol"))
      (sheetpath (names /) (tstamps /))
      (tstamp 5DC7DC51))
    (comp (ref R2)
      (value 10K)
      (footprint Resistor_SMD:R_1206_3216Metric_Pad1.42x1.75mm_HandSolder)
      (datasheet ~)
      (libsource (lib Device) (part R_Small_US) (description "Resistor, small US symbol"))
      (sheetpath (names /) (tstamps /))
      (tstamp 5DED3AD6))
    (comp (ref C1)
      (value 10uF)
      (footprint Capacitor_SMD:C_1210_3225Metric_Pad1.42x2.65mm_HandSolder)
      (datasheet ~)
      (libsource (lib Device) (part C_Small) (description "Unpolarized capacitor, small symbol"))
      (sheetpath (names /) (tstamps /))
      (tstamp 5DF51C99))
    (comp (ref TP0)
      (value TP_RST)
      (footprint TestPoint:TestPoint_Pad_D2.0mm)
      (datasheet ~)
      (libsource (lib Connector) (part TestPoint) (description "test point"))
      (sheetpath (names /) (tstamps /))
      (tstamp 5DDE7336))
    (comp (ref TP1)
      (value TP_GND)
      (footprint TestPoint:TestPoint_Pad_D2.0mm)
      (datasheet ~)
      (libsource (lib Connector) (part TestPoint) (description "test point"))
      (sheetpath (names /) (tstamps /))
      (tstamp 5DDE7D13))
    (comp (ref TP3)
      (value TP_5V)
      (footprint TestPoint:TestPoint_Pad_D2.0mm)
      (datasheet ~)
      (libsource (lib Connector) (part TestPoint) (description "test point"))
      (sheetpath (names /) (tstamps /))
      (tstamp 5DE13F45))
    (comp (ref D11)
      (value ON)
      (footprint LED_SMD:LED_0603_1608Metric_Pad1.05x0.95mm_HandSolder)
      (datasheet ~)
      (libsource (lib Device) (part LED_Small) (description "Light emitting diode, small symbol"))
      (sheetpath (names /) (tstamps /))
      (tstamp 5DE6B8F0))
    (comp (ref R5)
      (value 10K)
      (footprint Resistor_SMD:R_1206_3216Metric_Pad1.42x1.75mm_HandSolder)
      (datasheet ~)
      (libsource (lib Device) (part R_Small_US) (description "Resistor, small US symbol"))
      (sheetpath (names /) (tstamps /))
      (tstamp 5DE6D970))
    (comp (ref X1)
      (value 16MHz)
      (footprint Oscillator:Oscillator_SMD_ECS_2520MV-xxx-xx-4Pin_2.5x2.0mm)
      (datasheet https://www.ecsxtal.com/store/pdf/ECS-2520MV.pdf)
      (libsource (lib Oscillator) (part ECS-2520MV-xxx-xx) (description "HCMOS Crystal Clock Oscillator, 2.5x2.0 mm SMD"))
      (sheetpath (names /) (tstamps /))
      (tstamp 5DF254C7))
    (comp (ref TP4)
      (value TP_CLK)
      (footprint TestPoint:TestPoint_Pad_D2.0mm)
      (datasheet ~)
      (libsource (lib Connector) (part TestPoint) (description "test point"))
      (sheetpath (names /) (tstamps /))
      (tstamp 5DFCF7B1))
    (comp (ref U1)
      (value ATMEGA32U4-AU)
      (footprint Package_QFP:TQFP-44_10x10mm_P0.8mm)
      (datasheet http://ww1.microchip.com/downloads/en/DeviceDoc/Atmel-7766-8-bit-AVR-ATmega16U4-32U4_Summary.pdf)
      (fields
        (field (name Category) "Integrated Circuits (ICs)")
        (field (name DK_Datasheet_Link) http://ww1.microchip.com/downloads/en/DeviceDoc/Atmel-7766-8-bit-AVR-ATmega16U4-32U4_Summary.pdf)
        (field (name DK_Detail_Page) /product-detail/en/microchip-technology/ATMEGA32U4-AU/ATMEGA32U4-AU-ND/1914602)
        (field (name Description) "IC MCU 8BIT 32KB FLASH 44TQFP")
        (field (name Digi-Key_PN) ATMEGA32U4-AU-ND)
        (field (name Family) "Embedded - Microcontrollers")
        (field (name MPN) ATMEGA32U4-AU)
        (field (name Manufacturer) "Microchip Technology")
        (field (name Status) Active))
      (libsource (lib dk_Embedded-Microcontrollers) (part ATMEGA32U4-AU) (description "IC MCU 8BIT 32KB FLASH 44TQFP"))
      (sheetpath (names /) (tstamps /))
      (tstamp 5DD1DFAA))
    (comp (ref U2)
      (value MCP1700T-3302E_TT)
      (footprint digikey-footprints:SOT-23-3)
      (datasheet http://www.microchip.com/mymicrochip/filehandler.aspx?ddocname=en011779)
      (fields
        (field (name Category) "Integrated Circuits (ICs)")
        (field (name DK_Datasheet_Link) http://www.microchip.com/mymicrochip/filehandler.aspx?ddocname=en011779)
        (field (name DK_Detail_Page) /product-detail/en/microchip-technology/MCP1700T-3302E-TT/MCP1700T3302ETTCT-ND/652677)
        (field (name Description) "IC REG LINEAR 3.3V 250MA SOT23-3")
        (field (name Digi-Key_PN) MCP1700T3302ETTCT-ND)
        (field (name Family) "PMIC - Voltage Regulators - Linear")
        (field (name MPN) MCP1700T-3302E/TT)
        (field (name Manufacturer) "Microchip Technology")
        (field (name Status) Active))
      (libsource (lib dk_PMIC-Voltage-Regulators-Linear) (part MCP1700T-3302E_TT) (description "IC REG LINEAR 3.3V 250MA SOT23-3"))
      (sheetpath (names /) (tstamps /))
      (tstamp 5DE86F9B))
    (comp (ref C2)
      (value 1uF)
      (datasheet ~)
      (libsource (lib Device) (part C_Small) (description "Unpolarized capacitor, small symbol"))
      (sheetpath (names /) (tstamps /))
      (tstamp 5DE8A77A))
    (comp (ref C3)
      (value 1uF)
      (datasheet ~)
      (libsource (lib Device) (part C_Small) (description "Unpolarized capacitor, small symbol"))
      (sheetpath (names /) (tstamps /))
      (tstamp 5DE8B8F9))
    (comp (ref TP5)
      (value TP_3.3)
      (datasheet ~)
      (libsource (lib Connector) (part TestPoint) (description "test point"))
      (sheetpath (names /) (tstamps /))
      (tstamp 5E028BE1)))
  (libparts
    (libpart (lib Connector) (part TestPoint)
      (description "test point")
      (docs ~)
      (footprints
        (fp Pin*)
        (fp Test*))
      (fields
        (field (name Reference) TP)
        (field (name Value) TestPoint))
      (pins
        (pin (num 1) (name 1) (type passive))))
    (libpart (lib Connector_Generic) (part Conn_01x04)
      (description "Generic connector, single row, 01x04, script generated (kicad-library-utils/schlib/autogen/connector/)")
      (docs ~)
      (footprints
        (fp Connector*:*_1x??_*))
      (fields
        (field (name Reference) J)
        (field (name Value) Conn_01x04))
      (pins
        (pin (num 1) (name Pin_1) (type passive))
        (pin (num 2) (name Pin_2) (type passive))
        (pin (num 3) (name Pin_3) (type passive))
        (pin (num 4) (name Pin_4) (type passive))))
    (libpart (lib Device) (part C_Small)
      (description "Unpolarized capacitor, small symbol")
      (docs ~)
      (footprints
        (fp C_*))
      (fields
        (field (name Reference) C)
        (field (name Value) C_Small))
      (pins
        (pin (num 1) (name ~) (type passive))
        (pin (num 2) (name ~) (type passive))))
    (libpart (lib Device) (part LED_Small)
      (description "Light emitting diode, small symbol")
      (docs ~)
      (footprints
        (fp LED*)
        (fp LED_SMD:*)
        (fp LED_THT:*))
      (fields
        (field (name Reference) D)
        (field (name Value) LED_Small))
      (pins
        (pin (num 1) (name K) (type passive))
        (pin (num 2) (name A) (type passive))))
    (libpart (lib Device) (part R_Small_US)
      (description "Resistor, small US symbol")
      (docs ~)
      (footprints
        (fp R_*))
      (fields
        (field (name Reference) R)
        (field (name Value) R_Small_US))
      (pins
        (pin (num 1) (name ~) (type passive))
        (pin (num 2) (name ~) (type passive))))
    (libpart (lib Oscillator) (part ECS-2520MV-xxx-xx)
      (description "HCMOS Crystal Clock Oscillator, 2.5x2.0 mm SMD")
      (docs https://www.ecsxtal.com/store/pdf/ECS-2520MV.pdf)
      (footprints
        (fp Oscillator*SMD*ECS*2520MV*2.5x2.0mm*))
      (fields
        (field (name Reference) X)
        (field (name Value) ECS-2520MV-xxx-xx)
        (field (name Footprint) Oscillator:Oscillator_SMD_ECS_2520MV-xxx-xx-4Pin_2.5x2.0mm))
      (pins
        (pin (num 1) (name Tri-State) (type input))
        (pin (num 2) (name GND) (type power_in))
        (pin (num 3) (name OUT) (type output))
        (pin (num 4) (name VDD) (type power_in))))
    (libpart (lib SparkFun-Connectors) (part USB_MICRO-B_SMT)
      (description "USB Type Micro-B Connector Male/female and PTH/SMT variants SparkFun Products:<ul><li><a href= https://www.sparkfun.com/products/12035 >SparkFun microB USB Breakout</a></li><li><a href= https://www.sparkfun.com/products/10031 >SparkFun USB microB Plug Breakout</a></li><li><a href= https://www.sparkfun.com/products/13231 >SparkFun ESP8266 Thing</a></li></ul>")
      (footprints
        (fp *USB-MICROB*))
      (fields
        (field (name Reference) J)
        (field (name Value) USB_MICRO-B_SMT)
        (field (name Footprint) USB-MICROB)
        (field (name Field4) CONN-09505))
      (pins
        (pin (num D+) (name D+) (type BiDi))
        (pin (num D-) (name D-) (type BiDi))
        (pin (num GND) (name GND) (type power_in))
        (pin (num ID) (name ID) (type BiDi))
        (pin (num MT1) (name SHIELD) (type BiDi))
        (pin (num MT2) (name SHIELD) (type BiDi))
        (pin (num P$1) (name SHIELD) (type BiDi))
        (pin (num P$2) (name SHIELD) (type BiDi))
        (pin (num VBUS) (name VBUS) (type power_in))))
    (libpart (lib dk_Embedded-Microcontrollers) (part ATMEGA32U4-AU)
      (description "IC MCU 8BIT 32KB FLASH 44TQFP")
      (docs http://ww1.microchip.com/downloads/en/DeviceDoc/Atmel-7766-8-bit-AVR-ATmega16U4-32U4_Summary.pdf)
      (fields
        (field (name Reference) U)
        (field (name Value) ATMEGA32U4-AU)
        (field (name Footprint) digikey-footprints:TQFP-44_10x10mm)
        (field (name Datasheet) http://ww1.microchip.com/downloads/en/DeviceDoc/Atmel-7766-8-bit-AVR-ATmega16U4-32U4_Summary.pdf)
        (field (name Digi-Key_PN) ATMEGA32U4-AU-ND)
        (field (name MPN) ATMEGA32U4-AU)
        (field (name Category) "Integrated Circuits (ICs)")
        (field (name Family) "Embedded - Microcontrollers")
        (field (name DK_Datasheet_Link) http://ww1.microchip.com/downloads/en/DeviceDoc/Atmel-7766-8-bit-AVR-ATmega16U4-32U4_Summary.pdf)
        (field (name DK_Detail_Page) /product-detail/en/microchip-technology/ATMEGA32U4-AU/ATMEGA32U4-AU-ND/1914602)
        (field (name Description) "IC MCU 8BIT 32KB FLASH 44TQFP")
        (field (name Manufacturer) "Microchip Technology")
        (field (name Status) Active))
      (pins
        (pin (num 1) (name PE6) (type BiDi))
        (pin (num 2) (name UVCC) (type power_in))
        (pin (num 3) (name D-) (type BiDi))
        (pin (num 4) (name D+) (type BiDi))
        (pin (num 5) (name UGND) (type power_in))
        (pin (num 6) (name UCAP) (type unspc))
        (pin (num 7) (name VBUS) (type input))
        (pin (num 8) (name PB0) (type BiDi))
        (pin (num 9) (name PB1) (type BiDi))
        (pin (num 10) (name PB2) (type BiDi))
        (pin (num 11) (name PB3) (type BiDi))
        (pin (num 12) (name PB7) (type BiDi))
        (pin (num 13) (name ~RES) (type input))
        (pin (num 14) (name VCC) (type power_in))
        (pin (num 15) (name GND) (type power_in))
        (pin (num 16) (name XTAL2) (type output))
        (pin (num 17) (name XTAL1) (type input))
        (pin (num 18) (name PD0) (type BiDi))
        (pin (num 19) (name PD1) (type BiDi))
        (pin (num 20) (name PD2) (type BiDi))
        (pin (num 21) (name PD3) (type BiDi))
        (pin (num 22) (name PD5) (type BiDi))
        (pin (num 23) (name GND) (type power_in))
        (pin (num 24) (name AVCC) (type power_in))
        (pin (num 25) (name PD4) (type BiDi))
        (pin (num 26) (name PD6) (type BiDi))
        (pin (num 27) (name PD7) (type BiDi))
        (pin (num 28) (name PB4) (type BiDi))
        (pin (num 29) (name PB5) (type BiDi))
        (pin (num 30) (name PB6) (type BiDi))
        (pin (num 31) (name PC6) (type BiDi))
        (pin (num 32) (name PC7) (type BiDi))
        (pin (num 33) (name PE2) (type BiDi))
        (pin (num 34) (name VCC) (type power_in))
        (pin (num 35) (name GND) (type power_in))
        (pin (num 36) (name PF7) (type BiDi))
        (pin (num 37) (name PF6) (type BiDi))
        (pin (num 38) (name PF5) (type BiDi))
        (pin (num 39) (name PF4) (type BiDi))
        (pin (num 40) (name PF1) (type BiDi))
        (pin (num 41) (name PF0) (type BiDi))
        (pin (num 42) (name AREF) (type input))
        (pin (num 43) (name GND) (type power_in))
        (pin (num 44) (name AVCC) (type power_in))))
    (libpart (lib dk_PMIC-Voltage-Regulators-Linear) (part MCP1700T-3302E_TT)
      (description "IC REG LINEAR 3.3V 250MA SOT23-3")
      (docs http://www.microchip.com/mymicrochip/filehandler.aspx?ddocname=en011779)
      (fields
        (field (name Reference) U)
        (field (name Value) MCP1700T-3302E_TT)
        (field (name Footprint) digikey-footprints:SOT-23-3)
        (field (name Datasheet) http://www.microchip.com/mymicrochip/filehandler.aspx?ddocname=en011779)
        (field (name Digi-Key_PN) MCP1700T3302ETTCT-ND)
        (field (name MPN) MCP1700T-3302E/TT)
        (field (name Category) "Integrated Circuits (ICs)")
        (field (name Family) "PMIC - Voltage Regulators - Linear")
        (field (name DK_Datasheet_Link) http://www.microchip.com/mymicrochip/filehandler.aspx?ddocname=en011779)
        (field (name DK_Detail_Page) /product-detail/en/microchip-technology/MCP1700T-3302E-TT/MCP1700T3302ETTCT-ND/652677)
        (field (name Description) "IC REG LINEAR 3.3V 250MA SOT23-3")
        (field (name Manufacturer) "Microchip Technology")
        (field (name Status) Active))
      (pins
        (pin (num 1) (name GND) (type power_in))
        (pin (num 2) (name OUT) (type power_out))
        (pin (num 3) (name IN) (type power_in))))
    (libpart (lib teensythumbboard-rescue) (part D_Zener_Small)
      (footprints
        (fp TO-???*)
        (fp *SingleDiode)
        (fp *_Diode_*)
        (fp *SingleDiode*)
        (fp D_*))
      (fields
        (field (name Reference) D)
        (field (name Value) D_Zener_Small))
      (pins
        (pin (num 1) (name K) (type passive))
        (pin (num 2) (name A) (type passive))))
    (libpart (lib teensythumbboard-rescue) (part SW_Push)
      (fields
        (field (name Reference) SW)
        (field (name Value) SW_Push))
      (pins
        (pin (num 1) (name 1) (type passive))
        (pin (num 2) (name 2) (type passive)))))
  (libraries
    (library (logical Connector)
      (uri /usr/share/kicad/library/Connector.lib))
    (library (logical Connector_Generic)
      (uri /usr/share/kicad/library/Connector_Generic.lib))
    (library (logical Device)
      (uri /usr/share/kicad/library/Device.lib))
    (library (logical Oscillator)
      (uri /usr/share/kicad/library/Oscillator.lib))
    (library (logical SparkFun-Connectors)
      (uri /home/core2idiot/Projects/SparkFun-KiCad-Libraries/Libraries/SparkFun-Connectors.lib))
    (library (logical dk_Embedded-Microcontrollers)
      (uri /home/core2idiot/Projects/digikey-kicad-library-master/digikey-symbols/dk_Embedded-Microcontrollers.lib))
    (library (logical dk_PMIC-Voltage-Regulators-Linear)
      (uri /home/core2idiot/Projects/digikey-kicad-library-master/digikey-symbols/dk_PMIC-Voltage-Regulators-Linear.lib))
    (library (logical teensythumbboard-rescue)
      (uri "/home/core2idiot/Projects/SeniorProject/Electrical Design/teensy-thumb-keyboard/hardware/v1.1/teensythumbboard-rescue.lib")))
  (nets
    (net (code 1) (name GND)
      (node (ref C1) (pin 2))
      (node (ref R5) (pin 2))
      (node (ref X1) (pin 2))
      (node (ref U1) (pin 35))
      (node (ref U1) (pin 23))
      (node (ref U1) (pin 43))
      (node (ref U1) (pin 15))
      (node (ref U1) (pin 5))
      (node (ref U2) (pin 1))
      (node (ref C2) (pin 2))
      (node (ref C3) (pin 2))
      (node (ref J1) (pin 4))
      (node (ref TP1) (pin 1))
      (node (ref J2) (pin P$1))
      (node (ref J2) (pin MT1))
      (node (ref J2) (pin ID))
      (node (ref J2) (pin P$2))
      (node (ref J2) (pin MT2))
      (node (ref J2) (pin GND)))
    (net (code 2) (name +5V)
      (node (ref C2) (pin 1))
      (node (ref U2) (pin 3))
      (node (ref TP3) (pin 1))
      (node (ref U1) (pin 7))
      (node (ref U1) (pin 2))
      (node (ref U1) (pin 44))
      (node (ref U1) (pin 34))
      (node (ref U1) (pin 24))
      (node (ref U1) (pin 14))
      (node (ref D11) (pin 2))
      (node (ref J2) (pin VBUS))
      (node (ref R2) (pin 1))
      (node (ref J1) (pin 1)))
    (net (code 3) (name USB_D-)
      (node (ref R3) (pin 2))
      (node (ref J1) (pin 2))
      (node (ref J2) (pin D-)))
    (net (code 4) (name "Net-(R3-Pad1)")
      (node (ref R3) (pin 1))
      (node (ref U1) (pin 3)))
    (net (code 5) (name "Net-(R4-Pad1)")
      (node (ref R4) (pin 1))
      (node (ref U1) (pin 4)))
    (net (code 6) (name USB_D+)
      (node (ref J1) (pin 3))
      (node (ref R4) (pin 2))
      (node (ref J2) (pin D+)))
    (net (code 7) (name CLK)
      (node (ref U1) (pin 17))
      (node (ref TP4) (pin 1))
      (node (ref X1) (pin 3)))
    (net (code 8) (name ROW3)
      (node (ref U1) (pin 31))
      (node (ref SW39) (pin 2))
      (node (ref SW38) (pin 2))
      (node (ref SW34) (pin 2))
      (node (ref SW40) (pin 2))
      (node (ref SW32) (pin 2))
      (node (ref SW31) (pin 2))
      (node (ref SW33) (pin 2))
      (node (ref SW37) (pin 2))
      (node (ref SW36) (pin 2))
      (node (ref SW35) (pin 2)))
    (net (code 9) (name ROW2)
      (node (ref SW30) (pin 2))
      (node (ref SW29) (pin 2))
      (node (ref SW28) (pin 2))
      (node (ref SW24) (pin 2))
      (node (ref SW27) (pin 2))
      (node (ref SW25) (pin 2))
      (node (ref SW26) (pin 2))
      (node (ref SW23) (pin 2))
      (node (ref SW22) (pin 2))
      (node (ref SW21) (pin 2))
      (node (ref U1) (pin 27)))
    (net (code 10) (name ROW4)
      (node (ref SW49) (pin 2))
      (node (ref SW48) (pin 2))
      (node (ref SW47) (pin 2))
      (node (ref SW46) (pin 2))
      (node (ref U1) (pin 26))
      (node (ref SW41) (pin 2))
      (node (ref SW42) (pin 2))
      (node (ref SW43) (pin 2))
      (node (ref SW44) (pin 2))
      (node (ref SW45) (pin 2))
      (node (ref SW50) (pin 2)))
    (net (code 11) (name COL8)
      (node (ref D9) (pin 1))
      (node (ref U1) (pin 20)))
    (net (code 12) (name "Net-(U1-Pad42)")
      (node (ref U1) (pin 42)))
    (net (code 13) (name "Net-(U1-Pad33)")
      (node (ref U1) (pin 33)))
    (net (code 14) (name "Net-(U1-Pad16)")
      (node (ref U1) (pin 16)))
    (net (code 15) (name "Net-(U1-Pad36)")
      (node (ref U1) (pin 36)))
    (net (code 16) (name "Net-(U1-Pad37)")
      (node (ref U1) (pin 37)))
    (net (code 17) (name "Net-(U1-Pad38)")
      (node (ref U1) (pin 38)))
    (net (code 18) (name "Net-(U1-Pad9)")
      (node (ref U1) (pin 9)))
    (net (code 19) (name "Net-(U1-Pad1)")
      (node (ref U1) (pin 1)))
    (net (code 20) (name "Net-(U1-Pad8)")
      (node (ref U1) (pin 8)))
    (net (code 21) (name "Net-(U1-Pad40)")
      (node (ref U1) (pin 40)))
    (net (code 22) (name COL9)
      (node (ref D10) (pin 1))
      (node (ref U1) (pin 21)))
    (net (code 23) (name "Net-(U1-Pad41)")
      (node (ref U1) (pin 41)))
    (net (code 24) (name "Net-(U1-Pad39)")
      (node (ref U1) (pin 39)))
    (net (code 25) (name +3V3)
      (node (ref U2) (pin 2))
      (node (ref TP5) (pin 1))
      (node (ref X1) (pin 4))
      (node (ref C3) (pin 1)))
    (net (code 26) (name "Net-(C1-Pad1)")
      (node (ref U1) (pin 6))
      (node (ref C1) (pin 1)))
    (net (code 27) (name "Net-(D11-Pad1)")
      (node (ref D11) (pin 1))
      (node (ref R5) (pin 1)))
    (net (code 28) (name "Net-(X1-Pad1)")
      (node (ref X1) (pin 1)))
    (net (code 29) (name RST)
      (node (ref TP0) (pin 1))
      (node (ref U1) (pin 13))
      (node (ref R2) (pin 2)))
    (net (code 30) (name ROW5)
      (node (ref SW60) (pin 2))
      (node (ref U1) (pin 32))
      (node (ref SW51) (pin 2))
      (node (ref SW52) (pin 2))
      (node (ref SW53) (pin 2))
      (node (ref SW54) (pin 2))
      (node (ref SW55) (pin 2))
      (node (ref SW56) (pin 2))
      (node (ref SW57) (pin 2))
      (node (ref SW58) (pin 2))
      (node (ref SW59) (pin 2)))
    (net (code 31) (name ROW0)
      (node (ref SW5) (pin 2))
      (node (ref SW4) (pin 2))
      (node (ref SW3) (pin 2))
      (node (ref SW2) (pin 2))
      (node (ref SW1) (pin 2))
      (node (ref SW6) (pin 2))
      (node (ref SW8) (pin 2))
      (node (ref U1) (pin 22))
      (node (ref SW10) (pin 2))
      (node (ref SW9) (pin 2))
      (node (ref SW7) (pin 2)))
    (net (code 32) (name ROW1)
      (node (ref SW17) (pin 2))
      (node (ref SW18) (pin 2))
      (node (ref SW19) (pin 2))
      (node (ref SW11) (pin 2))
      (node (ref SW20) (pin 2))
      (node (ref SW16) (pin 2))
      (node (ref U1) (pin 25))
      (node (ref SW15) (pin 2))
      (node (ref SW14) (pin 2))
      (node (ref SW13) (pin 2))
      (node (ref SW12) (pin 2)))
    (net (code 33) (name "Net-(D9-Pad2)")
      (node (ref D9) (pin 2))
      (node (ref SW9) (pin 1))
      (node (ref SW29) (pin 1))
      (node (ref SW19) (pin 1))
      (node (ref SW39) (pin 1))
      (node (ref SW59) (pin 1))
      (node (ref SW49) (pin 1)))
    (net (code 34) (name "Net-(D5-Pad2)")
      (node (ref SW55) (pin 1))
      (node (ref D5) (pin 2))
      (node (ref SW35) (pin 1))
      (node (ref SW25) (pin 1))
      (node (ref SW45) (pin 1))
      (node (ref SW15) (pin 1))
      (node (ref SW5) (pin 1)))
    (net (code 35) (name "Net-(D6-Pad2)")
      (node (ref SW16) (pin 1))
      (node (ref SW46) (pin 1))
      (node (ref SW6) (pin 1))
      (node (ref D6) (pin 2))
      (node (ref SW56) (pin 1))
      (node (ref SW36) (pin 1))
      (node (ref SW26) (pin 1)))
    (net (code 36) (name "Net-(D7-Pad2)")
      (node (ref SW27) (pin 1))
      (node (ref SW57) (pin 1))
      (node (ref D7) (pin 2))
      (node (ref SW47) (pin 1))
      (node (ref SW37) (pin 1))
      (node (ref SW17) (pin 1))
      (node (ref SW7) (pin 1)))
    (net (code 37) (name "Net-(D8-Pad2)")
      (node (ref D8) (pin 2))
      (node (ref SW28) (pin 1))
      (node (ref SW48) (pin 1))
      (node (ref SW58) (pin 1))
      (node (ref SW8) (pin 1))
      (node (ref SW38) (pin 1))
      (node (ref SW18) (pin 1)))
    (net (code 38) (name "Net-(D10-Pad2)")
      (node (ref SW20) (pin 1))
      (node (ref SW10) (pin 1))
      (node (ref SW60) (pin 1))
      (node (ref SW40) (pin 1))
      (node (ref D10) (pin 2))
      (node (ref SW30) (pin 1))
      (node (ref SW50) (pin 1)))
    (net (code 39) (name "Net-(D1-Pad2)")
      (node (ref SW31) (pin 1))
      (node (ref SW51) (pin 1))
      (node (ref SW41) (pin 1))
      (node (ref D1) (pin 2))
      (node (ref SW11) (pin 1))
      (node (ref SW1) (pin 1))
      (node (ref SW21) (pin 1)))
    (net (code 40) (name "Net-(D2-Pad2)")
      (node (ref SW52) (pin 1))
      (node (ref SW32) (pin 1))
      (node (ref SW12) (pin 1))
      (node (ref D2) (pin 2))
      (node (ref SW22) (pin 1))
      (node (ref SW2) (pin 1))
      (node (ref SW42) (pin 1)))
    (net (code 41) (name "Net-(D3-Pad2)")
      (node (ref SW53) (pin 1))
      (node (ref SW33) (pin 1))
      (node (ref SW43) (pin 1))
      (node (ref SW23) (pin 1))
      (node (ref SW3) (pin 1))
      (node (ref D3) (pin 2))
      (node (ref SW13) (pin 1)))
    (net (code 42) (name "Net-(D4-Pad2)")
      (node (ref SW34) (pin 1))
      (node (ref SW14) (pin 1))
      (node (ref SW44) (pin 1))
      (node (ref SW4) (pin 1))
      (node (ref SW24) (pin 1))
      (node (ref SW54) (pin 1))
      (node (ref D4) (pin 2)))
    (net (code 43) (name COL4)
      (node (ref D5) (pin 1))
      (node (ref U1) (pin 30)))
    (net (code 44) (name COL3)
      (node (ref D4) (pin 1))
      (node (ref U1) (pin 29)))
    (net (code 45) (name COL0)
      (node (ref D1) (pin 1))
      (node (ref U1) (pin 10)))
    (net (code 46) (name COL1)
      (node (ref U1) (pin 11))
      (node (ref D2) (pin 1)))
    (net (code 47) (name COL2)
      (node (ref U1) (pin 28))
      (node (ref D3) (pin 1)))
    (net (code 48) (name COL7)
      (node (ref D8) (pin 1))
      (node (ref U1) (pin 19)))
    (net (code 49) (name COL6)
      (node (ref U1) (pin 18))
      (node (ref D7) (pin 1)))
    (net (code 50) (name COL5)
      (node (ref U1) (pin 12))
      (node (ref D6) (pin 1)))))