(module SM150908-4 (layer F.Cu) (tedit 5E59A567)
  (fp_text reference REF** (at 2.0574 1.2192) (layer F.SilkS)
    (effects (font (size 1 1) (thickness 0.15)))
  )
  (fp_text value SM150908-4 (at 7.2136 -7.9756) (layer F.Fab)
    (effects (font (size 1 1) (thickness 0.15)))
  )
  (fp_line (start 0 0.0254) (end 13.9446 0.0254) (layer F.SilkS) (width 0.12))
  (fp_line (start 13.9446 0.0254) (end 13.9446 -10.4902) (layer F.SilkS) (width 0.12))
  (fp_line (start 13.9446 -10.4902) (end 0 -10.4902) (layer F.SilkS) (width 0.12))
  (fp_line (start 0 -10.4902) (end 0 0.0254) (layer F.SilkS) (width 0.12))
  (pad 1 smd rect (at 1.11534 -9.6091) (size 2 2) (layers F.Cu F.Paste F.Mask))
  (pad 2 smd rect (at 12.91534 -9.6091) (size 2 2) (layers F.Cu F.Paste F.Mask))
  (pad 3 smd rect (at 1.11534 -1.0091) (size 2 2) (layers F.Cu F.Paste F.Mask))
  (pad 4 smd rect (at 12.91534 -1.0091) (size 2 2) (layers F.Cu F.Paste F.Mask))
)
