EESchema Schematic File Version 4
EELAYER 30 0
EELAYER END
$Descr A4 11693 8268
encoding utf-8
Sheet 6 8
Title ""
Date ""
Rev ""
Comp ""
Comment1 ""
Comment2 ""
Comment3 ""
Comment4 ""
$EndDescr
$Comp
L Connector:Bus_PCI_Express_Mini J8
U 1 1 5DBB6E75
P 2850 2750
F 0 "J8" H 2950 1600 50  0000 C CNN
F 1 "Bus_PCI_Express_Mini" H 2350 1600 50  0000 C CNN
F 2 "mpcie:mpcie-socket" H 2850 2750 50  0001 C CNN
F 3 "~" H 2700 1600 50  0001 C CNN
	1    2850 2750
	1    0    0    -1  
$EndComp
$Comp
L dk_Memory-Connectors-PC-Card-Sockets:5045200691 J9
U 1 1 5DBB93B3
P 2050 6550
F 0 "J9" H 2178 6495 60  0000 L CNN
F 1 "5045200691" H 2178 6389 60  0000 L CNN
F 2 "digikey-footprints:SIM_Nano_5045200691" H 2250 6750 60  0001 L CNN
F 3 "https://www.molex.com/pdm_docs/sd/5045200691_sd.pdf" H 2250 6850 60  0001 L CNN
F 4 "WM12731CT-ND" H 2250 6950 60  0001 L CNN "Digi-Key_PN"
F 5 "5045200691" H 2250 7050 60  0001 L CNN "MPN"
F 6 "Connectors, Interconnects" H 2250 7150 60  0001 L CNN "Category"
F 7 "Memory Connectors - PC Card Sockets" H 2250 7250 60  0001 L CNN "Family"
F 8 "https://www.molex.com/pdm_docs/sd/5045200691_sd.pdf" H 2250 7350 60  0001 L CNN "DK_Datasheet_Link"
F 9 "/product-detail/en/molex-llc/5045200691/WM12731CT-ND/5822267" H 2250 7450 60  0001 L CNN "DK_Detail_Page"
F 10 "NANO-SIM CARD CONNECTOR, PIN-EJE" H 2250 7550 60  0001 L CNN "Description"
F 11 "Molex, LLC" H 2250 7650 60  0001 L CNN "Manufacturer"
F 12 "Active" H 2250 7750 60  0001 L CNN "Status"
	1    2050 6550
	1    0    0    -1  
$EndComp
$Comp
L power:+3V3 #PWR0114
U 1 1 5DBBACFD
P 2650 1250
F 0 "#PWR0114" H 2650 1100 50  0001 C CNN
F 1 "+3V3" H 2665 1423 50  0000 C CNN
F 2 "" H 2650 1250 50  0001 C CNN
F 3 "" H 2650 1250 50  0001 C CNN
	1    2650 1250
	1    0    0    -1  
$EndComp
Wire Wire Line
	2850 1450 2850 1350
Wire Wire Line
	2850 1350 2750 1350
Wire Wire Line
	2450 1350 2450 1450
Wire Wire Line
	2650 1250 2650 1350
Connection ~ 2650 1350
Wire Wire Line
	2650 1350 2550 1350
Wire Wire Line
	2750 1450 2750 1350
Connection ~ 2750 1350
Wire Wire Line
	2750 1350 2650 1350
Wire Wire Line
	2650 1450 2650 1350
Wire Wire Line
	2550 1450 2550 1350
Connection ~ 2550 1350
Wire Wire Line
	2550 1350 2450 1350
$Comp
L power:GND #PWR0115
U 1 1 5DBBDAAC
P 3000 4050
F 0 "#PWR0115" H 3000 3800 50  0001 C CNN
F 1 "GND" H 3005 3877 50  0000 C CNN
F 2 "" H 3000 4050 50  0001 C CNN
F 3 "" H 3000 4050 50  0001 C CNN
	1    3000 4050
	1    0    0    -1  
$EndComp
Wire Wire Line
	3000 4050 3000 4000
Wire Wire Line
	3000 4000 2850 4000
Wire Wire Line
	2850 4000 2850 3950
$Comp
L Device:Speaker LS1
U 1 1 5DBC1C5B
P 9050 1450
F 0 "LS1" H 9220 1446 50  0000 L CNN
F 1 "Speaker" H 9220 1355 50  0000 L CNN
F 2 "PCB:SM150908-4" H 9050 1250 50  0001 C CNN
F 3 "~" H 9040 1400 50  0001 C CNN
	1    9050 1450
	1    0    0    -1  
$EndComp
$Comp
L Device:Microphone MK1
U 1 1 5DBC5EC8
P 10300 1600
F 0 "MK1" H 10430 1646 50  0000 L CNN
F 1 "Microphone" H 10430 1555 50  0000 L CNN
F 2 "Connector_PinSocket_2.54mm:PinSocket_1x02_P2.54mm_Vertical" V 10300 1700 50  0001 C CNN
F 3 "~" V 10300 1700 50  0001 C CNN
	1    10300 1600
	1    0    0    -1  
$EndComp
Text GLabel 10000 1300 0    50   Input ~ 0
MICP
Text GLabel 10000 1900 0    50   Input ~ 0
MICN
Wire Wire Line
	10200 1300 10300 1300
Wire Wire Line
	10300 1300 10300 1400
Wire Wire Line
	10200 1900 10300 1900
Wire Wire Line
	10300 1900 10300 1800
Text GLabel 8550 1450 0    50   Input ~ 0
EARP
Wire Wire Line
	8850 1550 8750 1550
NoConn ~ 3050 1450
NoConn ~ 3150 1450
NoConn ~ 3250 1450
NoConn ~ 2150 2350
NoConn ~ 2150 2450
NoConn ~ 2150 2550
NoConn ~ 2150 2650
Text Notes 750  2850 0    50   ~ 0
UART CTS/RTS
NoConn ~ 3550 2050
NoConn ~ 3550 1950
Text Notes 4400 3750 0    50   ~ 0
UART RX/TX
Text GLabel 3750 3250 2    50   Output ~ 0
SIM_VCC
Text GLabel 3750 3550 2    50   Output ~ 0
SIM_RST
Text GLabel 3750 3450 2    50   Input ~ 0
SIM_CLK
Text GLabel 3750 3350 2    50   BiDi ~ 0
SIM_DATA
Wire Wire Line
	3750 3250 3550 3250
Wire Wire Line
	3750 3350 3550 3350
Wire Wire Line
	3750 3550 3550 3550
Wire Wire Line
	3550 3450 3750 3450
Text GLabel 1650 6350 0    50   Input ~ 0
SIM_VCC
Text GLabel 1150 6450 0    50   Input ~ 0
SIM_RST
Text GLabel 1150 6550 0    50   Input ~ 0
SIM_CLK
Text GLabel 1200 6850 0    50   BiDi ~ 0
SIM_DATA
$Comp
L power:GND #PWR0116
U 1 1 5DD1A43C
P 1800 7200
F 0 "#PWR0116" H 1800 6950 50  0001 C CNN
F 1 "GND" H 1805 7027 50  0000 C CNN
F 2 "" H 1800 7200 50  0001 C CNN
F 3 "" H 1800 7200 50  0001 C CNN
	1    1800 7200
	1    0    0    -1  
$EndComp
Wire Wire Line
	2050 7050 2050 7100
Wire Wire Line
	2050 7100 1800 7100
Wire Wire Line
	1800 7100 1800 7200
Wire Wire Line
	1850 6650 1800 6650
Wire Wire Line
	1800 6650 1800 7100
Connection ~ 1800 7100
Wire Wire Line
	1650 6850 1850 6850
Wire Wire Line
	1650 6550 1850 6550
Wire Wire Line
	1650 6450 1850 6450
Wire Wire Line
	1850 6350 1650 6350
Text GLabel 3750 3150 2    50   Input ~ 0
SIM_VPP
Wire Wire Line
	3750 3150 3550 3150
Text GLabel 1650 6750 0    50   Output ~ 0
SIM_VPP
Wire Wire Line
	1850 6750 1650 6750
$Comp
L Device:LED_Small D1
U 1 1 5DD29DE0
P 3900 2150
F 0 "D1" H 3900 2385 50  0000 C CNN
F 1 "LED_WWAN" H 3900 2294 50  0000 C CNN
F 2 "LED_SMD:LED_0603_1608Metric_Pad1.05x0.95mm_HandSolder" V 3900 2150 50  0001 C CNN
F 3 "~" V 3900 2150 50  0001 C CNN
	1    3900 2150
	-1   0    0    -1  
$EndComp
$Comp
L Device:R_Small_US R5
U 1 1 5DD2BE21
P 4450 2150
F 0 "R5" V 4245 2150 50  0000 C CNN
F 1 "10K" V 4336 2150 50  0000 C CNN
F 2 "Resistor_SMD:R_0603_1608Metric_Pad1.05x0.95mm_HandSolder" H 4450 2150 50  0001 C CNN
F 3 "~" H 4450 2150 50  0001 C CNN
	1    4450 2150
	0    1    1    0   
$EndComp
Wire Wire Line
	3550 2150 3800 2150
Wire Wire Line
	4000 2150 4350 2150
Wire Wire Line
	4550 2150 4600 2150
Wire Wire Line
	4600 2150 4600 1900
$Comp
L power:+3.3V #PWR0117
U 1 1 5DD2FD65
P 4600 1900
F 0 "#PWR0117" H 4600 1750 50  0001 C CNN
F 1 "+3.3V" H 4615 2073 50  0000 C CNN
F 2 "" H 4600 1900 50  0001 C CNN
F 3 "" H 4600 1900 50  0001 C CNN
	1    4600 1900
	1    0    0    -1  
$EndComp
Text Notes 1800 4550 0    50   ~ 0
This is designed to be populated with SIMCOM 7600A\nPCI-E Lanes currently not connected
$Comp
L MainPCB:NAU8810 U3
U 1 1 5DCBC658
P 9650 5000
F 0 "U3" H 9650 5865 50  0000 C CNN
F 1 "NAU8810" H 9650 5774 50  0000 C CNN
F 2 "Package_DFN_QFN:QFN-20-1EP_4x4mm_P0.5mm_EP2.7x2.7mm_ThermalVias" H 9650 5950 50  0001 C CNN
F 3 "" H 9650 5950 50  0001 C CNN
	1    9650 5000
	1    0    0    -1  
$EndComp
Text GLabel 10400 5300 2    50   Input ~ 0
MICN
Text GLabel 10400 5400 2    50   Input ~ 0
MICP
Text GLabel 10400 4700 2    50   Input ~ 0
EARP
Wire Wire Line
	10100 5400 10400 5400
Wire Wire Line
	10400 5300 10100 5300
Wire Wire Line
	10400 4700 10100 4700
$Comp
L Device:C_Small C7
U 1 1 5DCC767F
P 10100 1900
F 0 "C7" V 10329 1900 50  0000 C CNN
F 1 "1uF" V 10238 1900 50  0000 C CNN
F 2 "Capacitor_SMD:C_0603_1608Metric_Pad1.05x0.95mm_HandSolder" H 10100 1900 50  0001 C CNN
F 3 "~" H 10100 1900 50  0001 C CNN
	1    10100 1900
	0    -1   -1   0   
$EndComp
$Comp
L Device:C_Small C6
U 1 1 5DCC93B4
P 10100 1300
F 0 "C6" V 9871 1300 50  0000 C CNN
F 1 "1uF" V 9962 1300 50  0000 C CNN
F 2 "Capacitor_SMD:C_0603_1608Metric_Pad1.05x0.95mm_HandSolder" H 10100 1300 50  0001 C CNN
F 3 "~" H 10100 1300 50  0001 C CNN
	1    10100 1300
	0    1    1    0   
$EndComp
$Comp
L Device:R_Small_US R8
U 1 1 5DCCBAC9
P 10300 2000
F 0 "R8" H 10368 2046 50  0000 L CNN
F 1 "1.3k" H 10368 1955 50  0000 L CNN
F 2 "Resistor_SMD:R_0603_1608Metric_Pad1.05x0.95mm_HandSolder" H 10300 2000 50  0001 C CNN
F 3 "~" H 10300 2000 50  0001 C CNN
	1    10300 2000
	1    0    0    -1  
$EndComp
Connection ~ 10300 1900
$Comp
L Device:R_Small_US R7
U 1 1 5DCCC0BB
P 10300 1200
F 0 "R7" H 10368 1246 50  0000 L CNN
F 1 "1.3K" H 10368 1155 50  0000 L CNN
F 2 "Resistor_SMD:R_0603_1608Metric_Pad1.05x0.95mm_HandSolder" H 10300 1200 50  0001 C CNN
F 3 "~" H 10300 1200 50  0001 C CNN
	1    10300 1200
	1    0    0    -1  
$EndComp
Connection ~ 10300 1300
Text GLabel 10100 800  0    50   Input ~ 0
MICBIAS
Wire Wire Line
	10300 1100 10300 800 
Wire Wire Line
	10300 800  10100 800 
$Comp
L power:GND #PWR0118
U 1 1 5DCCF90B
P 10300 2200
F 0 "#PWR0118" H 10300 1950 50  0001 C CNN
F 1 "GND" H 10305 2027 50  0000 C CNN
F 2 "" H 10300 2200 50  0001 C CNN
F 3 "" H 10300 2200 50  0001 C CNN
	1    10300 2200
	1    0    0    -1  
$EndComp
Wire Wire Line
	10300 2100 10300 2200
$Comp
L Device:C_Small C5
U 1 1 5DCD90BB
P 8750 1650
F 0 "C5" H 8842 1696 50  0000 L CNN
F 1 "47uF" H 8842 1605 50  0000 L CNN
F 2 "Capacitor_SMD:C_0603_1608Metric_Pad1.05x0.95mm_HandSolder" H 8750 1650 50  0001 C CNN
F 3 "~" H 8750 1650 50  0001 C CNN
	1    8750 1650
	1    0    0    -1  
$EndComp
Wire Wire Line
	8750 1450 8850 1450
$Comp
L Device:C_Small C4
U 1 1 5DCD9F51
P 8650 1450
F 0 "C4" V 8421 1450 50  0000 C CNN
F 1 "47uF" V 8512 1450 50  0000 C CNN
F 2 "Capacitor_SMD:C_0603_1608Metric_Pad1.05x0.95mm_HandSolder" H 8650 1450 50  0001 C CNN
F 3 "~" H 8650 1450 50  0001 C CNN
	1    8650 1450
	0    1    1    0   
$EndComp
$Comp
L power:GND #PWR0119
U 1 1 5DCDB875
P 8750 1750
F 0 "#PWR0119" H 8750 1500 50  0001 C CNN
F 1 "GND" H 8755 1577 50  0000 C CNN
F 2 "" H 8750 1750 50  0001 C CNN
F 3 "" H 8750 1750 50  0001 C CNN
	1    8750 1750
	1    0    0    -1  
$EndComp
$Comp
L power:+3.3V #PWR0120
U 1 1 5DCDF534
P 8950 4500
F 0 "#PWR0120" H 8950 4350 50  0001 C CNN
F 1 "+3.3V" H 8965 4673 50  0000 C CNN
F 2 "" H 8950 4500 50  0001 C CNN
F 3 "" H 8950 4500 50  0001 C CNN
	1    8950 4500
	1    0    0    -1  
$EndComp
Wire Wire Line
	9200 4600 8950 4600
Wire Wire Line
	8950 4600 8950 4500
Text GLabel 9150 4400 1    50   Input ~ 0
MICBIAS
Wire Wire Line
	9200 4500 9150 4500
Wire Wire Line
	9150 4500 9150 4400
$Comp
L power:+1V8 #PWR0121
U 1 1 5DCE6BAB
P 9000 4800
F 0 "#PWR0121" H 9000 4650 50  0001 C CNN
F 1 "+1V8" V 9015 4928 50  0000 L CNN
F 2 "" H 9000 4800 50  0001 C CNN
F 3 "" H 9000 4800 50  0001 C CNN
	1    9000 4800
	0    -1   -1   0   
$EndComp
Wire Wire Line
	9200 4800 9000 4800
$Comp
L power:GND #PWR0122
U 1 1 5DCEC626
P 9650 5700
F 0 "#PWR0122" H 9650 5450 50  0001 C CNN
F 1 "GND" H 9655 5527 50  0000 C CNN
F 2 "" H 9650 5700 50  0001 C CNN
F 3 "" H 9650 5700 50  0001 C CNN
	1    9650 5700
	1    0    0    -1  
$EndComp
Wire Wire Line
	9200 4700 9100 4700
Wire Wire Line
	9200 4900 9100 4900
NoConn ~ 10100 5200
NoConn ~ 10100 5000
NoConn ~ 10100 4900
Wire Wire Line
	10250 5100 10250 5050
Wire Wire Line
	10100 5100 10250 5100
NoConn ~ 10100 4800
Text GLabel 8950 5000 0    50   Output ~ 0
PCM_IN
Text GLabel 8950 5100 0    50   Input ~ 0
PCM_OUT
Text GLabel 8950 5200 0    50   Input ~ 0
PCM_SYNC
Text GLabel 8950 5300 0    50   Input ~ 0
PCM_CLK
Wire Wire Line
	8950 5000 9200 5000
Wire Wire Line
	8950 5100 9200 5100
Wire Wire Line
	8950 5200 9200 5200
Wire Wire Line
	8950 5300 9050 5300
Wire Wire Line
	9050 5300 9050 5400
Wire Wire Line
	9050 5400 9200 5400
Connection ~ 9050 5300
Wire Wire Line
	9050 5300 9200 5300
$Comp
L Device:C_Small C3
U 1 1 5DD0A374
P 9050 5500
F 0 "C3" H 9142 5546 50  0000 L CNN
F 1 "100pF" H 9142 5455 50  0000 L CNN
F 2 "Capacitor_SMD:C_0603_1608Metric_Pad1.05x0.95mm_HandSolder" H 9050 5500 50  0001 C CNN
F 3 "~" H 9050 5500 50  0001 C CNN
	1    9050 5500
	1    0    0    -1  
$EndComp
Connection ~ 9050 5400
$Comp
L power:GND #PWR0124
U 1 1 5DD0A7D6
P 9050 5600
F 0 "#PWR0124" H 9050 5350 50  0001 C CNN
F 1 "GND" H 9055 5427 50  0000 C CNN
F 2 "" H 9050 5600 50  0001 C CNN
F 3 "" H 9050 5600 50  0001 C CNN
	1    9050 5600
	1    0    0    -1  
$EndComp
Text GLabel 10400 4500 2    50   Input ~ 0
SCL
Text GLabel 10400 4600 2    50   Input ~ 0
SDA
Wire Wire Line
	10400 4600 10100 4600
Wire Wire Line
	10400 4500 10100 4500
Text GLabel 3750 2850 2    50   Input ~ 0
PCM_IN
Text GLabel 3750 2750 2    50   Output ~ 0
PCM_OUT
Text GLabel 3750 2950 2    50   Output ~ 0
PCM_SYNC
Text GLabel 3750 2650 2    50   Output ~ 0
PCM_CLK
$Comp
L Device:R_Small_US R4
U 1 1 5DD28507
P 1550 6850
F 0 "R4" V 1600 6750 50  0000 C CNN
F 1 "R22" V 1600 7000 50  0000 C CNN
F 2 "Resistor_SMD:R_0603_1608Metric_Pad1.05x0.95mm_HandSolder" H 1550 6850 50  0001 C CNN
F 3 "~" H 1550 6850 50  0001 C CNN
	1    1550 6850
	0    1    1    0   
$EndComp
Wire Wire Line
	1200 6850 1450 6850
$Comp
L Device:R_Small_US R3
U 1 1 5DD2E7C4
P 1550 6550
F 0 "R3" V 1600 6450 50  0000 C CNN
F 1 "R22" V 1600 6700 50  0000 C CNN
F 2 "Resistor_SMD:R_0603_1608Metric_Pad1.05x0.95mm_HandSolder" H 1550 6550 50  0001 C CNN
F 3 "~" H 1550 6550 50  0001 C CNN
	1    1550 6550
	0    1    1    0   
$EndComp
Wire Wire Line
	1450 6550 1150 6550
$Comp
L Device:R_Small_US R2
U 1 1 5DD33EE7
P 1550 6450
F 0 "R2" V 1600 6350 50  0000 C CNN
F 1 "R22" V 1600 6600 50  0000 C CNN
F 2 "Resistor_SMD:R_0603_1608Metric_Pad1.05x0.95mm_HandSolder" H 1550 6450 50  0001 C CNN
F 3 "~" H 1550 6450 50  0001 C CNN
	1    1550 6450
	0    1    1    0   
$EndComp
Wire Wire Line
	1450 6450 1150 6450
Wire Wire Line
	3750 2650 3550 2650
Wire Wire Line
	3750 2750 3550 2750
Wire Wire Line
	3750 2850 3550 2850
Wire Wire Line
	3750 2950 3550 2950
Wire Wire Line
	2150 2050 1950 2050
Wire Wire Line
	1950 2150 2150 2150
NoConn ~ 2150 3650
NoConn ~ 2150 3550
Text GLabel 1950 3750 0    50   Input ~ 0
CELL_RST
Wire Wire Line
	2150 3750 1950 3750
$Comp
L power:+3.3V #PWR0128
U 1 1 5DD086B2
P 4000 6400
F 0 "#PWR0128" H 4000 6250 50  0001 C CNN
F 1 "+3.3V" H 4015 6573 50  0000 C CNN
F 2 "" H 4000 6400 50  0001 C CNN
F 3 "" H 4000 6400 50  0001 C CNN
	1    4000 6400
	1    0    0    -1  
$EndComp
$Comp
L Device:R_Small_US R6
U 1 1 5DD08C41
P 4000 6600
F 0 "R6" H 4068 6646 50  0000 L CNN
F 1 "CELL_RST" H 4068 6555 50  0000 L CNN
F 2 "Resistor_SMD:R_0603_1608Metric_Pad1.05x0.95mm_HandSolder" H 4000 6600 50  0001 C CNN
F 3 "~" H 4000 6600 50  0001 C CNN
	1    4000 6600
	1    0    0    -1  
$EndComp
Wire Wire Line
	4000 6700 4000 6800
Wire Wire Line
	4000 6500 4000 6400
Text GLabel 3800 6800 0    50   Input ~ 0
CELL_RST
Wire Wire Line
	3800 6800 4000 6800
NoConn ~ 3550 2350
NoConn ~ 3550 2450
Text GLabel 1950 3250 0    50   Input ~ 0
SCL
Text GLabel 1950 3150 0    50   Input ~ 0
SDA
Wire Wire Line
	2150 3150 1950 3150
Wire Wire Line
	2150 3250 1950 3250
$Comp
L Connector:TestPoint TP3
U 1 1 5E193662
P 4000 6800
F 0 "TP3" H 3942 6826 50  0000 R CNN
F 1 "Cell Module RST" H 3942 6917 50  0000 R CNN
F 2 "TestPoint:TestPoint_Pad_D1.0mm" H 4200 6800 50  0001 C CNN
F 3 "~" H 4200 6800 50  0001 C CNN
	1    4000 6800
	-1   0    0    1   
$EndComp
Connection ~ 4000 6800
$Comp
L power:+3.3V #PWR0146
U 1 1 5E1C5A8D
P 10250 5050
F 0 "#PWR0146" H 10250 4900 50  0001 C CNN
F 1 "+3.3V" H 10265 5223 50  0000 C CNN
F 2 "" H 10250 5050 50  0001 C CNN
F 3 "" H 10250 5050 50  0001 C CNN
	1    10250 5050
	1    0    0    -1  
$EndComp
Wire Notes Line
	600  5950 2950 5950
Wire Notes Line
	2950 5950 2950 7700
Wire Notes Line
	2950 7700 600  7700
Wire Notes Line
	600  7700 600  5950
Text Notes 650  7650 0    50   ~ 0
SIM Card Slot
Wire Notes Line
	8150 3750 11150 3750
Wire Notes Line
	11150 3750 11150 6450
Wire Notes Line
	11150 6450 8150 6450
Wire Notes Line
	8150 6450 8150 3750
Text Notes 8200 6400 0    50   ~ 0
Cellular Module DAC
Wire Notes Line
	8150 3700 11150 3700
Wire Notes Line
	11150 3700 11150 550 
Wire Notes Line
	8150 550  8150 3700
Wire Notes Line
	8150 550  11150 550 
Text Notes 8250 3600 0    50   ~ 0
Earpiece and Microphone
Wire Notes Line
	600  5900 5050 5900
Wire Notes Line
	5050 5900 5050 700 
Wire Notes Line
	5050 700  600  700 
Wire Notes Line
	600  700  600  5900
Text Notes 650  5850 0    50   ~ 0
Cellular Module (Mini PCI-E) Slot
Wire Notes Line
	3250 7700 5050 7700
Wire Notes Line
	5050 7700 5050 5950
Wire Notes Line
	5050 5950 3250 5950
Wire Notes Line
	3250 5950 3250 7700
Text Notes 3300 7650 0    50   ~ 0
Cellular Module (Mini PCI-E) Reset
Text GLabel 1950 2050 0    50   Input ~ 0
USB4_DP
Text GLabel 1950 2150 0    50   Input ~ 0
USB4_DN
Text Notes 1150 1950 0    50   ~ 0
Coming from USB Hub
Wire Wire Line
	9650 5600 9650 5700
$Comp
L power:GND #PWR0133
U 1 1 5E1DFF60
P 9100 4900
F 0 "#PWR0133" H 9100 4650 50  0001 C CNN
F 1 "GND" V 9105 4772 50  0000 R CNN
F 2 "" H 9100 4900 50  0001 C CNN
F 3 "" H 9100 4900 50  0001 C CNN
	1    9100 4900
	0    1    1    0   
$EndComp
$Comp
L power:GND #PWR0134
U 1 1 5E1E18F3
P 9100 4700
F 0 "#PWR0134" H 9100 4450 50  0001 C CNN
F 1 "GND" V 9105 4572 50  0000 R CNN
F 2 "" H 9100 4700 50  0001 C CNN
F 3 "" H 9100 4700 50  0001 C CNN
	1    9100 4700
	0    1    1    0   
$EndComp
NoConn ~ 2150 2850
NoConn ~ 2150 2950
NoConn ~ 3550 3650
NoConn ~ 3550 3750
NoConn ~ 2150 3450
$EndSCHEMATC
