(module 40PIN_LCD (layer F.Cu) (tedit 5E597E8B)
  (fp_text reference REF** (at 0 0.5) (layer F.SilkS)
    (effects (font (size 1 1) (thickness 0.15)))
  )
  (fp_text value 40PIN_LCD (at 0 -0.5) (layer F.Fab)
    (effects (font (size 1 1) (thickness 0.15)))
  )
  (fp_line (start -8.05 -6.85) (end 18.45 -6.85) (layer F.SilkS) (width 0.12))
  (fp_line (start 18.45 -6.85) (end 18.45 -1.8) (layer F.SilkS) (width 0.12))
  (fp_line (start 18.45 -1.8) (end -8.6 -1.8) (layer F.SilkS) (width 0.12))
  (fp_line (start -8.6 -1.8) (end -8.6 -6.85) (layer F.SilkS) (width 0.12))
  (fp_line (start -8.6 -6.85) (end -8.05 -6.85) (layer F.SilkS) (width 0.12))
  (pad 1 smd rect (at -4.7 -5.5) (size 0.4 1.524) (layers F.Cu F.Paste F.Mask))
  (pad 2 smd rect (at -4.2 -5.5) (size 0.4 1.524) (layers F.Cu F.Paste F.Mask))
  (pad 3 smd rect (at -3.7 -5.5) (size 0.4 1.524) (layers F.Cu F.Paste F.Mask))
  (pad 4 smd rect (at -3.2 -5.5) (size 0.4 1.524) (layers F.Cu F.Paste F.Mask))
  (pad 5 smd rect (at -2.7 -5.5) (size 0.4 1.524) (layers F.Cu F.Paste F.Mask))
  (pad 6 smd rect (at -2.2 -5.5) (size 0.4 1.524) (layers F.Cu F.Paste F.Mask))
  (pad 7 smd rect (at -1.7 -5.5) (size 0.4 1.524) (layers F.Cu F.Paste F.Mask))
  (pad 8 smd rect (at -1.2 -5.5) (size 0.4 1.524) (layers F.Cu F.Paste F.Mask))
  (pad 9 smd rect (at -0.7 -5.5) (size 0.4 1.524) (layers F.Cu F.Paste F.Mask))
  (pad 10 smd rect (at -0.2 -5.5) (size 0.4 1.524) (layers F.Cu F.Paste F.Mask))
  (pad 11 smd rect (at 0.3 -5.5) (size 0.4 1.524) (layers F.Cu F.Paste F.Mask))
  (pad 12 smd rect (at 0.8 -5.5) (size 0.4 1.524) (layers F.Cu F.Paste F.Mask))
  (pad 13 smd rect (at 1.3 -5.5) (size 0.4 1.524) (layers F.Cu F.Paste F.Mask))
  (pad 14 smd rect (at 1.8 -5.5) (size 0.4 1.524) (layers F.Cu F.Paste F.Mask))
  (pad 15 smd rect (at 2.3 -5.5) (size 0.4 1.524) (layers F.Cu F.Paste F.Mask))
  (pad 16 smd rect (at 2.8 -5.5) (size 0.4 1.524) (layers F.Cu F.Paste F.Mask))
  (pad 17 smd rect (at 3.3 -5.5) (size 0.4 1.524) (layers F.Cu F.Paste F.Mask))
  (pad 18 smd rect (at 3.8 -5.5) (size 0.4 1.524) (layers F.Cu F.Paste F.Mask))
  (pad 19 smd rect (at 4.3 -5.5) (size 0.4 1.524) (layers F.Cu F.Paste F.Mask))
  (pad 20 smd rect (at 4.8 -5.5) (size 0.4 1.524) (layers F.Cu F.Paste F.Mask))
  (pad 21 smd rect (at 5.3 -5.5) (size 0.4 1.524) (layers F.Cu F.Paste F.Mask))
  (pad 22 smd rect (at 5.8 -5.5) (size 0.4 1.524) (layers F.Cu F.Paste F.Mask))
  (pad 23 smd rect (at 6.3 -5.5) (size 0.4 1.524) (layers F.Cu F.Paste F.Mask))
  (pad 24 smd rect (at 6.8 -5.5) (size 0.4 1.524) (layers F.Cu F.Paste F.Mask))
  (pad 25 smd rect (at 7.3 -5.5) (size 0.4 1.524) (layers F.Cu F.Paste F.Mask))
  (pad 26 smd rect (at 7.8 -5.5) (size 0.4 1.524) (layers F.Cu F.Paste F.Mask))
  (pad 27 smd rect (at 8.3 -5.5) (size 0.4 1.524) (layers F.Cu F.Paste F.Mask))
  (pad 28 smd rect (at 8.8 -5.5) (size 0.4 1.524) (layers F.Cu F.Paste F.Mask))
  (pad 29 smd rect (at 9.3 -5.5) (size 0.4 1.524) (layers F.Cu F.Paste F.Mask))
  (pad 30 smd rect (at 9.8 -5.5) (size 0.4 1.524) (layers F.Cu F.Paste F.Mask))
  (pad 31 smd rect (at 10.3 -5.5) (size 0.4 1.524) (layers F.Cu F.Paste F.Mask))
  (pad 32 smd rect (at 10.8 -5.5) (size 0.4 1.524) (layers F.Cu F.Paste F.Mask))
  (pad 33 smd rect (at 11.3 -5.5) (size 0.4 1.524) (layers F.Cu F.Paste F.Mask))
  (pad 34 smd rect (at 11.8 -5.5) (size 0.4 1.524) (layers F.Cu F.Paste F.Mask))
  (pad 35 smd rect (at 12.3 -5.5) (size 0.4 1.524) (layers F.Cu F.Paste F.Mask))
  (pad 36 smd rect (at 12.8 -5.5) (size 0.4 1.524) (layers F.Cu F.Paste F.Mask))
  (pad 37 smd rect (at 13.3 -5.5) (size 0.4 1.524) (layers F.Cu F.Paste F.Mask))
  (pad 38 smd rect (at 13.8 -5.5) (size 0.4 1.524) (layers F.Cu F.Paste F.Mask))
  (pad 39 smd rect (at 14.3 -5.5) (size 0.4 1.524) (layers F.Cu F.Paste F.Mask))
  (pad 40 smd rect (at 14.8 -5.5) (size 0.4 1.524) (layers F.Cu F.Paste F.Mask))
  (pad 1 smd rect (at -6.6 -4) (size 2.4 3.2) (layers F.Cu F.Paste F.Mask))
  (pad 2 smd rect (at 16.73 -4) (size 2.4 3.2) (layers F.Cu F.Paste F.Mask))
)
