EESchema Schematic File Version 4
EELAYER 30 0
EELAYER END
$Descr A4 11693 8268
encoding utf-8
Sheet 7 8
Title ""
Date ""
Rev ""
Comp ""
Comment1 ""
Comment2 ""
Comment3 ""
Comment4 ""
$EndDescr
Text Notes 600  2300 0    50   ~ 0
LCD FPC Connector
$Comp
L Connector:Conn_01x40_Female J2
U 1 1 5E729EB3
P 2800 2000
F 0 "J2" V 2850 2050 50  0000 L CNN
F 1 "DPI LCD FPC Connector" V 2850 2250 50  0000 L CNN
F 2 "Connector_FFC-FPC:TE_4-1734839-0_1x40-1MP_P0.5mm_Horizontal" H 2800 2000 50  0001 C CNN
F 3 "~" H 2800 2000 50  0001 C CNN
	1    2800 2000
	0    1    1    0   
$EndComp
Text GLabel 1800 1350 1    50   Input ~ 0
PCLK
Wire Wire Line
	1800 1350 1800 1500
Text GLabel 4600 1650 1    50   Input ~ 0
LCD_LED_A
Wire Wire Line
	4600 1650 4600 1800
$Comp
L Device:L_Small L1
U 1 1 5E759367
P 2900 2700
F 0 "L1" V 3085 2700 50  0000 C CNN
F 1 "6.8uH" V 2994 2700 50  0000 C CNN
F 2 "Inductor_SMD:L_0603_1608Metric_Pad1.05x0.95mm_HandSolder" H 2900 2700 50  0001 C CNN
F 3 "~" H 2900 2700 50  0001 C CNN
	1    2900 2700
	0    -1   -1   0   
$EndComp
$Comp
L Device:C_Small C11
U 1 1 5E77723C
P 2000 3350
F 0 "C11" H 2092 3396 50  0000 L CNN
F 1 "10uF" H 2092 3305 50  0000 L CNN
F 2 "Capacitor_SMD:C_0603_1608Metric_Pad1.05x0.95mm_HandSolder" H 2000 3350 50  0001 C CNN
F 3 "~" H 2000 3350 50  0001 C CNN
	1    2000 3350
	1    0    0    -1  
$EndComp
Wire Wire Line
	2000 3250 2300 3250
$Comp
L power:+5V #PWR020
U 1 1 5E779265
P 2000 2750
F 0 "#PWR020" H 2000 2600 50  0001 C CNN
F 1 "+5V" H 2015 2923 50  0000 C CNN
F 2 "" H 2000 2750 50  0001 C CNN
F 3 "" H 2000 2750 50  0001 C CNN
	1    2000 2750
	1    0    0    -1  
$EndComp
Wire Wire Line
	2000 3250 2000 2750
Connection ~ 2000 3250
$Comp
L power:GND #PWR019
U 1 1 5E77AD0A
P 1850 3600
F 0 "#PWR019" H 1850 3350 50  0001 C CNN
F 1 "GND" V 1855 3472 50  0000 R CNN
F 2 "" H 1850 3600 50  0001 C CNN
F 3 "" H 1850 3600 50  0001 C CNN
	1    1850 3600
	0    1    1    0   
$EndComp
Wire Wire Line
	2000 3450 2000 3600
Wire Wire Line
	2000 3600 1850 3600
Text GLabel 1400 1350 1    50   Input ~ 0
DE
Text GLabel 1600 1350 1    50   Input ~ 0
LCD_VSYNC
Text GLabel 1500 1350 1    50   Input ~ 0
LCD_HSYNC
Text GLabel 2500 950  1    50   Input ~ 0
DPI_B2
Text GLabel 2400 950  1    50   Input ~ 0
DPI_B3
Text GLabel 2300 950  1    50   Input ~ 0
DPI_B4
Text GLabel 2200 950  1    50   Input ~ 0
DPI_B5
Text GLabel 2100 950  1    50   Input ~ 0
DPI_B6
Text GLabel 2000 950  1    50   Input ~ 0
DPI_B7
Text GLabel 3300 950  1    50   Input ~ 0
DPI_G2
Text GLabel 3200 950  1    50   Input ~ 0
DPI_G3
Text GLabel 3100 950  1    50   Input ~ 0
DPI_G4
Text GLabel 3000 950  1    50   Input ~ 0
DPI_G5
Text GLabel 2900 950  1    50   Input ~ 0
DPI_G6
Text GLabel 2800 950  1    50   Input ~ 0
DPI_G7
Text GLabel 4100 950  1    50   Input ~ 0
DPI_R2
Text GLabel 4000 950  1    50   Input ~ 0
DPI_R3
Text GLabel 3900 950  1    50   Input ~ 0
DPI_R4
Text GLabel 3800 950  1    50   Input ~ 0
DPI_R5
Text GLabel 3700 950  1    50   Input ~ 0
DPI_R6
Text GLabel 3600 950  1    50   Input ~ 0
DPI_R7
Text GLabel 4700 1650 1    50   Input ~ 0
LCD_LED_K
Wire Wire Line
	3700 1800 3700 1600
Wire Wire Line
	4300 1800 4300 1600
Wire Wire Line
	4300 1600 3700 1600
Connection ~ 3700 1600
Wire Wire Line
	4200 1800 4200 1650
Wire Wire Line
	4200 1650 3600 1650
Connection ~ 3600 1650
Wire Wire Line
	3600 1650 3600 1800
Wire Wire Line
	2800 1800 2800 1650
Wire Wire Line
	2900 1800 2900 1600
Wire Wire Line
	3500 1800 3500 1600
Wire Wire Line
	3500 1600 2900 1600
Connection ~ 2900 1600
Wire Wire Line
	3400 1800 3400 1650
Wire Wire Line
	3400 1650 2800 1650
Connection ~ 2800 1650
Wire Wire Line
	2700 1800 2700 1600
Wire Wire Line
	2700 1600 2100 1600
Connection ~ 2100 1600
Wire Wire Line
	2100 1600 2100 1800
Wire Wire Line
	2600 1800 2600 1700
Wire Wire Line
	2600 1700 2000 1700
Connection ~ 2000 1700
Wire Wire Line
	2000 1700 2000 1800
$Comp
L power:+3V3 #PWR025
U 1 1 5E8F6E60
P 4400 1600
F 0 "#PWR025" H 4400 1450 50  0001 C CNN
F 1 "+3V3" H 4415 1773 50  0000 C CNN
F 2 "" H 4400 1600 50  0001 C CNN
F 3 "" H 4400 1600 50  0001 C CNN
	1    4400 1600
	1    0    0    -1  
$EndComp
Wire Wire Line
	4950 1750 4950 2000
$Comp
L power:GND #PWR026
U 1 1 5E8F3DA1
P 4950 2000
F 0 "#PWR026" H 4950 1750 50  0001 C CNN
F 1 "GND" H 4955 1827 50  0000 C CNN
F 2 "" H 4950 2000 50  0001 C CNN
F 3 "" H 4950 2000 50  0001 C CNN
	1    4950 2000
	1    0    0    -1  
$EndComp
$Comp
L Device:R_Small_US R19
U 1 1 5E907CD0
P 1800 1600
F 0 "R19" H 1850 1500 50  0000 L CNN
F 1 "33R" H 1850 1600 50  0000 L CNN
F 2 "Resistor_SMD:R_0603_1608Metric_Pad1.05x0.95mm_HandSolder" H 1800 1600 50  0001 C CNN
F 3 "~" H 1800 1600 50  0001 C CNN
	1    1800 1600
	1    0    0    -1  
$EndComp
Wire Wire Line
	4950 1750 4500 1750
Wire Wire Line
	4500 1750 4500 1800
Wire Wire Line
	1900 1750 1900 1800
Connection ~ 4500 1750
Wire Wire Line
	1900 1750 4500 1750
Wire Wire Line
	4400 1800 4400 1600
Wire Wire Line
	1800 1700 1800 1800
Wire Wire Line
	800  2700 800  2850
$Comp
L Device:R_Small_US R10
U 1 1 5E960D28
P 800 2950
F 0 "R10" H 800 2800 50  0000 L CNN
F 1 "20K" H 800 3050 50  0000 L CNN
F 2 "Resistor_SMD:R_0603_1608Metric_Pad1.05x0.95mm_HandSolder" H 800 2950 50  0001 C CNN
F 3 "~" H 800 2950 50  0001 C CNN
	1    800  2950
	1    0    0    -1  
$EndComp
Wire Wire Line
	800  3050 800  3150
Wire Wire Line
	1600 1350 1600 1500
$Comp
L Device:R_Small_US R16
U 1 1 5E9636D2
P 1600 1600
F 0 "R16" H 1600 1450 50  0000 L CNN
F 1 "33R" H 1500 1800 50  0000 L CNN
F 2 "Resistor_SMD:R_0603_1608Metric_Pad1.05x0.95mm_HandSolder" H 1600 1600 50  0001 C CNN
F 3 "~" H 1600 1600 50  0001 C CNN
	1    1600 1600
	1    0    0    -1  
$EndComp
Wire Wire Line
	1600 1700 1600 1800
$Comp
L Connector:TestPoint TP10
U 1 1 5E97F465
P 800 3150
F 0 "TP10" V 754 3338 50  0000 L CNN
F 1 "LCD_ONOFF" V 845 3338 50  0000 L CNN
F 2 "TestPoint:TestPoint_Pad_D1.0mm" H 1000 3150 50  0001 C CNN
F 3 "~" H 1000 3150 50  0001 C CNN
	1    800  3150
	0    1    1    0   
$EndComp
Text GLabel 1700 1650 1    50   Input ~ 0
LCD_ON-OFF
Wire Wire Line
	1700 1650 1700 1800
Text GLabel 800  3200 3    50   Input ~ 0
LCD_ON-OFF
Wire Wire Line
	800  3200 800  3150
Connection ~ 800  3150
$Comp
L power:+3V3 #PWR015
U 1 1 5E998B23
P 800 2700
F 0 "#PWR015" H 800 2550 50  0001 C CNN
F 1 "+3V3" H 815 2873 50  0000 C CNN
F 2 "" H 800 2700 50  0001 C CNN
F 3 "" H 800 2700 50  0001 C CNN
	1    800  2700
	1    0    0    -1  
$EndComp
Wire Wire Line
	1500 1350 1500 1500
$Comp
L Device:R_Small_US R15
U 1 1 5E99CF14
P 1500 1600
F 0 "R15" H 1500 1450 50  0000 L CNN
F 1 "33R" H 1400 1700 50  0000 L CNN
F 2 "Resistor_SMD:R_0603_1608Metric_Pad1.05x0.95mm_HandSolder" H 1500 1600 50  0001 C CNN
F 3 "~" H 1500 1600 50  0001 C CNN
	1    1500 1600
	1    0    0    -1  
$EndComp
Wire Wire Line
	1500 1700 1500 1800
NoConn ~ 1300 1800
Wire Wire Line
	1400 1350 1400 1500
$Comp
L Device:R_Small_US R14
U 1 1 5E9A990E
P 1400 1600
F 0 "R14" H 1400 1450 50  0000 L CNN
F 1 "33R" H 1300 1800 50  0000 L CNN
F 2 "Resistor_SMD:R_0603_1608Metric_Pad1.05x0.95mm_HandSolder" H 1400 1600 50  0001 C CNN
F 3 "~" H 1400 1600 50  0001 C CNN
	1    1400 1600
	1    0    0    -1  
$EndComp
Wire Wire Line
	1400 1700 1400 1800
Wire Wire Line
	1900 1750 1200 1750
Wire Wire Line
	1200 1750 1200 1800
Connection ~ 1900 1750
Text GLabel 1100 1350 1    50   Input ~ 0
TS_X+
Text GLabel 1000 1350 1    50   Input ~ 0
TS_Y+
Text GLabel 900  1350 1    50   Input ~ 0
TS_X-
Text GLabel 800  1350 1    50   Input ~ 0
TS_Y-
$Comp
L Device:Ferrite_Bead_Small FB1
U 1 1 5E9FA06E
P 800 1700
F 0 "FB1" H 750 1850 50  0000 L CNN
F 1 "Ferrite_Bead_Small" H 650 1350 50  0000 L CNN
F 2 "Capacitor_SMD:C_0603_1608Metric_Pad1.05x0.95mm_HandSolder" V 730 1700 50  0001 C CNN
F 3 "~" H 800 1700 50  0001 C CNN
	1    800  1700
	1    0    0    -1  
$EndComp
Wire Wire Line
	800  1600 800  1350
$Comp
L Device:Ferrite_Bead_Small FB2
U 1 1 5EA03061
P 900 1700
F 0 "FB2" H 850 1950 50  0000 L CNN
F 1 "Ferrite_Bead_Small" H 650 1300 50  0000 L CNN
F 2 "Capacitor_SMD:C_0603_1608Metric_Pad1.05x0.95mm_HandSolder" V 830 1700 50  0001 C CNN
F 3 "~" H 900 1700 50  0001 C CNN
	1    900  1700
	1    0    0    -1  
$EndComp
Wire Wire Line
	900  1600 900  1350
$Comp
L Device:Ferrite_Bead_Small FB3
U 1 1 5EA068CE
P 1000 1700
F 0 "FB3" H 950 1850 50  0000 L CNN
F 1 "Ferrite_Bead_Small" H 650 1250 50  0000 L CNN
F 2 "Capacitor_SMD:C_0603_1608Metric_Pad1.05x0.95mm_HandSolder" V 930 1700 50  0001 C CNN
F 3 "~" H 1000 1700 50  0001 C CNN
	1    1000 1700
	1    0    0    -1  
$EndComp
Wire Wire Line
	1000 1600 1000 1350
$Comp
L Device:Ferrite_Bead_Small FB4
U 1 1 5EA0A285
P 1100 1700
F 0 "FB4" H 1050 1950 50  0000 L CNN
F 1 "Ferrite_Bead_Small" H 650 1200 50  0000 L CNN
F 2 "Capacitor_SMD:C_0603_1608Metric_Pad1.05x0.95mm_HandSolder" V 1030 1700 50  0001 C CNN
F 3 "~" H 1100 1700 50  0001 C CNN
	1    1100 1700
	1    0    0    -1  
$EndComp
Wire Wire Line
	1100 1600 1100 1350
Wire Notes Line
	5100 550  5100 2350
Wire Notes Line
	5100 2350 550  2350
Wire Notes Line
	550  550  5100 550 
Wire Notes Line
	550  2350 550  550 
Wire Wire Line
	4700 1800 4700 1650
$Comp
L MainPCB:FAN5333 U11
U 1 1 5EA8F16F
P 2750 3700
F 0 "U11" H 2850 4415 50  0000 C CNN
F 1 "FAN5333" H 2850 4324 50  0000 C CNN
F 2 "Package_TO_SOT_SMD:SOT-23-5_HandSoldering" H 2750 3500 50  0001 C CNN
F 3 "https://www.mouser.com/datasheet/2/308/FAN5333B-1305334.pdf" H 2750 3500 50  0001 C CNN
	1    2750 3700
	1    0    0    -1  
$EndComp
Wire Wire Line
	2300 3250 2450 3250
Connection ~ 2300 3250
Wire Wire Line
	2300 2700 2800 2700
Wire Wire Line
	2300 2700 2300 3250
Wire Wire Line
	3000 2700 3500 2700
Wire Wire Line
	3500 2700 3500 3250
Wire Wire Line
	3500 3250 3250 3250
Text Notes 600  3900 0    50   ~ 0
LCD ON OFF
Wire Notes Line
	1500 3950 1500 2400
Wire Notes Line
	1500 2400 550  2400
Wire Notes Line
	550  2400 550  3950
Wire Notes Line
	550  3950 1500 3950
$Comp
L Device:R_Small_US R20
U 1 1 5EAC9CA9
P 2300 3650
F 0 "R20" H 2368 3696 50  0000 L CNN
F 1 "20K" H 2368 3605 50  0000 L CNN
F 2 "Resistor_SMD:R_0603_1608Metric_Pad1.05x0.95mm_HandSolder" H 2300 3650 50  0001 C CNN
F 3 "~" H 2300 3650 50  0001 C CNN
	1    2300 3650
	1    0    0    -1  
$EndComp
Wire Wire Line
	2300 3550 2300 3250
Wire Wire Line
	2300 3750 2300 4050
Wire Wire Line
	2300 4050 2450 4050
$Comp
L Diode:1N4148 D5
U 1 1 5EAD25A9
P 2300 4250
F 0 "D5" V 2346 4171 50  0000 R CNN
F 1 "1N4148" V 2255 4171 50  0000 R CNN
F 2 "Diode_THT:D_DO-35_SOD27_P7.62mm_Horizontal" H 2300 4075 50  0001 C CNN
F 3 "https://assets.nexperia.com/documents/data-sheet/1N4148_1N4448.pdf" H 2300 4250 50  0001 C CNN
	1    2300 4250
	0    -1   -1   0   
$EndComp
$Comp
L Connector:TestPoint TP15
U 1 1 5EAD3D54
P 2300 4500
F 0 "TP15" H 2242 4526 50  0000 R CNN
F 1 "TestPoint" H 2242 4617 50  0000 R CNN
F 2 "TestPoint:TestPoint_Pad_D1.0mm" H 2500 4500 50  0001 C CNN
F 3 "~" H 2500 4500 50  0001 C CNN
	1    2300 4500
	-1   0    0    1   
$EndComp
Wire Wire Line
	2300 4100 2300 4050
Connection ~ 2300 4050
Wire Wire Line
	2300 4400 2300 4500
$Comp
L power:GND #PWR022
U 1 1 5EADD014
P 3500 4200
F 0 "#PWR022" H 3500 3950 50  0001 C CNN
F 1 "GND" H 3505 4027 50  0000 C CNN
F 2 "" H 3500 4200 50  0001 C CNN
F 3 "" H 3500 4200 50  0001 C CNN
	1    3500 4200
	1    0    0    -1  
$EndComp
Wire Wire Line
	3250 4100 3500 4100
Wire Wire Line
	3500 4100 3500 4200
$Comp
L Device:R_Small_US R22
U 1 1 5EAE2BF3
P 3500 3900
F 0 "R22" H 3568 3946 50  0000 L CNN
F 1 "12R" H 3568 3855 50  0000 L CNN
F 2 "Resistor_SMD:R_0603_1608Metric_Pad1.05x0.95mm_HandSolder" H 3500 3900 50  0001 C CNN
F 3 "~" H 3500 3900 50  0001 C CNN
	1    3500 3900
	1    0    0    -1  
$EndComp
Wire Wire Line
	3250 3700 3500 3700
Wire Wire Line
	3500 3700 3500 3800
Wire Wire Line
	3500 4000 3500 4100
Connection ~ 3500 4100
$Comp
L Diode:MM3Zxx D7
U 1 1 5EAEDFAB
P 3500 3450
F 0 "D7" V 3454 3529 50  0000 L CNN
F 1 "MM3Zxx" V 3545 3529 50  0000 L CNN
F 2 "Diode_SMD:D_SOD-123F" H 3500 3275 50  0001 C CNN
F 3 "https://diotec.com/tl_files/diotec/files/pdf/datasheets/mm3z2v4.pdf" H 3500 3450 50  0001 C CNN
	1    3500 3450
	0    1    1    0   
$EndComp
Wire Wire Line
	3500 3600 3500 3700
Connection ~ 3500 3700
Wire Wire Line
	3500 3300 3500 3250
Connection ~ 3500 3250
$Comp
L Device:C_Small C12
U 1 1 5EAFA7D3
P 3950 3500
F 0 "C12" H 4042 3546 50  0000 L CNN
F 1 "1uF" H 4042 3455 50  0000 L CNN
F 2 "Capacitor_SMD:C_0603_1608Metric_Pad1.05x0.95mm_HandSolder" H 3950 3500 50  0001 C CNN
F 3 "~" H 3950 3500 50  0001 C CNN
	1    3950 3500
	1    0    0    -1  
$EndComp
$Comp
L Device:C_Small C13
U 1 1 5EAFACE7
P 4250 3500
F 0 "C13" H 4342 3546 50  0000 L CNN
F 1 "1uF" H 4342 3455 50  0000 L CNN
F 2 "Capacitor_SMD:C_0603_1608Metric_Pad1.05x0.95mm_HandSolder" H 4250 3500 50  0001 C CNN
F 3 "~" H 4250 3500 50  0001 C CNN
	1    4250 3500
	1    0    0    -1  
$EndComp
$Comp
L power:GND #PWR023
U 1 1 5EB0B3C3
P 3950 3700
F 0 "#PWR023" H 3950 3450 50  0001 C CNN
F 1 "GND" H 3955 3527 50  0000 C CNN
F 2 "" H 3950 3700 50  0001 C CNN
F 3 "" H 3950 3700 50  0001 C CNN
	1    3950 3700
	1    0    0    -1  
$EndComp
$Comp
L power:GND #PWR024
U 1 1 5EB0B84E
P 4250 3700
F 0 "#PWR024" H 4250 3450 50  0001 C CNN
F 1 "GND" H 4255 3527 50  0000 C CNN
F 2 "" H 4250 3700 50  0001 C CNN
F 3 "" H 4250 3700 50  0001 C CNN
	1    4250 3700
	1    0    0    -1  
$EndComp
Wire Wire Line
	3950 3700 3950 3600
Wire Wire Line
	4250 3700 4250 3600
Wire Wire Line
	3500 3250 3950 3250
Wire Wire Line
	4250 3250 4250 3400
Wire Wire Line
	3950 3400 3950 3250
Connection ~ 3950 3250
Wire Wire Line
	3950 3250 4250 3250
Text GLabel 3950 3000 1    50   Input ~ 0
LCD_LED_A
Wire Wire Line
	3950 3250 3950 3000
Wire Notes Line
	1550 4800 1550 2400
Wire Notes Line
	1550 2400 4550 2400
Wire Notes Line
	4550 2400 4550 4800
Wire Notes Line
	1550 4800 4550 4800
Text Notes 1600 4750 0    50   ~ 0
7 x 3.2v LED Boost
$Comp
L dk_Data-Acquisition-Touch-Screen-Controllers:AR1100-I_SS U10
U 1 1 5EB9763E
P 6150 3550
F 0 "U10" H 6150 4553 60  0000 C CNN
F 1 "AR1100-I_SS" H 6150 4447 60  0000 C CNN
F 2 "digikey-footprints:SSOP-20_W5.3mm" H 6350 3750 60  0001 L CNN
F 3 "http://ww1.microchip.com/downloads/en/DeviceDoc/41606B.pdf" H 6350 3850 60  0001 L CNN
F 4 "AR1100-I/SS-ND" H 6350 3950 60  0001 L CNN "Digi-Key_PN"
F 5 "AR1100-I/SS" H 6350 4050 60  0001 L CNN "MPN"
F 6 "Integrated Circuits (ICs)" H 6350 4150 60  0001 L CNN "Category"
F 7 "Data Acquisition - Touch Screen Controllers" H 6350 4250 60  0001 L CNN "Family"
F 8 "http://ww1.microchip.com/downloads/en/DeviceDoc/41606B.pdf" H 6350 4350 60  0001 L CNN "DK_Datasheet_Link"
F 9 "/product-detail/en/microchip-technology/AR1100-I-SS/AR1100-I-SS-ND/2749253" H 6350 4450 60  0001 L CNN "DK_Detail_Page"
F 10 "IC SCREEN CNTRL 12BIT 20SSOP" H 6350 4550 60  0001 L CNN "Description"
F 11 "Microchip Technology" H 6350 4650 60  0001 L CNN "Manufacturer"
F 12 "Active" H 6350 4750 60  0001 L CNN "Status"
	1    6150 3550
	1    0    0    -1  
$EndComp
Text GLabel 5350 4150 0    50   Input ~ 0
USB5_DP
Text GLabel 5350 4050 0    50   Input ~ 0
USB5_DN
Wire Wire Line
	5550 4050 5350 4050
Wire Wire Line
	5350 4150 5550 4150
NoConn ~ 6750 4150
NoConn ~ 5550 3850
$Comp
L Device:Jumper_NO_Small JP8
U 1 1 5EBD926C
P 5350 4250
F 0 "JP8" H 5150 4350 50  0000 C CNN
F 1 "TS_MODE" H 5400 4350 50  0000 C CNN
F 2 "Jumper:SolderJumper-2_P1.3mm_Open_RoundedPad1.0x1.5mm" H 5350 4250 50  0001 C CNN
F 3 "~" H 5350 4250 50  0001 C CNN
	1    5350 4250
	-1   0    0    1   
$EndComp
$Comp
L power:GND #PWR016
U 1 1 5EBDA182
P 5100 4400
F 0 "#PWR016" H 5100 4150 50  0001 C CNN
F 1 "GND" H 5105 4227 50  0000 C CNN
F 2 "" H 5100 4400 50  0001 C CNN
F 3 "" H 5100 4400 50  0001 C CNN
	1    5100 4400
	1    0    0    -1  
$EndComp
Wire Wire Line
	5100 4400 5100 4250
Wire Wire Line
	5100 4250 5250 4250
Wire Wire Line
	5450 4250 5550 4250
$Comp
L Device:R_Small_US R21
U 1 1 5EBE7772
P 7000 4150
F 0 "R21" H 7068 4196 50  0000 L CNN
F 1 "R_Small_US" H 7068 4105 50  0000 L CNN
F 2 "Resistor_SMD:R_0603_1608Metric_Pad1.05x0.95mm_HandSolder" H 7000 4150 50  0001 C CNN
F 3 "~" H 7000 4150 50  0001 C CNN
	1    7000 4150
	1    0    0    -1  
$EndComp
$Comp
L Device:LED_Small D6
U 1 1 5EBE9881
P 7000 4400
F 0 "D6" V 7046 4332 50  0000 R CNN
F 1 "LED_Small" V 6955 4332 50  0000 R CNN
F 2 "LED_SMD:LED_0603_1608Metric_Pad1.05x0.95mm_HandSolder" V 7000 4400 50  0001 C CNN
F 3 "~" V 7000 4400 50  0001 C CNN
	1    7000 4400
	0    -1   -1   0   
$EndComp
Wire Wire Line
	7000 4300 7000 4250
Wire Wire Line
	6750 4050 7000 4050
$Comp
L power:GND #PWR021
U 1 1 5EBF47AB
P 7000 4600
F 0 "#PWR021" H 7000 4350 50  0001 C CNN
F 1 "GND" H 7005 4427 50  0000 C CNN
F 2 "" H 7000 4600 50  0001 C CNN
F 3 "" H 7000 4600 50  0001 C CNN
	1    7000 4600
	1    0    0    -1  
$EndComp
Wire Wire Line
	7000 4600 7000 4500
$Comp
L SparkFun-Clocks:CRYSTAL-12MHZ" Y2
U 1 1 5EBFEC88
P 7050 3200
F 0 "Y2" H 7050 3530 45  0000 C CNN
F 1 "CRYSTAL-12MHZ\"" H 7050 3446 45  0000 C CNN
F 2 "Connector_PinHeader_2.54mm:PinHeader_1x03_P2.54mm_Vertical" H 7080 3350 20  0001 C CNN
F 3 "" H 7050 3200 50  0001 C CNN
F 4 "XTAL-13518" H 7050 3351 60  0000 C CNN "Field4"
	1    7050 3200
	0    1    1    0   
$EndComp
Wire Wire Line
	6750 3150 6800 3150
Wire Wire Line
	6800 3150 6800 3100
Wire Wire Line
	6800 3100 7050 3100
Wire Wire Line
	7050 3300 6850 3300
Wire Wire Line
	6850 3300 6850 3250
Wire Wire Line
	6850 3250 6750 3250
Text GLabel 5400 3150 0    50   Input ~ 0
TS_X+
Text GLabel 5400 2950 0    50   Input ~ 0
TS_Y+
Text GLabel 5400 3250 0    50   Input ~ 0
TS_X-
Text GLabel 5400 3050 0    50   Input ~ 0
TS_Y-
Wire Wire Line
	5550 2950 5400 2950
Wire Wire Line
	5400 3050 5550 3050
Wire Wire Line
	5400 3150 5550 3150
Wire Wire Line
	5400 3250 5550 3250
$Comp
L power:+5V #PWR017
U 1 1 5EC5EA7E
P 5300 3950
F 0 "#PWR017" H 5300 3800 50  0001 C CNN
F 1 "+5V" V 5315 4078 50  0000 L CNN
F 2 "" H 5300 3950 50  0001 C CNN
F 3 "" H 5300 3950 50  0001 C CNN
	1    5300 3950
	0    -1   -1   0   
$EndComp
Wire Wire Line
	5550 3950 5300 3950
$Comp
L power:GND #PWR018
U 1 1 5EC659DC
P 5400 4500
F 0 "#PWR018" H 5400 4250 50  0001 C CNN
F 1 "GND" H 5405 4327 50  0000 C CNN
F 2 "" H 5400 4500 50  0001 C CNN
F 3 "" H 5400 4500 50  0001 C CNN
	1    5400 4500
	1    0    0    -1  
$EndComp
Wire Wire Line
	5550 3350 5400 3350
Wire Wire Line
	5400 3350 5400 3450
Wire Wire Line
	5550 3450 5400 3450
Connection ~ 5400 3450
Wire Wire Line
	5400 3450 5400 3550
Wire Wire Line
	5550 3550 5400 3550
Connection ~ 5400 3550
Wire Wire Line
	5400 3550 5400 3650
Wire Wire Line
	5550 3650 5400 3650
Connection ~ 5400 3650
Wire Wire Line
	5400 3650 5400 4500
Text GLabel 4950 3750 0    50   Input ~ 0
TS_X-
$Comp
L Device:R_Small_US R11
U 1 1 5EC7F073
P 5150 3750
F 0 "R11" V 4945 3750 50  0000 C CNN
F 1 "20K" V 5036 3750 50  0000 C CNN
F 2 "Resistor_SMD:R_0603_1608Metric_Pad1.05x0.95mm_HandSolder" H 5150 3750 50  0001 C CNN
F 3 "~" H 5150 3750 50  0001 C CNN
	1    5150 3750
	0    1    1    0   
$EndComp
Wire Wire Line
	5550 3750 5250 3750
Wire Wire Line
	5050 3750 4950 3750
Wire Notes Line
	4600 5000 7700 5000
Wire Notes Line
	7700 5000 7700 2400
Wire Notes Line
	7700 2400 4600 2400
Wire Notes Line
	4600 2400 4600 5000
Text Notes 4650 4950 0    50   ~ 0
Four Wire USB Touch Screen Controller
$Comp
L Device:R_Small_US R40
U 1 1 5E5CD7AE
P 4100 1300
F 0 "R40" H 4100 1500 50  0000 L CNN
F 1 "33R" V 4150 1050 50  0000 L CNN
F 2 "Resistor_SMD:R_0603_1608Metric_Pad1.05x0.95mm_HandSolder" H 4100 1300 50  0001 C CNN
F 3 "~" H 4100 1300 50  0001 C CNN
	1    4100 1300
	1    0    0    -1  
$EndComp
$Comp
L Device:R_Small_US R39
U 1 1 5E5CE807
P 4000 1300
F 0 "R39" H 4000 1400 50  0000 L CNN
F 1 "33R" V 4050 1050 50  0000 L CNN
F 2 "Resistor_SMD:R_0603_1608Metric_Pad1.05x0.95mm_HandSolder" H 4000 1300 50  0001 C CNN
F 3 "~" H 4000 1300 50  0001 C CNN
	1    4000 1300
	1    0    0    -1  
$EndComp
$Comp
L Device:R_Small_US R38
U 1 1 5E5CF132
P 3900 1300
F 0 "R38" H 3900 1500 50  0000 L CNN
F 1 "33R" V 3950 1050 50  0000 L CNN
F 2 "Resistor_SMD:R_0603_1608Metric_Pad1.05x0.95mm_HandSolder" H 3900 1300 50  0001 C CNN
F 3 "~" H 3900 1300 50  0001 C CNN
	1    3900 1300
	1    0    0    -1  
$EndComp
$Comp
L Device:R_Small_US R37
U 1 1 5E5D875B
P 3800 1300
F 0 "R37" H 3800 1400 50  0000 L CNN
F 1 "33R" V 3850 1050 50  0000 L CNN
F 2 "Resistor_SMD:R_0603_1608Metric_Pad1.05x0.95mm_HandSolder" H 3800 1300 50  0001 C CNN
F 3 "~" H 3800 1300 50  0001 C CNN
	1    3800 1300
	1    0    0    -1  
$EndComp
$Comp
L Device:R_Small_US R36
U 1 1 5E5D9351
P 3700 1300
F 0 "R36" H 3700 1500 50  0000 L CNN
F 1 "33R" V 3750 1050 50  0000 L CNN
F 2 "Resistor_SMD:R_0603_1608Metric_Pad1.05x0.95mm_HandSolder" H 3700 1300 50  0001 C CNN
F 3 "~" H 3700 1300 50  0001 C CNN
	1    3700 1300
	1    0    0    -1  
$EndComp
$Comp
L Device:R_Small_US R34
U 1 1 5E5E2CCA
P 3300 1300
F 0 "R34" H 3300 1500 50  0000 L CNN
F 1 "33R" V 3350 1050 50  0000 L CNN
F 2 "Resistor_SMD:R_0603_1608Metric_Pad1.05x0.95mm_HandSolder" H 3300 1300 50  0001 C CNN
F 3 "~" H 3300 1300 50  0001 C CNN
	1    3300 1300
	1    0    0    -1  
$EndComp
$Comp
L Device:R_Small_US R33
U 1 1 5E5E35BA
P 3200 1300
F 0 "R33" H 3200 1400 50  0000 L CNN
F 1 "33R" V 3250 1050 50  0000 L CNN
F 2 "Resistor_SMD:R_0603_1608Metric_Pad1.05x0.95mm_HandSolder" H 3200 1300 50  0001 C CNN
F 3 "~" H 3200 1300 50  0001 C CNN
	1    3200 1300
	1    0    0    -1  
$EndComp
$Comp
L Device:R_Small_US R32
U 1 1 5E5E4253
P 3100 1300
F 0 "R32" H 3100 1500 50  0000 L CNN
F 1 "33R" V 3150 1050 50  0000 L CNN
F 2 "Resistor_SMD:R_0603_1608Metric_Pad1.05x0.95mm_HandSolder" H 3100 1300 50  0001 C CNN
F 3 "~" H 3100 1300 50  0001 C CNN
	1    3100 1300
	1    0    0    -1  
$EndComp
$Comp
L Device:R_Small_US R30
U 1 1 5E5E555B
P 2900 1300
F 0 "R30" H 2900 1500 50  0000 L CNN
F 1 "33R" V 2950 1050 50  0000 L CNN
F 2 "Resistor_SMD:R_0603_1608Metric_Pad1.05x0.95mm_HandSolder" H 2900 1300 50  0001 C CNN
F 3 "~" H 2900 1300 50  0001 C CNN
	1    2900 1300
	1    0    0    -1  
$EndComp
$Comp
L Device:R_Small_US R29
U 1 1 5E5E5EF1
P 2800 1300
F 0 "R29" H 2800 1400 50  0000 L CNN
F 1 "33R" V 2850 1050 50  0000 L CNN
F 2 "Resistor_SMD:R_0603_1608Metric_Pad1.05x0.95mm_HandSolder" H 2800 1300 50  0001 C CNN
F 3 "~" H 2800 1300 50  0001 C CNN
	1    2800 1300
	1    0    0    -1  
$EndComp
$Comp
L Device:R_Small_US R28
U 1 1 5E5E689E
P 2500 1300
F 0 "R28" H 2500 1500 50  0000 L CNN
F 1 "33R" V 2550 1050 50  0000 L CNN
F 2 "Resistor_SMD:R_0603_1608Metric_Pad1.05x0.95mm_HandSolder" H 2500 1300 50  0001 C CNN
F 3 "~" H 2500 1300 50  0001 C CNN
	1    2500 1300
	1    0    0    -1  
$EndComp
$Comp
L Device:R_Small_US R27
U 1 1 5E5E746D
P 2400 1300
F 0 "R27" H 2400 1400 50  0000 L CNN
F 1 "33R" V 2450 1050 50  0000 L CNN
F 2 "Resistor_SMD:R_0603_1608Metric_Pad1.05x0.95mm_HandSolder" H 2400 1300 50  0001 C CNN
F 3 "~" H 2400 1300 50  0001 C CNN
	1    2400 1300
	1    0    0    -1  
$EndComp
$Comp
L Device:R_Small_US R26
U 1 1 5E5E7E31
P 2300 1300
F 0 "R26" H 2300 1500 50  0000 L CNN
F 1 "33R" V 2350 1050 50  0000 L CNN
F 2 "Resistor_SMD:R_0603_1608Metric_Pad1.05x0.95mm_HandSolder" H 2300 1300 50  0001 C CNN
F 3 "~" H 2300 1300 50  0001 C CNN
	1    2300 1300
	1    0    0    -1  
$EndComp
$Comp
L Device:R_Small_US R25
U 1 1 5E5E898F
P 2200 1300
F 0 "R25" H 2200 1400 50  0000 L CNN
F 1 "33R" V 2250 1050 50  0000 L CNN
F 2 "Resistor_SMD:R_0603_1608Metric_Pad1.05x0.95mm_HandSolder" H 2200 1300 50  0001 C CNN
F 3 "~" H 2200 1300 50  0001 C CNN
	1    2200 1300
	1    0    0    -1  
$EndComp
$Comp
L Device:R_Small_US R24
U 1 1 5E5E939E
P 2100 1300
F 0 "R24" H 2100 1500 50  0000 L CNN
F 1 "33R" V 2150 1050 50  0000 L CNN
F 2 "Resistor_SMD:R_0603_1608Metric_Pad1.05x0.95mm_HandSolder" H 2100 1300 50  0001 C CNN
F 3 "~" H 2100 1300 50  0001 C CNN
	1    2100 1300
	1    0    0    -1  
$EndComp
$Comp
L Device:R_Small_US R23
U 1 1 5E5E9D9F
P 2000 1300
F 0 "R23" H 2000 1400 50  0000 L CNN
F 1 "33R" V 2050 1050 50  0000 L CNN
F 2 "Resistor_SMD:R_0603_1608Metric_Pad1.05x0.95mm_HandSolder" H 2000 1300 50  0001 C CNN
F 3 "~" H 2000 1300 50  0001 C CNN
	1    2000 1300
	1    0    0    -1  
$EndComp
Wire Wire Line
	2000 1400 2000 1700
Wire Wire Line
	2100 1400 2100 1600
Wire Wire Line
	2200 1400 2200 1800
Wire Wire Line
	2300 1400 2300 1800
Wire Wire Line
	2400 1400 2400 1800
Wire Wire Line
	2500 1400 2500 1800
Wire Wire Line
	2000 950  2000 1200
Wire Wire Line
	2100 950  2100 1200
Wire Wire Line
	2200 950  2200 1200
Wire Wire Line
	2300 950  2300 1200
Wire Wire Line
	2400 950  2400 1200
Wire Wire Line
	2500 950  2500 1200
Wire Wire Line
	2800 1400 2800 1650
Wire Wire Line
	2800 950  2800 1200
Wire Wire Line
	2900 950  2900 1200
Wire Wire Line
	2900 1400 2900 1600
Wire Wire Line
	3000 1400 3000 1800
Wire Wire Line
	3000 950  3000 1200
Wire Wire Line
	3100 1400 3100 1800
Wire Wire Line
	3100 950  3100 1200
Wire Wire Line
	3200 1400 3200 1800
Wire Wire Line
	3300 1400 3300 1800
Wire Wire Line
	3300 950  3300 1200
Wire Wire Line
	3200 950  3200 1200
$Comp
L Device:R_Small_US R35
U 1 1 5E5E2389
P 3600 1300
F 0 "R35" H 3600 1400 50  0000 L CNN
F 1 "33R" V 3650 1050 50  0000 L CNN
F 2 "Resistor_SMD:R_0603_1608Metric_Pad1.05x0.95mm_HandSolder" H 3600 1300 50  0001 C CNN
F 3 "~" H 3600 1300 50  0001 C CNN
	1    3600 1300
	1    0    0    -1  
$EndComp
Wire Wire Line
	4100 1400 4100 1800
Wire Wire Line
	4000 1400 4000 1800
Wire Wire Line
	3900 1400 3900 1800
Wire Wire Line
	3800 1400 3800 1800
Wire Wire Line
	3700 1400 3700 1600
Wire Wire Line
	3600 1400 3600 1650
Wire Wire Line
	3600 950  3600 1200
Wire Wire Line
	3700 950  3700 1200
Wire Wire Line
	3800 950  3800 1200
Wire Wire Line
	3900 950  3900 1200
Wire Wire Line
	4000 950  4000 1200
Wire Wire Line
	4100 950  4100 1200
$Comp
L Device:R_Small_US R31
U 1 1 5E5E4BA0
P 3000 1300
F 0 "R31" H 3000 1400 50  0000 L CNN
F 1 "33R" V 3050 1050 50  0000 L CNN
F 2 "Resistor_SMD:R_0603_1608Metric_Pad1.05x0.95mm_HandSolder" H 3000 1300 50  0001 C CNN
F 3 "~" H 3000 1300 50  0001 C CNN
	1    3000 1300
	1    0    0    -1  
$EndComp
$Comp
L power:+5V #PWR0104
U 1 1 5E6006EE
P 6150 2750
F 0 "#PWR0104" H 6150 2600 50  0001 C CNN
F 1 "+5V" H 6165 2923 50  0000 C CNN
F 2 "" H 6150 2750 50  0001 C CNN
F 3 "" H 6150 2750 50  0001 C CNN
	1    6150 2750
	1    0    0    -1  
$EndComp
$Comp
L power:GND #PWR0123
U 1 1 5E601EF8
P 6150 4550
F 0 "#PWR0123" H 6150 4300 50  0001 C CNN
F 1 "GND" H 6155 4377 50  0000 C CNN
F 2 "" H 6150 4550 50  0001 C CNN
F 3 "" H 6150 4550 50  0001 C CNN
	1    6150 4550
	1    0    0    -1  
$EndComp
Text GLabel 1050 4100 0    50   Input ~ 0
LCD_LED_K
$Comp
L power:GND #PWR027
U 1 1 5E61D22C
P 1050 4400
F 0 "#PWR027" H 1050 4150 50  0001 C CNN
F 1 "GND" H 1055 4227 50  0000 C CNN
F 2 "" H 1050 4400 50  0001 C CNN
F 3 "" H 1050 4400 50  0001 C CNN
	1    1050 4400
	1    0    0    -1  
$EndComp
Wire Notes Line
	550  4000 1500 4000
Wire Notes Line
	1500 4000 1500 4800
Wire Notes Line
	1500 4800 550  4800
Wire Notes Line
	550  4800 550  4000
$Comp
L Jumper:SolderJumper_2_Bridged JP9
U 1 1 5E644B8A
P 1050 4250
F 0 "JP9" V 1004 4318 50  0000 L CNN
F 1 "LED_KATHODE" V 1450 4000 50  0000 L CNN
F 2 "Jumper:SolderJumper-2_P1.3mm_Bridged_RoundedPad1.0x1.5mm" H 1050 4250 50  0001 C CNN
F 3 "~" H 1050 4250 50  0001 C CNN
	1    1050 4250
	0    1    1    0   
$EndComp
Text Notes 600  4750 0    50   ~ 0
LED Kathode
$EndSCHEMATC
