EESchema Schematic File Version 4
EELAYER 30 0
EELAYER END
$Descr A4 11693 8268
encoding utf-8
Sheet 8 8
Title ""
Date ""
Rev ""
Comp ""
Comment1 ""
Comment2 ""
Comment3 ""
Comment4 ""
$EndDescr
Text GLabel 1100 4500 0    50   BiDi ~ 0
USB1_DP
Wire Wire Line
	1100 4400 1500 4400
Wire Wire Line
	1100 4500 1500 4500
NoConn ~ 2350 4700
NoConn ~ 2950 4500
NoConn ~ 2950 4400
NoConn ~ 2950 4300
NoConn ~ 2950 4000
NoConn ~ 2950 3900
NoConn ~ 2950 3800
NoConn ~ 2950 3700
NoConn ~ 2950 3400
NoConn ~ 2950 3300
NoConn ~ 2950 3200
NoConn ~ 2950 3100
NoConn ~ 2950 2800
NoConn ~ 2950 2700
NoConn ~ 2950 2600
NoConn ~ 2950 2500
$Comp
L power:GND #PWR0160
U 1 1 5E690CA8
P 1950 4850
F 0 "#PWR0160" H 1950 4600 50  0001 C CNN
F 1 "GND" H 1955 4677 50  0000 C CNN
F 2 "" H 1950 4850 50  0001 C CNN
F 3 "" H 1950 4850 50  0001 C CNN
	1    1950 4850
	1    0    0    -1  
$EndComp
Wire Wire Line
	1850 4700 1850 4800
Wire Wire Line
	1850 4800 1950 4800
Wire Wire Line
	1950 4800 1950 4850
Wire Wire Line
	1950 4700 1950 4800
Connection ~ 1950 4800
Wire Wire Line
	2050 4700 2050 4800
Wire Wire Line
	2050 4800 1950 4800
Wire Wire Line
	2150 4700 2150 4800
Wire Wire Line
	2150 4800 2050 4800
Connection ~ 2050 4800
Text GLabel 3200 3000 2    50   Input ~ 0
USB3_DP
Text GLabel 3200 2900 2    50   Input ~ 0
USB3_DN
Wire Wire Line
	3200 2300 2950 2300
Wire Wire Line
	3200 2400 2950 2400
Text GLabel 3200 3600 2    50   Input ~ 0
USB4_DP
Text GLabel 3200 3500 2    50   Input ~ 0
USB4_DN
Wire Wire Line
	3200 2900 2950 2900
Wire Wire Line
	3200 3000 2950 3000
$Comp
L power:+5V #PWR0161
U 1 1 5E699152
P 1700 1950
F 0 "#PWR0161" H 1700 1800 50  0001 C CNN
F 1 "+5V" H 1715 2123 50  0000 C CNN
F 2 "" H 1700 1950 50  0001 C CNN
F 3 "" H 1700 1950 50  0001 C CNN
	1    1700 1950
	1    0    0    -1  
$EndComp
Wire Wire Line
	1750 2100 1750 2050
Wire Wire Line
	1750 2050 1700 2050
Wire Wire Line
	1700 2050 1700 1950
Wire Wire Line
	1650 2100 1650 2050
Wire Wire Line
	1650 2050 1700 2050
Connection ~ 1700 2050
NoConn ~ 1850 2100
NoConn ~ 1950 2100
NoConn ~ 2050 2100
NoConn ~ 2150 2100
NoConn ~ 2250 2100
NoConn ~ 2350 2100
NoConn ~ 2450 2100
NoConn ~ 2700 2200
$Comp
L Connector:TestPoint TP12
U 1 1 5E179288
P 3200 900
F 0 "TP12" H 3258 1018 50  0000 L CNN
F 1 "USB_D+" H 3258 927 50  0000 L CNN
F 2 "TestPoint:TestPoint_Pad_D1.0mm" H 3400 900 50  0001 C CNN
F 3 "~" H 3400 900 50  0001 C CNN
	1    3200 900 
	1    0    0    -1  
$EndComp
$Comp
L Connector:TestPoint TP11
U 1 1 5E179AF1
P 2750 900
F 0 "TP11" H 2808 1018 50  0000 L CNN
F 1 "USB_D-" H 2808 927 50  0000 L CNN
F 2 "TestPoint:TestPoint_Pad_D1.0mm" H 2950 900 50  0001 C CNN
F 3 "~" H 2950 900 50  0001 C CNN
	1    2750 900 
	1    0    0    -1  
$EndComp
Text GLabel 3200 900  3    50   Input ~ 0
USB1_DP
Text GLabel 2750 900  3    50   Input ~ 0
USB1_DN
$Comp
L SparkFun-Clocks:CRYSTAL-12MHZ" Y1
U 1 1 5E1AEF97
P 1250 2600
F 0 "Y1" H 1250 2930 45  0000 C CNN
F 1 "CRYSTAL-12MHZ\"" H 1250 2846 45  0000 C CNN
F 2 "Connector_PinHeader_2.54mm:PinHeader_1x03_P2.54mm_Vertical" H 1280 2750 20  0001 C CNN
F 3 "" H 1250 2600 50  0001 C CNN
F 4 "XTAL-13518" H 1250 2751 60  0000 C CNN "Field4"
	1    1250 2600
	1    0    0    -1  
$EndComp
Wire Wire Line
	1500 2600 1350 2600
Wire Wire Line
	1150 2600 1050 2600
Wire Wire Line
	1050 2600 1050 2700
Wire Wire Line
	1050 2700 1500 2700
Text GLabel 1350 2800 0    50   Input ~ 0
HUB_RST
Wire Wire Line
	1500 2800 1350 2800
Text GLabel 1050 1250 0    50   Input ~ 0
HUB_RST
$Comp
L power:+5V #PWR0162
U 1 1 5E1B8682
P 1250 850
F 0 "#PWR0162" H 1250 700 50  0001 C CNN
F 1 "+5V" H 1265 1023 50  0000 C CNN
F 2 "" H 1250 850 50  0001 C CNN
F 3 "" H 1250 850 50  0001 C CNN
	1    1250 850 
	1    0    0    -1  
$EndComp
$Comp
L Device:R_Small_US R12
U 1 1 5E1B9654
P 1250 950
F 0 "R12" H 1318 996 50  0000 L CNN
F 1 "10K" H 1318 905 50  0000 L CNN
F 2 "Resistor_SMD:R_0603_1608Metric_Pad1.05x0.95mm_HandSolder" H 1250 950 50  0001 C CNN
F 3 "~" H 1250 950 50  0001 C CNN
	1    1250 950 
	1    0    0    -1  
$EndComp
Wire Wire Line
	1050 1250 1250 1250
Wire Wire Line
	1250 1250 1250 1050
$Comp
L Connector:TestPoint TP9
U 1 1 5E1BC6F1
P 1250 1250
F 0 "TP9" V 1204 1438 50  0000 L CNN
F 1 "HUB_RST" V 1295 1438 50  0000 L CNN
F 2 "TestPoint:TestPoint_Pad_D1.0mm" H 1450 1250 50  0001 C CNN
F 3 "~" H 1450 1250 50  0001 C CNN
	1    1250 1250
	0    1    1    0   
$EndComp
Connection ~ 1250 1250
Wire Notes Line
	1900 1650 1900 500 
Wire Notes Line
	1900 500  550  500 
Wire Notes Line
	550  500  550  1650
Wire Notes Line
	550  1650 1900 1650
Text Notes 600  1600 0    50   ~ 0
HUB Reset
Wire Notes Line
	3700 1650 3700 500 
Wire Notes Line
	3700 500  2350 500 
Wire Notes Line
	2350 500  2350 1650
Wire Notes Line
	2350 1650 3700 1650
Text Notes 2400 1600 0    50   ~ 0
USB Hub Input Test Points
$Comp
L power:GND #PWR0163
U 1 1 5E1CDD91
P 1250 6350
F 0 "#PWR0163" H 1250 6100 50  0001 C CNN
F 1 "GND" H 1255 6177 50  0000 C CNN
F 2 "" H 1250 6350 50  0001 C CNN
F 3 "" H 1250 6350 50  0001 C CNN
	1    1250 6350
	1    0    0    -1  
$EndComp
Wire Wire Line
	1250 6050 1250 5950
Wire Wire Line
	1250 5950 1350 5950
$Comp
L Device:R_Small_US R13
U 1 1 5E1CF949
P 1400 3100
F 0 "R13" V 1300 3100 50  0000 C CNN
F 1 "649R" V 1350 2900 50  0000 C CNN
F 2 "Resistor_SMD:R_0603_1608Metric_Pad1.05x0.95mm_HandSolder" H 1400 3100 50  0001 C CNN
F 3 "~" H 1400 3100 50  0001 C CNN
	1    1400 3100
	0    1    1    0   
$EndComp
$Comp
L power:GND #PWR0164
U 1 1 5E1D1972
P 1000 3100
F 0 "#PWR0164" H 1000 2850 50  0001 C CNN
F 1 "GND" V 1005 2972 50  0000 R CNN
F 2 "" H 1000 3100 50  0001 C CNN
F 3 "" H 1000 3100 50  0001 C CNN
	1    1000 3100
	0    1    1    0   
$EndComp
Wire Wire Line
	1300 3100 1050 3100
NoConn ~ 1500 3000
Wire Wire Line
	1500 2900 1050 2900
Wire Wire Line
	1050 2900 1050 3100
Connection ~ 1050 3100
Wire Wire Line
	1050 3100 1000 3100
Wire Notes Line
	550  5400 3700 5400
Wire Notes Line
	3700 5400 3700 1700
Wire Notes Line
	3700 1700 550  1700
Wire Notes Line
	550  1700 550  5400
Text Notes 600  5350 0    50   ~ 0
USB Hub
$Comp
L MainPCB:CY7C65642 U7
U 1 1 5E4BAB2C
P 2200 3100
F 0 "U7" H 2225 1411 50  0000 C CNN
F 1 "CY7C65642" H 2225 1320 50  0000 C CNN
F 2 "Package_QFP:TQFP-48_7x7mm_P0.5mm" V 2550 1750 50  0001 C CNN
F 3 "https://www.mouser.com/datasheet/2/100/001-65659_CY7C65642_HX2VL_-_VERY_LOW-POWER_USB_2.0-369315.pdf" V 2550 1750 50  0001 C CNN
	1    2200 3100
	1    0    0    -1  
$EndComp
Text GLabel 1500 3200 0    50   Input ~ 0
HubTest
Text GLabel 1350 5950 2    50   Input ~ 0
HubTest
$Comp
L power:+5V #PWR0165
U 1 1 5E4CDBF1
P 2750 5750
F 0 "#PWR0165" H 2750 5600 50  0001 C CNN
F 1 "+5V" V 2765 5878 50  0000 L CNN
F 2 "" H 2750 5750 50  0001 C CNN
F 3 "" H 2750 5750 50  0001 C CNN
	1    2750 5750
	1    0    0    -1  
$EndComp
Wire Wire Line
	2800 5750 2750 5750
Wire Wire Line
	2700 5750 2750 5750
Connection ~ 2750 5750
Text Notes 2900 6400 0    50   ~ 0
Use 12MHz Crystal
Text GLabel 1250 3300 0    50   Input ~ 0
HUB_SEL27
Text GLabel 1250 3400 0    50   Input ~ 0
HUB_SEL48
Wire Wire Line
	1500 3300 1250 3300
Wire Wire Line
	1250 3400 1500 3400
Text GLabel 2700 6200 3    50   Input ~ 0
HUB_SEL27
Text GLabel 2800 6200 3    50   Input ~ 0
HUB_SEL48
$Comp
L Connector:TestPoint TP14
U 1 1 5E4E6B9B
P 2950 6100
F 0 "TP14" V 2904 6288 50  0000 L CNN
F 1 "HUB_SEL48" V 2995 6288 50  0000 L CNN
F 2 "TestPoint:TestPoint_Pad_D1.0mm" H 3150 6100 50  0001 C CNN
F 3 "~" H 3150 6100 50  0001 C CNN
	1    2950 6100
	0    1    1    0   
$EndComp
$Comp
L Connector:TestPoint TP13
U 1 1 5E4E7C9F
P 2550 6100
F 0 "TP13" V 2600 6100 50  0000 C CNN
F 1 "HUB_SEL27" V 2450 6200 50  0000 C CNN
F 2 "TestPoint:TestPoint_Pad_D1.0mm" H 2750 6100 50  0001 C CNN
F 3 "~" H 2750 6100 50  0001 C CNN
	1    2550 6100
	0    -1   -1   0   
$EndComp
Wire Wire Line
	2950 6100 2800 6100
Wire Wire Line
	2800 6100 2800 6200
Wire Wire Line
	2550 6100 2700 6100
Wire Wire Line
	2700 6100 2700 6200
Wire Notes Line
	1950 6850 1950 5450
Wire Notes Line
	1950 5450 3700 5450
Wire Notes Line
	3700 5450 3700 6850
Wire Notes Line
	3700 6850 1950 6850
Wire Notes Line
	550  5450 1900 5450
Wire Notes Line
	1900 5450 1900 6850
Wire Notes Line
	1900 6850 550  6850
Wire Notes Line
	550  6850 550  5450
Text Notes 600  6800 0    50   ~ 0
HUB Test Mode Enable
Text Notes 2000 6800 0    50   ~ 0
Hub Clock Settings
$Comp
L Jumper:SolderJumper_2_Bridged JP7
U 1 1 5E20B40F
P 1250 6200
F 0 "JP7" V 1204 6268 50  0000 L CNN
F 1 "HubTest" V 1295 6268 50  0000 L CNN
F 2 "Jumper:SolderJumper-2_P1.3mm_Bridged_RoundedPad1.0x1.5mm" H 1250 6200 50  0001 C CNN
F 3 "~" H 1250 6200 50  0001 C CNN
	1    1250 6200
	0    1    1    0   
$EndComp
$Comp
L Device:R_Small_US R18
U 1 1 5E1C1CCD
P 2800 5900
F 0 "R18" H 2868 5946 50  0000 L CNN
F 1 "10K" H 2868 5855 50  0000 L CNN
F 2 "Resistor_SMD:R_0603_1608Metric_Pad1.05x0.95mm_HandSolder" H 2800 5900 50  0001 C CNN
F 3 "~" H 2800 5900 50  0001 C CNN
	1    2800 5900
	1    0    0    -1  
$EndComp
$Comp
L Device:R_Small_US R17
U 1 1 5E1C2237
P 2700 5900
F 0 "R17" H 2850 5850 50  0000 R CNN
F 1 "10K" H 2900 5950 50  0000 R CNN
F 2 "Resistor_SMD:R_0603_1608Metric_Pad1.05x0.95mm_HandSolder" H 2700 5900 50  0001 C CNN
F 3 "~" H 2700 5900 50  0001 C CNN
	1    2700 5900
	-1   0    0    1   
$EndComp
Wire Wire Line
	2800 6100 2800 6000
Connection ~ 2800 6100
Wire Wire Line
	2700 6000 2700 6100
Connection ~ 2700 6100
Wire Wire Line
	2800 5750 2800 5800
Wire Wire Line
	2700 5750 2700 5800
Text GLabel 3200 2400 2    50   Input ~ 0
USB2_DN
Text GLabel 3200 2300 2    50   Input ~ 0
USB2_DP
Wire Wire Line
	2950 3600 3200 3600
Wire Wire Line
	3200 3500 2950 3500
Text GLabel 3200 4200 2    50   Input ~ 0
USB5_DP
Text GLabel 3200 4100 2    50   Input ~ 0
USB5_DN
Wire Wire Line
	2950 4200 3200 4200
Wire Wire Line
	3200 4100 2950 4100
Text Notes 3250 2200 0    50   ~ 0
Keyboard
Text Notes 3050 3400 0    50   ~ 0
Cellular Module
Text Notes 3250 2800 0    50   ~ 0
User Port
Text Notes 3200 4000 0    50   ~ 0
Touch Panel
Text GLabel 1100 4400 0    50   BiDi ~ 0
USB1_DN
$EndSCHEMATC
