G04 #@! TF.GenerationSoftware,KiCad,Pcbnew,5.1.5*
G04 #@! TF.CreationDate,2020-03-03T10:55:52-08:00*
G04 #@! TF.ProjectId,PCB (copy),50434220-2863-46f7-9079-292e6b696361,rev?*
G04 #@! TF.SameCoordinates,Original*
G04 #@! TF.FileFunction,Legend,Bot*
G04 #@! TF.FilePolarity,Positive*
%FSLAX46Y46*%
G04 Gerber Fmt 4.6, Leading zero omitted, Abs format (unit mm)*
G04 Created by KiCad (PCBNEW 5.1.5) date 2020-03-03 10:55:52*
%MOMM*%
%LPD*%
G04 APERTURE LIST*
%ADD10C,0.300000*%
%ADD11C,0.120000*%
%ADD12C,0.150000*%
%ADD13C,0.100000*%
G04 APERTURE END LIST*
D10*
X86455814Y-34088957D02*
X86241528Y-34160385D01*
X86170100Y-34231814D01*
X86098671Y-34374671D01*
X86098671Y-34588957D01*
X86170100Y-34731814D01*
X86241528Y-34803242D01*
X86384385Y-34874671D01*
X86955814Y-34874671D01*
X86955814Y-33374671D01*
X86455814Y-33374671D01*
X86312957Y-33446100D01*
X86241528Y-33517528D01*
X86170100Y-33660385D01*
X86170100Y-33803242D01*
X86241528Y-33946100D01*
X86312957Y-34017528D01*
X86455814Y-34088957D01*
X86955814Y-34088957D01*
X84812957Y-33874671D02*
X84812957Y-34874671D01*
X85455814Y-33874671D02*
X85455814Y-34660385D01*
X85384385Y-34803242D01*
X85241528Y-34874671D01*
X85027242Y-34874671D01*
X84884385Y-34803242D01*
X84812957Y-34731814D01*
X84098671Y-34874671D02*
X84098671Y-33874671D01*
X84098671Y-34017528D02*
X84027242Y-33946100D01*
X83884385Y-33874671D01*
X83670100Y-33874671D01*
X83527242Y-33946100D01*
X83455814Y-34088957D01*
X83455814Y-34874671D01*
X83455814Y-34088957D02*
X83384385Y-33946100D01*
X83241528Y-33874671D01*
X83027242Y-33874671D01*
X82884385Y-33946100D01*
X82812957Y-34088957D01*
X82812957Y-34874671D01*
X82098671Y-34874671D02*
X82098671Y-33374671D01*
X82098671Y-33946100D02*
X81955814Y-33874671D01*
X81670100Y-33874671D01*
X81527242Y-33946100D01*
X81455814Y-34017528D01*
X81384385Y-34160385D01*
X81384385Y-34588957D01*
X81455814Y-34731814D01*
X81527242Y-34803242D01*
X81670100Y-34874671D01*
X81955814Y-34874671D01*
X82098671Y-34803242D01*
X80527242Y-34874671D02*
X80670100Y-34803242D01*
X80741528Y-34660385D01*
X80741528Y-33374671D01*
X80098671Y-33874671D02*
X79741528Y-34874671D01*
X79384385Y-33874671D02*
X79741528Y-34874671D01*
X79884385Y-35231814D01*
X79955814Y-35303242D01*
X80098671Y-35374671D01*
X77670100Y-34874671D02*
X77670100Y-33374671D01*
X77670100Y-33946100D02*
X77527242Y-33874671D01*
X77241528Y-33874671D01*
X77098671Y-33946100D01*
X77027242Y-34017528D01*
X76955814Y-34160385D01*
X76955814Y-34588957D01*
X77027242Y-34731814D01*
X77098671Y-34803242D01*
X77241528Y-34874671D01*
X77527242Y-34874671D01*
X77670100Y-34803242D01*
X76455814Y-33874671D02*
X76098671Y-34874671D01*
X75741528Y-33874671D02*
X76098671Y-34874671D01*
X76241528Y-35231814D01*
X76312957Y-35303242D01*
X76455814Y-35374671D01*
X74098671Y-34803242D02*
X73884385Y-34874671D01*
X73527242Y-34874671D01*
X73384385Y-34803242D01*
X73312957Y-34731814D01*
X73241528Y-34588957D01*
X73241528Y-34446100D01*
X73312957Y-34303242D01*
X73384385Y-34231814D01*
X73527242Y-34160385D01*
X73812957Y-34088957D01*
X73955814Y-34017528D01*
X74027242Y-33946100D01*
X74098671Y-33803242D01*
X74098671Y-33660385D01*
X74027242Y-33517528D01*
X73955814Y-33446100D01*
X73812957Y-33374671D01*
X73455814Y-33374671D01*
X73241528Y-33446100D01*
X72812957Y-33874671D02*
X72241528Y-33874671D01*
X72598671Y-33374671D02*
X72598671Y-34660385D01*
X72527242Y-34803242D01*
X72384385Y-34874671D01*
X72241528Y-34874671D01*
X71098671Y-34874671D02*
X71098671Y-34088957D01*
X71170100Y-33946100D01*
X71312957Y-33874671D01*
X71598671Y-33874671D01*
X71741528Y-33946100D01*
X71098671Y-34803242D02*
X71241528Y-34874671D01*
X71598671Y-34874671D01*
X71741528Y-34803242D01*
X71812957Y-34660385D01*
X71812957Y-34517528D01*
X71741528Y-34374671D01*
X71598671Y-34303242D01*
X71241528Y-34303242D01*
X71098671Y-34231814D01*
X70598671Y-33874671D02*
X70027242Y-33874671D01*
X70384385Y-33374671D02*
X70384385Y-34660385D01*
X70312957Y-34803242D01*
X70170100Y-34874671D01*
X70027242Y-34874671D01*
X69527242Y-34874671D02*
X69527242Y-33874671D01*
X69527242Y-33374671D02*
X69598671Y-33446100D01*
X69527242Y-33517528D01*
X69455814Y-33446100D01*
X69527242Y-33374671D01*
X69527242Y-33517528D01*
X68170100Y-34803242D02*
X68312957Y-34874671D01*
X68598671Y-34874671D01*
X68741528Y-34803242D01*
X68812957Y-34731814D01*
X68884385Y-34588957D01*
X68884385Y-34160385D01*
X68812957Y-34017528D01*
X68741528Y-33946100D01*
X68598671Y-33874671D01*
X68312957Y-33874671D01*
X68170100Y-33946100D01*
X65527242Y-34874671D02*
X66027242Y-34160385D01*
X66384385Y-34874671D02*
X66384385Y-33374671D01*
X65812957Y-33374671D01*
X65670100Y-33446100D01*
X65598671Y-33517528D01*
X65527242Y-33660385D01*
X65527242Y-33874671D01*
X65598671Y-34017528D01*
X65670100Y-34088957D01*
X65812957Y-34160385D01*
X66384385Y-34160385D01*
X64312957Y-34803242D02*
X64455814Y-34874671D01*
X64741528Y-34874671D01*
X64884385Y-34803242D01*
X64955814Y-34660385D01*
X64955814Y-34088957D01*
X64884385Y-33946100D01*
X64741528Y-33874671D01*
X64455814Y-33874671D01*
X64312957Y-33946100D01*
X64241528Y-34088957D01*
X64241528Y-34231814D01*
X64955814Y-34374671D01*
X63670100Y-34803242D02*
X63527242Y-34874671D01*
X63241528Y-34874671D01*
X63098671Y-34803242D01*
X63027242Y-34660385D01*
X63027242Y-34588957D01*
X63098671Y-34446100D01*
X63241528Y-34374671D01*
X63455814Y-34374671D01*
X63598671Y-34303242D01*
X63670100Y-34160385D01*
X63670100Y-34088957D01*
X63598671Y-33946100D01*
X63455814Y-33874671D01*
X63241528Y-33874671D01*
X63098671Y-33946100D01*
X61812957Y-34803242D02*
X61955814Y-34874671D01*
X62241528Y-34874671D01*
X62384385Y-34803242D01*
X62455814Y-34660385D01*
X62455814Y-34088957D01*
X62384385Y-33946100D01*
X62241528Y-33874671D01*
X61955814Y-33874671D01*
X61812957Y-33946100D01*
X61741528Y-34088957D01*
X61741528Y-34231814D01*
X62455814Y-34374671D01*
X60455814Y-34874671D02*
X60455814Y-34088957D01*
X60527242Y-33946100D01*
X60670100Y-33874671D01*
X60955814Y-33874671D01*
X61098671Y-33946100D01*
X60455814Y-34803242D02*
X60598671Y-34874671D01*
X60955814Y-34874671D01*
X61098671Y-34803242D01*
X61170100Y-34660385D01*
X61170100Y-34517528D01*
X61098671Y-34374671D01*
X60955814Y-34303242D01*
X60598671Y-34303242D01*
X60455814Y-34231814D01*
X59741528Y-34874671D02*
X59741528Y-33874671D01*
X59741528Y-34160385D02*
X59670100Y-34017528D01*
X59598671Y-33946100D01*
X59455814Y-33874671D01*
X59312957Y-33874671D01*
X58170100Y-34803242D02*
X58312957Y-34874671D01*
X58598671Y-34874671D01*
X58741528Y-34803242D01*
X58812957Y-34731814D01*
X58884385Y-34588957D01*
X58884385Y-34160385D01*
X58812957Y-34017528D01*
X58741528Y-33946100D01*
X58598671Y-33874671D01*
X58312957Y-33874671D01*
X58170100Y-33946100D01*
X57527242Y-34874671D02*
X57527242Y-33374671D01*
X56884385Y-34874671D02*
X56884385Y-34088957D01*
X56955814Y-33946100D01*
X57098671Y-33874671D01*
X57312957Y-33874671D01*
X57455814Y-33946100D01*
X57527242Y-34017528D01*
X78312957Y-37424671D02*
X78312957Y-35924671D01*
X77812957Y-36996100D01*
X77312957Y-35924671D01*
X77312957Y-37424671D01*
X75955814Y-37424671D02*
X75955814Y-36638957D01*
X76027242Y-36496100D01*
X76170100Y-36424671D01*
X76455814Y-36424671D01*
X76598671Y-36496100D01*
X75955814Y-37353242D02*
X76098671Y-37424671D01*
X76455814Y-37424671D01*
X76598671Y-37353242D01*
X76670100Y-37210385D01*
X76670100Y-37067528D01*
X76598671Y-36924671D01*
X76455814Y-36853242D01*
X76098671Y-36853242D01*
X75955814Y-36781814D01*
X75241528Y-37424671D02*
X75241528Y-36424671D01*
X75241528Y-35924671D02*
X75312957Y-35996100D01*
X75241528Y-36067528D01*
X75170100Y-35996100D01*
X75241528Y-35924671D01*
X75241528Y-36067528D01*
X74527242Y-36424671D02*
X74527242Y-37424671D01*
X74527242Y-36567528D02*
X74455814Y-36496100D01*
X74312957Y-36424671D01*
X74098671Y-36424671D01*
X73955814Y-36496100D01*
X73884385Y-36638957D01*
X73884385Y-37424671D01*
X73170100Y-37424671D02*
X73170100Y-35924671D01*
X72598671Y-35924671D01*
X72455814Y-35996100D01*
X72384385Y-36067528D01*
X72312957Y-36210385D01*
X72312957Y-36424671D01*
X72384385Y-36567528D01*
X72455814Y-36638957D01*
X72598671Y-36710385D01*
X73170100Y-36710385D01*
X70812957Y-37281814D02*
X70884385Y-37353242D01*
X71098671Y-37424671D01*
X71241528Y-37424671D01*
X71455814Y-37353242D01*
X71598671Y-37210385D01*
X71670100Y-37067528D01*
X71741528Y-36781814D01*
X71741528Y-36567528D01*
X71670100Y-36281814D01*
X71598671Y-36138957D01*
X71455814Y-35996100D01*
X71241528Y-35924671D01*
X71098671Y-35924671D01*
X70884385Y-35996100D01*
X70812957Y-36067528D01*
X69670100Y-36638957D02*
X69455814Y-36710385D01*
X69384385Y-36781814D01*
X69312957Y-36924671D01*
X69312957Y-37138957D01*
X69384385Y-37281814D01*
X69455814Y-37353242D01*
X69598671Y-37424671D01*
X70170100Y-37424671D01*
X70170100Y-35924671D01*
X69670100Y-35924671D01*
X69527242Y-35996100D01*
X69455814Y-36067528D01*
X69384385Y-36210385D01*
X69384385Y-36353242D01*
X69455814Y-36496100D01*
X69527242Y-36567528D01*
X69670100Y-36638957D01*
X70170100Y-36638957D01*
X67741528Y-35924671D02*
X67241528Y-37424671D01*
X66741528Y-35924671D01*
X66312957Y-36067528D02*
X66241528Y-35996100D01*
X66098671Y-35924671D01*
X65741528Y-35924671D01*
X65598671Y-35996100D01*
X65527242Y-36067528D01*
X65455814Y-36210385D01*
X65455814Y-36353242D01*
X65527242Y-36567528D01*
X66384385Y-37424671D01*
X65455814Y-37424671D01*
D11*
X50569600Y-97602200D02*
X50569600Y-40462200D01*
X147419600Y-40462200D02*
X147419600Y-97602200D01*
X50569600Y-40462200D02*
X147419600Y-40462200D01*
D12*
X94022304Y-73107323D02*
X95927066Y-73107323D01*
X95927066Y-69107323D01*
X90403257Y-72726371D02*
X90593733Y-72916847D01*
X91165161Y-73107323D01*
X91546114Y-73107323D01*
X92117542Y-72916847D01*
X92498495Y-72535895D01*
X92688971Y-72154942D01*
X92879447Y-71393038D01*
X92879447Y-70821609D01*
X92688971Y-70059704D01*
X92498495Y-69678752D01*
X92117542Y-69297800D01*
X91546114Y-69107323D01*
X91165161Y-69107323D01*
X90593733Y-69297800D01*
X90403257Y-69488276D01*
X88688971Y-73107323D02*
X88688971Y-69107323D01*
X87736590Y-69107323D01*
X87165161Y-69297800D01*
X86784209Y-69678752D01*
X86593733Y-70059704D01*
X86403257Y-70821609D01*
X86403257Y-71393038D01*
X86593733Y-72154942D01*
X86784209Y-72535895D01*
X87165161Y-72916847D01*
X87736590Y-73107323D01*
X88688971Y-73107323D01*
D13*
X105014540Y-142887340D02*
X105414540Y-142487340D01*
X105414540Y-142487340D02*
X105414540Y-140687340D01*
X105014540Y-143187340D02*
X105014540Y-142887340D01*
X105014540Y-147687340D02*
X105014540Y-147187340D01*
X105014540Y-147687340D02*
X105514540Y-147687340D01*
X112414540Y-147687340D02*
X112414540Y-147187340D01*
X112414540Y-147687340D02*
X111914540Y-147687340D01*
X112414540Y-142487340D02*
X112414540Y-142987340D01*
X112414540Y-142487340D02*
X111914540Y-142487340D01*
D11*
X92786200Y-43561000D02*
X92786200Y-33045400D01*
X106730800Y-43561000D02*
X92786200Y-43561000D01*
X106730800Y-33045400D02*
X106730800Y-43561000D01*
X92786200Y-33045400D02*
X106730800Y-33045400D01*
X59106200Y-104029600D02*
X58706200Y-104029600D01*
X58906200Y-103629600D02*
X59106200Y-104029600D01*
X58706200Y-104029600D02*
X58906200Y-103629600D01*
X81481200Y-101439600D02*
X81481200Y-100839600D01*
X81371200Y-101439600D02*
X81481200Y-101439600D01*
X55831200Y-101439600D02*
X55831200Y-100839600D01*
X55941200Y-101439600D02*
X55831200Y-101439600D01*
X56601900Y-110826367D02*
X56601900Y-110483833D01*
X57621900Y-110826367D02*
X57621900Y-110483833D01*
X58113200Y-110851767D02*
X58113200Y-110509233D01*
X59133200Y-110851767D02*
X59133200Y-110509233D01*
X59649900Y-110889867D02*
X59649900Y-110547333D01*
X60669900Y-110889867D02*
X60669900Y-110547333D01*
X61148500Y-110915267D02*
X61148500Y-110572733D01*
X62168500Y-110915267D02*
X62168500Y-110572733D01*
X55116000Y-110826367D02*
X55116000Y-110483833D01*
X56136000Y-110826367D02*
X56136000Y-110483833D01*
X62659800Y-110915267D02*
X62659800Y-110572733D01*
X63679800Y-110915267D02*
X63679800Y-110572733D01*
X64171100Y-110915267D02*
X64171100Y-110572733D01*
X65191100Y-110915267D02*
X65191100Y-110572733D01*
X65682400Y-110903867D02*
X65682400Y-110561333D01*
X66702400Y-110903867D02*
X66702400Y-110561333D01*
X67168300Y-110902567D02*
X67168300Y-110560033D01*
X68188300Y-110902567D02*
X68188300Y-110560033D01*
X68654200Y-110915267D02*
X68654200Y-110572733D01*
X69674200Y-110915267D02*
X69674200Y-110572733D01*
X70165500Y-110902567D02*
X70165500Y-110560033D01*
X71185500Y-110902567D02*
X71185500Y-110560033D01*
X71664100Y-110903867D02*
X71664100Y-110561333D01*
X72684100Y-110903867D02*
X72684100Y-110561333D01*
X73162700Y-110889867D02*
X73162700Y-110547333D01*
X74182700Y-110889867D02*
X74182700Y-110547333D01*
X74635900Y-110902567D02*
X74635900Y-110560033D01*
X75655900Y-110902567D02*
X75655900Y-110560033D01*
X76134500Y-110915267D02*
X76134500Y-110572733D01*
X77154500Y-110915267D02*
X77154500Y-110572733D01*
X77620400Y-110915267D02*
X77620400Y-110572733D01*
X78640400Y-110915267D02*
X78640400Y-110572733D01*
X79080900Y-110902567D02*
X79080900Y-110560033D01*
X80100900Y-110902567D02*
X80100900Y-110560033D01*
X80541400Y-110929267D02*
X80541400Y-110586733D01*
X81561400Y-110929267D02*
X81561400Y-110586733D01*
X101771267Y-142153100D02*
X101428733Y-142153100D01*
X101771267Y-141133100D02*
X101428733Y-141133100D01*
X82040000Y-110927967D02*
X82040000Y-110585433D01*
X83060000Y-110927967D02*
X83060000Y-110585433D01*
X83538600Y-110877167D02*
X83538600Y-110534633D01*
X84558600Y-110877167D02*
X84558600Y-110534633D01*
X85024500Y-110915267D02*
X85024500Y-110572733D01*
X86044500Y-110915267D02*
X86044500Y-110572733D01*
X86523100Y-110915267D02*
X86523100Y-110572733D01*
X87543100Y-110915267D02*
X87543100Y-110572733D01*
X118789267Y-148452300D02*
X118446733Y-148452300D01*
X118789267Y-147432300D02*
X118446733Y-147432300D01*
X47681640Y-110089720D02*
X47681640Y-111489720D01*
X48381640Y-112189720D02*
X48981640Y-112189720D01*
X49681640Y-111489720D02*
X49681640Y-110089720D01*
X48981640Y-109389720D02*
X48381640Y-109389720D01*
X48381640Y-109389720D02*
G75*
G03X47681640Y-110089720I0J-700000D01*
G01*
X49681640Y-110089720D02*
G75*
G03X48981640Y-109389720I-700000J0D01*
G01*
X48981640Y-112189720D02*
G75*
G03X49681640Y-111489720I0J700000D01*
G01*
X47681640Y-111489720D02*
G75*
G03X48381640Y-112189720I700000J0D01*
G01*
X114918500Y-142846300D02*
X116318500Y-142846300D01*
X117018500Y-142146300D02*
X117018500Y-141546300D01*
X116318500Y-140846300D02*
X114918500Y-140846300D01*
X114218500Y-141546300D02*
X114218500Y-142146300D01*
X114218500Y-142146300D02*
G75*
G03X114918500Y-142846300I700000J0D01*
G01*
X114918500Y-140846300D02*
G75*
G03X114218500Y-141546300I0J-700000D01*
G01*
X117018500Y-141546300D02*
G75*
G03X116318500Y-140846300I-700000J0D01*
G01*
X116318500Y-142846300D02*
G75*
G03X117018500Y-142146300I0J700000D01*
G01*
X93424900Y-141949500D02*
X95884900Y-141949500D01*
X93424900Y-143419500D02*
X93424900Y-141949500D01*
X95884900Y-143419500D02*
X93424900Y-143419500D01*
X47419800Y-117316067D02*
X47419800Y-116973533D01*
X48439800Y-117316067D02*
X48439800Y-116973533D01*
X52230780Y-108747200D02*
X52230780Y-112597200D01*
X54230780Y-108747200D02*
X54230780Y-112597200D01*
X52230780Y-108747200D02*
X54230780Y-108747200D01*
X131364400Y-127906100D02*
X131364400Y-128256100D01*
X129544400Y-127906100D02*
X129544400Y-128256100D01*
X131364400Y-129726100D02*
X131364400Y-129376100D01*
X61410900Y-155479100D02*
X63870900Y-155479100D01*
X61410900Y-156949100D02*
X61410900Y-155479100D01*
X63870900Y-156949100D02*
X61410900Y-156949100D01*
X148301400Y-149297700D02*
X149631400Y-149297700D01*
X148301400Y-147967700D02*
X148301400Y-149297700D01*
X148301400Y-146697700D02*
X150961400Y-146697700D01*
X150961400Y-146697700D02*
X150961400Y-141557700D01*
X148301400Y-146697700D02*
X148301400Y-141557700D01*
X148301400Y-141557700D02*
X150961400Y-141557700D01*
X51327760Y-79984200D02*
X49527760Y-79984200D01*
X45817760Y-79984200D02*
X47277760Y-79984200D01*
X45817760Y-71044200D02*
X47277760Y-71044200D01*
X51327760Y-71044200D02*
X49527760Y-71044200D01*
X45817760Y-71044200D02*
X45817760Y-79984200D01*
X126342200Y-34502200D02*
X127067200Y-34502200D01*
X122847200Y-38722200D02*
X122847200Y-37997200D01*
X123572200Y-38722200D02*
X122847200Y-38722200D01*
X127067200Y-38722200D02*
X127067200Y-37997200D01*
X126342200Y-38722200D02*
X127067200Y-38722200D01*
X122847200Y-34502200D02*
X122847200Y-35227200D01*
X123572200Y-34502200D02*
X122847200Y-34502200D01*
X93122567Y-148236400D02*
X92780033Y-148236400D01*
X93122567Y-147216400D02*
X92780033Y-147216400D01*
X80295933Y-157401800D02*
X80638467Y-157401800D01*
X80295933Y-158421800D02*
X80638467Y-158421800D01*
X84402700Y-156244800D02*
X85802700Y-156244800D01*
X86502700Y-155544800D02*
X86502700Y-154944800D01*
X85802700Y-154244800D02*
X84402700Y-154244800D01*
X83702700Y-154944800D02*
X83702700Y-155544800D01*
X83702700Y-155544800D02*
G75*
G03X84402700Y-156244800I700000J0D01*
G01*
X84402700Y-154244800D02*
G75*
G03X83702700Y-154944800I0J-700000D01*
G01*
X86502700Y-154944800D02*
G75*
G03X85802700Y-154244800I-700000J0D01*
G01*
X85802700Y-156244800D02*
G75*
G03X86502700Y-155544800I0J700000D01*
G01*
X93208800Y-158089600D02*
X93208800Y-159419600D01*
X93208800Y-159419600D02*
X94538800Y-159419600D01*
X95808800Y-159419600D02*
X98408800Y-159419600D01*
X98408800Y-156759600D02*
X98408800Y-159419600D01*
X95808800Y-156759600D02*
X98408800Y-156759600D01*
X95808800Y-156759600D02*
X95808800Y-159419600D01*
D12*
X73057600Y-152653600D02*
X71682600Y-152653600D01*
X80307600Y-153078600D02*
X79782600Y-153078600D01*
X80307600Y-145828600D02*
X79782600Y-145828600D01*
X73057600Y-145828600D02*
X73582600Y-145828600D01*
X73057600Y-153078600D02*
X73582600Y-153078600D01*
X73057600Y-145828600D02*
X73057600Y-146353600D01*
X80307600Y-145828600D02*
X80307600Y-146353600D01*
X80307600Y-153078600D02*
X80307600Y-152553600D01*
X73057600Y-153078600D02*
X73057600Y-152653600D01*
X125998900Y-127853900D02*
X123023900Y-127853900D01*
X125223900Y-132103900D02*
X123023900Y-132103900D01*
X139002800Y-127776700D02*
X136027800Y-127776700D01*
X138227800Y-132026700D02*
X136027800Y-132026700D01*
D11*
X66216300Y-62999300D02*
X62766300Y-62999300D01*
X66216300Y-62999300D02*
X68166300Y-62999300D01*
X66216300Y-57879300D02*
X64266300Y-57879300D01*
X66216300Y-57879300D02*
X68166300Y-57879300D01*
X84405700Y-146735800D02*
G75*
G03X84405700Y-146735800I-700000J0D01*
G01*
X76633300Y-157607000D02*
G75*
G03X76633300Y-157607000I-700000J0D01*
G01*
X72848700Y-157683200D02*
G75*
G03X72848700Y-157683200I-700000J0D01*
G01*
X69368900Y-153454100D02*
G75*
G03X69368900Y-153454100I-700000J0D01*
G01*
X85980500Y-149669500D02*
G75*
G03X85980500Y-149669500I-700000J0D01*
G01*
X89752400Y-36461700D02*
G75*
G03X89752400Y-36461700I-700000J0D01*
G01*
X78830400Y-132435600D02*
G75*
G03X78830400Y-132435600I-700000J0D01*
G01*
X69098700Y-146272067D02*
X69098700Y-145929533D01*
X70118700Y-146272067D02*
X70118700Y-145929533D01*
X93018427Y-151330120D02*
X92675893Y-151330120D01*
X93018427Y-150310120D02*
X92675893Y-150310120D01*
X126550867Y-123756800D02*
X126208333Y-123756800D01*
X126550867Y-122736800D02*
X126208333Y-122736800D01*
X90747667Y-156237400D02*
X90405133Y-156237400D01*
X90747667Y-155217400D02*
X90405133Y-155217400D01*
X102076067Y-153316400D02*
X101733533Y-153316400D01*
X102076067Y-152296400D02*
X101733533Y-152296400D01*
X71190033Y-134427500D02*
X71532567Y-134427500D01*
X71190033Y-135447500D02*
X71532567Y-135447500D01*
X59399633Y-155704100D02*
X59742167Y-155704100D01*
X59399633Y-156724100D02*
X59742167Y-156724100D01*
X140400500Y-52648033D02*
X140400500Y-52990567D01*
X139380500Y-52648033D02*
X139380500Y-52990567D01*
X142432500Y-54908633D02*
X142432500Y-55251167D01*
X141412500Y-54908633D02*
X141412500Y-55251167D01*
X145010000Y-56242133D02*
X145010000Y-56584667D01*
X143990000Y-56242133D02*
X143990000Y-56584667D01*
X129249400Y-134445500D02*
X127849400Y-134445500D01*
X127149400Y-135145500D02*
X127149400Y-135745500D01*
X127849400Y-136445500D02*
X129249400Y-136445500D01*
X129949400Y-135745500D02*
X129949400Y-135145500D01*
X129949400Y-135145500D02*
G75*
G03X129249400Y-134445500I-700000J0D01*
G01*
X129249400Y-136445500D02*
G75*
G03X129949400Y-135745500I0J700000D01*
G01*
X127149400Y-135745500D02*
G75*
G03X127849400Y-136445500I700000J0D01*
G01*
X127849400Y-134445500D02*
G75*
G03X127149400Y-135145500I0J-700000D01*
G01*
X68634100Y-64806600D02*
X68634100Y-66206600D01*
X69334100Y-66906600D02*
X69934100Y-66906600D01*
X70634100Y-66206600D02*
X70634100Y-64806600D01*
X69934100Y-64106600D02*
X69334100Y-64106600D01*
X69334100Y-64106600D02*
G75*
G03X68634100Y-64806600I0J-700000D01*
G01*
X70634100Y-64806600D02*
G75*
G03X69934100Y-64106600I-700000J0D01*
G01*
X69934100Y-66906600D02*
G75*
G03X70634100Y-66206600I0J700000D01*
G01*
X68634100Y-66206600D02*
G75*
G03X69334100Y-66906600I700000J0D01*
G01*
X71174100Y-64793900D02*
X71174100Y-66193900D01*
X71874100Y-66893900D02*
X72474100Y-66893900D01*
X73174100Y-66193900D02*
X73174100Y-64793900D01*
X72474100Y-64093900D02*
X71874100Y-64093900D01*
X71874100Y-64093900D02*
G75*
G03X71174100Y-64793900I0J-700000D01*
G01*
X73174100Y-64793900D02*
G75*
G03X72474100Y-64093900I-700000J0D01*
G01*
X72474100Y-66893900D02*
G75*
G03X73174100Y-66193900I0J700000D01*
G01*
X71174100Y-66193900D02*
G75*
G03X71874100Y-66893900I700000J0D01*
G01*
X138300000Y-106000000D02*
X139700000Y-106000000D01*
X140400000Y-105300000D02*
X140400000Y-104700000D01*
X139700000Y-104000000D02*
X138300000Y-104000000D01*
X137600000Y-104700000D02*
X137600000Y-105300000D01*
X137600000Y-105300000D02*
G75*
G03X138300000Y-106000000I700000J0D01*
G01*
X138300000Y-104000000D02*
G75*
G03X137600000Y-104700000I0J-700000D01*
G01*
X140400000Y-104700000D02*
G75*
G03X139700000Y-104000000I-700000J0D01*
G01*
X139700000Y-106000000D02*
G75*
G03X140400000Y-105300000I0J700000D01*
G01*
X87974400Y-141976600D02*
X86574400Y-141976600D01*
X85874400Y-142676600D02*
X85874400Y-143276600D01*
X86574400Y-143976600D02*
X87974400Y-143976600D01*
X88674400Y-143276600D02*
X88674400Y-142676600D01*
X88674400Y-142676600D02*
G75*
G03X87974400Y-141976600I-700000J0D01*
G01*
X87974400Y-143976600D02*
G75*
G03X88674400Y-143276600I0J700000D01*
G01*
X85874400Y-143276600D02*
G75*
G03X86574400Y-143976600I700000J0D01*
G01*
X86574400Y-141976600D02*
G75*
G03X85874400Y-142676600I0J-700000D01*
G01*
X88063300Y-144643600D02*
X86663300Y-144643600D01*
X85963300Y-145343600D02*
X85963300Y-145943600D01*
X86663300Y-146643600D02*
X88063300Y-146643600D01*
X88763300Y-145943600D02*
X88763300Y-145343600D01*
X88763300Y-145343600D02*
G75*
G03X88063300Y-144643600I-700000J0D01*
G01*
X88063300Y-146643600D02*
G75*
G03X88763300Y-145943600I0J700000D01*
G01*
X85963300Y-145943600D02*
G75*
G03X86663300Y-146643600I700000J0D01*
G01*
X86663300Y-144643600D02*
G75*
G03X85963300Y-145343600I0J-700000D01*
G01*
X127831040Y-112663820D02*
X125851040Y-112663820D01*
X127831040Y-113013820D02*
X127831040Y-112663820D01*
X128601040Y-113013820D02*
X127831040Y-113013820D01*
X128601040Y-110963820D02*
X128601040Y-113013820D01*
X128601040Y-108843820D02*
X128601040Y-109143820D01*
X127801040Y-108843820D02*
X128601040Y-108843820D01*
X127801040Y-107543820D02*
X127801040Y-108843820D01*
X119981040Y-107543820D02*
X127801040Y-107543820D01*
X119981040Y-108843820D02*
X119981040Y-107543820D01*
X119181040Y-108843820D02*
X119981040Y-108843820D01*
X119181040Y-109143820D02*
X119181040Y-108843820D01*
X119181040Y-113013820D02*
X119181040Y-110963820D01*
X119951040Y-113013820D02*
X119181040Y-113013820D01*
X119951040Y-112663820D02*
X119951040Y-113013820D01*
X121931040Y-112663820D02*
X119951040Y-112663820D01*
X121931040Y-113253820D02*
X121931040Y-112663820D01*
X147259600Y-106705800D02*
X149059600Y-106705800D01*
X152769600Y-106705800D02*
X151309600Y-106705800D01*
X152769600Y-115645800D02*
X151309600Y-115645800D01*
X147259600Y-115645800D02*
X149059600Y-115645800D01*
X152769600Y-115645800D02*
X152769600Y-106705800D01*
X125860700Y-118797400D02*
X128320700Y-118797400D01*
X125860700Y-120267400D02*
X125860700Y-118797400D01*
X128320700Y-120267400D02*
X125860700Y-120267400D01*
X145197500Y-117286900D02*
X145197500Y-119746900D01*
X143727500Y-117286900D02*
X145197500Y-117286900D01*
X143727500Y-119746900D02*
X143727500Y-117286900D01*
X128365000Y-122509100D02*
X130825000Y-122509100D01*
X128365000Y-123979100D02*
X128365000Y-122509100D01*
X130825000Y-123979100D02*
X128365000Y-123979100D01*
X104908167Y-157126400D02*
X104565633Y-157126400D01*
X104908167Y-156106400D02*
X104565633Y-156106400D01*
X106991333Y-153007600D02*
X107333867Y-153007600D01*
X106991333Y-154027600D02*
X107333867Y-154027600D01*
D12*
X109952635Y-150279720D02*
X109952635Y-151089244D01*
X109905016Y-151184482D01*
X109857397Y-151232101D01*
X109762159Y-151279720D01*
X109571682Y-151279720D01*
X109476444Y-151232101D01*
X109428825Y-151184482D01*
X109381206Y-151089244D01*
X109381206Y-150279720D01*
X108381206Y-151279720D02*
X108952635Y-151279720D01*
X108666920Y-151279720D02*
X108666920Y-150279720D01*
X108762159Y-150422578D01*
X108857397Y-150517816D01*
X108952635Y-150565435D01*
X107762159Y-150279720D02*
X107666920Y-150279720D01*
X107571682Y-150327340D01*
X107524063Y-150374959D01*
X107476444Y-150470197D01*
X107428825Y-150660673D01*
X107428825Y-150898768D01*
X107476444Y-151089244D01*
X107524063Y-151184482D01*
X107571682Y-151232101D01*
X107666920Y-151279720D01*
X107762159Y-151279720D01*
X107857397Y-151232101D01*
X107905016Y-151184482D01*
X107952635Y-151089244D01*
X108000254Y-150898768D01*
X108000254Y-150660673D01*
X107952635Y-150470197D01*
X107905016Y-150374959D01*
X107857397Y-150327340D01*
X107762159Y-150279720D01*
X95486457Y-32303980D02*
X95962647Y-32303980D01*
X95962647Y-31303980D01*
X95200742Y-32256361D02*
X95057885Y-32303980D01*
X94819790Y-32303980D01*
X94724552Y-32256361D01*
X94676933Y-32208742D01*
X94629314Y-32113504D01*
X94629314Y-32018266D01*
X94676933Y-31923028D01*
X94724552Y-31875409D01*
X94819790Y-31827790D01*
X95010266Y-31780171D01*
X95105504Y-31732552D01*
X95153123Y-31684933D01*
X95200742Y-31589695D01*
X95200742Y-31494457D01*
X95153123Y-31399219D01*
X95105504Y-31351600D01*
X95010266Y-31303980D01*
X94772171Y-31303980D01*
X94629314Y-31351600D01*
X93676933Y-32303980D02*
X94248361Y-32303980D01*
X93962647Y-32303980D02*
X93962647Y-31303980D01*
X94057885Y-31446838D01*
X94153123Y-31542076D01*
X94248361Y-31589695D01*
X68989533Y-106031980D02*
X68989533Y-106746266D01*
X69037152Y-106889123D01*
X69132390Y-106984361D01*
X69275247Y-107031980D01*
X69370485Y-107031980D01*
X68560961Y-106127219D02*
X68513342Y-106079600D01*
X68418104Y-106031980D01*
X68180009Y-106031980D01*
X68084771Y-106079600D01*
X68037152Y-106127219D01*
X67989533Y-106222457D01*
X67989533Y-106317695D01*
X68037152Y-106460552D01*
X68608580Y-107031980D01*
X67989533Y-107031980D01*
X57640480Y-106913442D02*
X57164290Y-106580109D01*
X57640480Y-106342014D02*
X56640480Y-106342014D01*
X56640480Y-106722966D01*
X56688100Y-106818204D01*
X56735719Y-106865823D01*
X56830957Y-106913442D01*
X56973814Y-106913442D01*
X57069052Y-106865823D01*
X57116671Y-106818204D01*
X57164290Y-106722966D01*
X57164290Y-106342014D01*
X56973814Y-107770585D02*
X57640480Y-107770585D01*
X56592861Y-107532490D02*
X57307147Y-107294395D01*
X57307147Y-107913442D01*
X56640480Y-108484871D02*
X56640480Y-108580109D01*
X56688100Y-108675347D01*
X56735719Y-108722966D01*
X56830957Y-108770585D01*
X57021433Y-108818204D01*
X57259528Y-108818204D01*
X57450004Y-108770585D01*
X57545242Y-108722966D01*
X57592861Y-108675347D01*
X57640480Y-108580109D01*
X57640480Y-108484871D01*
X57592861Y-108389633D01*
X57545242Y-108342014D01*
X57450004Y-108294395D01*
X57259528Y-108246776D01*
X57021433Y-108246776D01*
X56830957Y-108294395D01*
X56735719Y-108342014D01*
X56688100Y-108389633D01*
X56640480Y-108484871D01*
X59151780Y-106976942D02*
X58675590Y-106643609D01*
X59151780Y-106405514D02*
X58151780Y-106405514D01*
X58151780Y-106786466D01*
X58199400Y-106881704D01*
X58247019Y-106929323D01*
X58342257Y-106976942D01*
X58485114Y-106976942D01*
X58580352Y-106929323D01*
X58627971Y-106881704D01*
X58675590Y-106786466D01*
X58675590Y-106405514D01*
X58151780Y-107310276D02*
X58151780Y-107929323D01*
X58532733Y-107595990D01*
X58532733Y-107738847D01*
X58580352Y-107834085D01*
X58627971Y-107881704D01*
X58723209Y-107929323D01*
X58961304Y-107929323D01*
X59056542Y-107881704D01*
X59104161Y-107834085D01*
X59151780Y-107738847D01*
X59151780Y-107453133D01*
X59104161Y-107357895D01*
X59056542Y-107310276D01*
X59151780Y-108405514D02*
X59151780Y-108595990D01*
X59104161Y-108691228D01*
X59056542Y-108738847D01*
X58913685Y-108834085D01*
X58723209Y-108881704D01*
X58342257Y-108881704D01*
X58247019Y-108834085D01*
X58199400Y-108786466D01*
X58151780Y-108691228D01*
X58151780Y-108500752D01*
X58199400Y-108405514D01*
X58247019Y-108357895D01*
X58342257Y-108310276D01*
X58580352Y-108310276D01*
X58675590Y-108357895D01*
X58723209Y-108405514D01*
X58770828Y-108500752D01*
X58770828Y-108691228D01*
X58723209Y-108786466D01*
X58675590Y-108834085D01*
X58580352Y-108881704D01*
X60523380Y-107065842D02*
X60047190Y-106732509D01*
X60523380Y-106494414D02*
X59523380Y-106494414D01*
X59523380Y-106875366D01*
X59571000Y-106970604D01*
X59618619Y-107018223D01*
X59713857Y-107065842D01*
X59856714Y-107065842D01*
X59951952Y-107018223D01*
X59999571Y-106970604D01*
X60047190Y-106875366D01*
X60047190Y-106494414D01*
X59523380Y-107399176D02*
X59523380Y-108018223D01*
X59904333Y-107684890D01*
X59904333Y-107827747D01*
X59951952Y-107922985D01*
X59999571Y-107970604D01*
X60094809Y-108018223D01*
X60332904Y-108018223D01*
X60428142Y-107970604D01*
X60475761Y-107922985D01*
X60523380Y-107827747D01*
X60523380Y-107542033D01*
X60475761Y-107446795D01*
X60428142Y-107399176D01*
X59951952Y-108589652D02*
X59904333Y-108494414D01*
X59856714Y-108446795D01*
X59761476Y-108399176D01*
X59713857Y-108399176D01*
X59618619Y-108446795D01*
X59571000Y-108494414D01*
X59523380Y-108589652D01*
X59523380Y-108780128D01*
X59571000Y-108875366D01*
X59618619Y-108922985D01*
X59713857Y-108970604D01*
X59761476Y-108970604D01*
X59856714Y-108922985D01*
X59904333Y-108875366D01*
X59951952Y-108780128D01*
X59951952Y-108589652D01*
X59999571Y-108494414D01*
X60047190Y-108446795D01*
X60142428Y-108399176D01*
X60332904Y-108399176D01*
X60428142Y-108446795D01*
X60475761Y-108494414D01*
X60523380Y-108589652D01*
X60523380Y-108780128D01*
X60475761Y-108875366D01*
X60428142Y-108922985D01*
X60332904Y-108970604D01*
X60142428Y-108970604D01*
X60047190Y-108922985D01*
X59999571Y-108875366D01*
X59951952Y-108780128D01*
X62288680Y-106950242D02*
X61812490Y-106616909D01*
X62288680Y-106378814D02*
X61288680Y-106378814D01*
X61288680Y-106759766D01*
X61336300Y-106855004D01*
X61383919Y-106902623D01*
X61479157Y-106950242D01*
X61622014Y-106950242D01*
X61717252Y-106902623D01*
X61764871Y-106855004D01*
X61812490Y-106759766D01*
X61812490Y-106378814D01*
X61288680Y-107283576D02*
X61288680Y-107902623D01*
X61669633Y-107569290D01*
X61669633Y-107712147D01*
X61717252Y-107807385D01*
X61764871Y-107855004D01*
X61860109Y-107902623D01*
X62098204Y-107902623D01*
X62193442Y-107855004D01*
X62241061Y-107807385D01*
X62288680Y-107712147D01*
X62288680Y-107426433D01*
X62241061Y-107331195D01*
X62193442Y-107283576D01*
X61288680Y-108235957D02*
X61288680Y-108902623D01*
X62288680Y-108474052D01*
X56091080Y-106888042D02*
X55614890Y-106554709D01*
X56091080Y-106316614D02*
X55091080Y-106316614D01*
X55091080Y-106697566D01*
X55138700Y-106792804D01*
X55186319Y-106840423D01*
X55281557Y-106888042D01*
X55424414Y-106888042D01*
X55519652Y-106840423D01*
X55567271Y-106792804D01*
X55614890Y-106697566D01*
X55614890Y-106316614D01*
X55091080Y-107221376D02*
X55091080Y-107840423D01*
X55472033Y-107507090D01*
X55472033Y-107649947D01*
X55519652Y-107745185D01*
X55567271Y-107792804D01*
X55662509Y-107840423D01*
X55900604Y-107840423D01*
X55995842Y-107792804D01*
X56043461Y-107745185D01*
X56091080Y-107649947D01*
X56091080Y-107364233D01*
X56043461Y-107268995D01*
X55995842Y-107221376D01*
X55091080Y-108697566D02*
X55091080Y-108507090D01*
X55138700Y-108411852D01*
X55186319Y-108364233D01*
X55329176Y-108268995D01*
X55519652Y-108221376D01*
X55900604Y-108221376D01*
X55995842Y-108268995D01*
X56043461Y-108316614D01*
X56091080Y-108411852D01*
X56091080Y-108602328D01*
X56043461Y-108697566D01*
X55995842Y-108745185D01*
X55900604Y-108792804D01*
X55662509Y-108792804D01*
X55567271Y-108745185D01*
X55519652Y-108697566D01*
X55472033Y-108602328D01*
X55472033Y-108411852D01*
X55519652Y-108316614D01*
X55567271Y-108268995D01*
X55662509Y-108221376D01*
X63698380Y-107065842D02*
X63222190Y-106732509D01*
X63698380Y-106494414D02*
X62698380Y-106494414D01*
X62698380Y-106875366D01*
X62746000Y-106970604D01*
X62793619Y-107018223D01*
X62888857Y-107065842D01*
X63031714Y-107065842D01*
X63126952Y-107018223D01*
X63174571Y-106970604D01*
X63222190Y-106875366D01*
X63222190Y-106494414D01*
X62698380Y-107399176D02*
X62698380Y-108018223D01*
X63079333Y-107684890D01*
X63079333Y-107827747D01*
X63126952Y-107922985D01*
X63174571Y-107970604D01*
X63269809Y-108018223D01*
X63507904Y-108018223D01*
X63603142Y-107970604D01*
X63650761Y-107922985D01*
X63698380Y-107827747D01*
X63698380Y-107542033D01*
X63650761Y-107446795D01*
X63603142Y-107399176D01*
X62698380Y-108922985D02*
X62698380Y-108446795D01*
X63174571Y-108399176D01*
X63126952Y-108446795D01*
X63079333Y-108542033D01*
X63079333Y-108780128D01*
X63126952Y-108875366D01*
X63174571Y-108922985D01*
X63269809Y-108970604D01*
X63507904Y-108970604D01*
X63603142Y-108922985D01*
X63650761Y-108875366D01*
X63698380Y-108780128D01*
X63698380Y-108542033D01*
X63650761Y-108446795D01*
X63603142Y-108399176D01*
X65247780Y-107040442D02*
X64771590Y-106707109D01*
X65247780Y-106469014D02*
X64247780Y-106469014D01*
X64247780Y-106849966D01*
X64295400Y-106945204D01*
X64343019Y-106992823D01*
X64438257Y-107040442D01*
X64581114Y-107040442D01*
X64676352Y-106992823D01*
X64723971Y-106945204D01*
X64771590Y-106849966D01*
X64771590Y-106469014D01*
X64247780Y-107373776D02*
X64247780Y-107992823D01*
X64628733Y-107659490D01*
X64628733Y-107802347D01*
X64676352Y-107897585D01*
X64723971Y-107945204D01*
X64819209Y-107992823D01*
X65057304Y-107992823D01*
X65152542Y-107945204D01*
X65200161Y-107897585D01*
X65247780Y-107802347D01*
X65247780Y-107516633D01*
X65200161Y-107421395D01*
X65152542Y-107373776D01*
X64581114Y-108849966D02*
X65247780Y-108849966D01*
X64200161Y-108611871D02*
X64914447Y-108373776D01*
X64914447Y-108992823D01*
X66822580Y-107015042D02*
X66346390Y-106681709D01*
X66822580Y-106443614D02*
X65822580Y-106443614D01*
X65822580Y-106824566D01*
X65870200Y-106919804D01*
X65917819Y-106967423D01*
X66013057Y-107015042D01*
X66155914Y-107015042D01*
X66251152Y-106967423D01*
X66298771Y-106919804D01*
X66346390Y-106824566D01*
X66346390Y-106443614D01*
X65822580Y-107348376D02*
X65822580Y-107967423D01*
X66203533Y-107634090D01*
X66203533Y-107776947D01*
X66251152Y-107872185D01*
X66298771Y-107919804D01*
X66394009Y-107967423D01*
X66632104Y-107967423D01*
X66727342Y-107919804D01*
X66774961Y-107872185D01*
X66822580Y-107776947D01*
X66822580Y-107491233D01*
X66774961Y-107395995D01*
X66727342Y-107348376D01*
X65822580Y-108300757D02*
X65822580Y-108919804D01*
X66203533Y-108586471D01*
X66203533Y-108729328D01*
X66251152Y-108824566D01*
X66298771Y-108872185D01*
X66394009Y-108919804D01*
X66632104Y-108919804D01*
X66727342Y-108872185D01*
X66774961Y-108824566D01*
X66822580Y-108729328D01*
X66822580Y-108443614D01*
X66774961Y-108348376D01*
X66727342Y-108300757D01*
X68181480Y-106976942D02*
X67705290Y-106643609D01*
X68181480Y-106405514D02*
X67181480Y-106405514D01*
X67181480Y-106786466D01*
X67229100Y-106881704D01*
X67276719Y-106929323D01*
X67371957Y-106976942D01*
X67514814Y-106976942D01*
X67610052Y-106929323D01*
X67657671Y-106881704D01*
X67705290Y-106786466D01*
X67705290Y-106405514D01*
X67181480Y-107310276D02*
X67181480Y-107929323D01*
X67562433Y-107595990D01*
X67562433Y-107738847D01*
X67610052Y-107834085D01*
X67657671Y-107881704D01*
X67752909Y-107929323D01*
X67991004Y-107929323D01*
X68086242Y-107881704D01*
X68133861Y-107834085D01*
X68181480Y-107738847D01*
X68181480Y-107453133D01*
X68133861Y-107357895D01*
X68086242Y-107310276D01*
X67276719Y-108310276D02*
X67229100Y-108357895D01*
X67181480Y-108453133D01*
X67181480Y-108691228D01*
X67229100Y-108786466D01*
X67276719Y-108834085D01*
X67371957Y-108881704D01*
X67467195Y-108881704D01*
X67610052Y-108834085D01*
X68181480Y-108262657D01*
X68181480Y-108881704D01*
X69629280Y-107065842D02*
X69153090Y-106732509D01*
X69629280Y-106494414D02*
X68629280Y-106494414D01*
X68629280Y-106875366D01*
X68676900Y-106970604D01*
X68724519Y-107018223D01*
X68819757Y-107065842D01*
X68962614Y-107065842D01*
X69057852Y-107018223D01*
X69105471Y-106970604D01*
X69153090Y-106875366D01*
X69153090Y-106494414D01*
X68629280Y-107399176D02*
X68629280Y-108018223D01*
X69010233Y-107684890D01*
X69010233Y-107827747D01*
X69057852Y-107922985D01*
X69105471Y-107970604D01*
X69200709Y-108018223D01*
X69438804Y-108018223D01*
X69534042Y-107970604D01*
X69581661Y-107922985D01*
X69629280Y-107827747D01*
X69629280Y-107542033D01*
X69581661Y-107446795D01*
X69534042Y-107399176D01*
X69629280Y-108970604D02*
X69629280Y-108399176D01*
X69629280Y-108684890D02*
X68629280Y-108684890D01*
X68772138Y-108589652D01*
X68867376Y-108494414D01*
X68914995Y-108399176D01*
X71178680Y-107002342D02*
X70702490Y-106669009D01*
X71178680Y-106430914D02*
X70178680Y-106430914D01*
X70178680Y-106811866D01*
X70226300Y-106907104D01*
X70273919Y-106954723D01*
X70369157Y-107002342D01*
X70512014Y-107002342D01*
X70607252Y-106954723D01*
X70654871Y-106907104D01*
X70702490Y-106811866D01*
X70702490Y-106430914D01*
X70178680Y-107335676D02*
X70178680Y-107954723D01*
X70559633Y-107621390D01*
X70559633Y-107764247D01*
X70607252Y-107859485D01*
X70654871Y-107907104D01*
X70750109Y-107954723D01*
X70988204Y-107954723D01*
X71083442Y-107907104D01*
X71131061Y-107859485D01*
X71178680Y-107764247D01*
X71178680Y-107478533D01*
X71131061Y-107383295D01*
X71083442Y-107335676D01*
X70178680Y-108573771D02*
X70178680Y-108669009D01*
X70226300Y-108764247D01*
X70273919Y-108811866D01*
X70369157Y-108859485D01*
X70559633Y-108907104D01*
X70797728Y-108907104D01*
X70988204Y-108859485D01*
X71083442Y-108811866D01*
X71131061Y-108764247D01*
X71178680Y-108669009D01*
X71178680Y-108573771D01*
X71131061Y-108478533D01*
X71083442Y-108430914D01*
X70988204Y-108383295D01*
X70797728Y-108335676D01*
X70559633Y-108335676D01*
X70369157Y-108383295D01*
X70273919Y-108430914D01*
X70226300Y-108478533D01*
X70178680Y-108573771D01*
X72715380Y-107053142D02*
X72239190Y-106719809D01*
X72715380Y-106481714D02*
X71715380Y-106481714D01*
X71715380Y-106862666D01*
X71763000Y-106957904D01*
X71810619Y-107005523D01*
X71905857Y-107053142D01*
X72048714Y-107053142D01*
X72143952Y-107005523D01*
X72191571Y-106957904D01*
X72239190Y-106862666D01*
X72239190Y-106481714D01*
X71810619Y-107434095D02*
X71763000Y-107481714D01*
X71715380Y-107576952D01*
X71715380Y-107815047D01*
X71763000Y-107910285D01*
X71810619Y-107957904D01*
X71905857Y-108005523D01*
X72001095Y-108005523D01*
X72143952Y-107957904D01*
X72715380Y-107386476D01*
X72715380Y-108005523D01*
X72715380Y-108481714D02*
X72715380Y-108672190D01*
X72667761Y-108767428D01*
X72620142Y-108815047D01*
X72477285Y-108910285D01*
X72286809Y-108957904D01*
X71905857Y-108957904D01*
X71810619Y-108910285D01*
X71763000Y-108862666D01*
X71715380Y-108767428D01*
X71715380Y-108576952D01*
X71763000Y-108481714D01*
X71810619Y-108434095D01*
X71905857Y-108386476D01*
X72143952Y-108386476D01*
X72239190Y-108434095D01*
X72286809Y-108481714D01*
X72334428Y-108576952D01*
X72334428Y-108767428D01*
X72286809Y-108862666D01*
X72239190Y-108910285D01*
X72143952Y-108957904D01*
X74150480Y-107027742D02*
X73674290Y-106694409D01*
X74150480Y-106456314D02*
X73150480Y-106456314D01*
X73150480Y-106837266D01*
X73198100Y-106932504D01*
X73245719Y-106980123D01*
X73340957Y-107027742D01*
X73483814Y-107027742D01*
X73579052Y-106980123D01*
X73626671Y-106932504D01*
X73674290Y-106837266D01*
X73674290Y-106456314D01*
X73245719Y-107408695D02*
X73198100Y-107456314D01*
X73150480Y-107551552D01*
X73150480Y-107789647D01*
X73198100Y-107884885D01*
X73245719Y-107932504D01*
X73340957Y-107980123D01*
X73436195Y-107980123D01*
X73579052Y-107932504D01*
X74150480Y-107361076D01*
X74150480Y-107980123D01*
X73579052Y-108551552D02*
X73531433Y-108456314D01*
X73483814Y-108408695D01*
X73388576Y-108361076D01*
X73340957Y-108361076D01*
X73245719Y-108408695D01*
X73198100Y-108456314D01*
X73150480Y-108551552D01*
X73150480Y-108742028D01*
X73198100Y-108837266D01*
X73245719Y-108884885D01*
X73340957Y-108932504D01*
X73388576Y-108932504D01*
X73483814Y-108884885D01*
X73531433Y-108837266D01*
X73579052Y-108742028D01*
X73579052Y-108551552D01*
X73626671Y-108456314D01*
X73674290Y-108408695D01*
X73769528Y-108361076D01*
X73960004Y-108361076D01*
X74055242Y-108408695D01*
X74102861Y-108456314D01*
X74150480Y-108551552D01*
X74150480Y-108742028D01*
X74102861Y-108837266D01*
X74055242Y-108884885D01*
X73960004Y-108932504D01*
X73769528Y-108932504D01*
X73674290Y-108884885D01*
X73626671Y-108837266D01*
X73579052Y-108742028D01*
X75737980Y-106951542D02*
X75261790Y-106618209D01*
X75737980Y-106380114D02*
X74737980Y-106380114D01*
X74737980Y-106761066D01*
X74785600Y-106856304D01*
X74833219Y-106903923D01*
X74928457Y-106951542D01*
X75071314Y-106951542D01*
X75166552Y-106903923D01*
X75214171Y-106856304D01*
X75261790Y-106761066D01*
X75261790Y-106380114D01*
X74833219Y-107332495D02*
X74785600Y-107380114D01*
X74737980Y-107475352D01*
X74737980Y-107713447D01*
X74785600Y-107808685D01*
X74833219Y-107856304D01*
X74928457Y-107903923D01*
X75023695Y-107903923D01*
X75166552Y-107856304D01*
X75737980Y-107284876D01*
X75737980Y-107903923D01*
X74737980Y-108237257D02*
X74737980Y-108903923D01*
X75737980Y-108475352D01*
X77274680Y-106989642D02*
X76798490Y-106656309D01*
X77274680Y-106418214D02*
X76274680Y-106418214D01*
X76274680Y-106799166D01*
X76322300Y-106894404D01*
X76369919Y-106942023D01*
X76465157Y-106989642D01*
X76608014Y-106989642D01*
X76703252Y-106942023D01*
X76750871Y-106894404D01*
X76798490Y-106799166D01*
X76798490Y-106418214D01*
X76369919Y-107370595D02*
X76322300Y-107418214D01*
X76274680Y-107513452D01*
X76274680Y-107751547D01*
X76322300Y-107846785D01*
X76369919Y-107894404D01*
X76465157Y-107942023D01*
X76560395Y-107942023D01*
X76703252Y-107894404D01*
X77274680Y-107322976D01*
X77274680Y-107942023D01*
X76274680Y-108799166D02*
X76274680Y-108608690D01*
X76322300Y-108513452D01*
X76369919Y-108465833D01*
X76512776Y-108370595D01*
X76703252Y-108322976D01*
X77084204Y-108322976D01*
X77179442Y-108370595D01*
X77227061Y-108418214D01*
X77274680Y-108513452D01*
X77274680Y-108703928D01*
X77227061Y-108799166D01*
X77179442Y-108846785D01*
X77084204Y-108894404D01*
X76846109Y-108894404D01*
X76750871Y-108846785D01*
X76703252Y-108799166D01*
X76655633Y-108703928D01*
X76655633Y-108513452D01*
X76703252Y-108418214D01*
X76750871Y-108370595D01*
X76846109Y-108322976D01*
X78620880Y-106989642D02*
X78144690Y-106656309D01*
X78620880Y-106418214D02*
X77620880Y-106418214D01*
X77620880Y-106799166D01*
X77668500Y-106894404D01*
X77716119Y-106942023D01*
X77811357Y-106989642D01*
X77954214Y-106989642D01*
X78049452Y-106942023D01*
X78097071Y-106894404D01*
X78144690Y-106799166D01*
X78144690Y-106418214D01*
X77716119Y-107370595D02*
X77668500Y-107418214D01*
X77620880Y-107513452D01*
X77620880Y-107751547D01*
X77668500Y-107846785D01*
X77716119Y-107894404D01*
X77811357Y-107942023D01*
X77906595Y-107942023D01*
X78049452Y-107894404D01*
X78620880Y-107322976D01*
X78620880Y-107942023D01*
X77620880Y-108846785D02*
X77620880Y-108370595D01*
X78097071Y-108322976D01*
X78049452Y-108370595D01*
X78001833Y-108465833D01*
X78001833Y-108703928D01*
X78049452Y-108799166D01*
X78097071Y-108846785D01*
X78192309Y-108894404D01*
X78430404Y-108894404D01*
X78525642Y-108846785D01*
X78573261Y-108799166D01*
X78620880Y-108703928D01*
X78620880Y-108465833D01*
X78573261Y-108370595D01*
X78525642Y-108322976D01*
X79979780Y-106926142D02*
X79503590Y-106592809D01*
X79979780Y-106354714D02*
X78979780Y-106354714D01*
X78979780Y-106735666D01*
X79027400Y-106830904D01*
X79075019Y-106878523D01*
X79170257Y-106926142D01*
X79313114Y-106926142D01*
X79408352Y-106878523D01*
X79455971Y-106830904D01*
X79503590Y-106735666D01*
X79503590Y-106354714D01*
X79075019Y-107307095D02*
X79027400Y-107354714D01*
X78979780Y-107449952D01*
X78979780Y-107688047D01*
X79027400Y-107783285D01*
X79075019Y-107830904D01*
X79170257Y-107878523D01*
X79265495Y-107878523D01*
X79408352Y-107830904D01*
X79979780Y-107259476D01*
X79979780Y-107878523D01*
X79313114Y-108735666D02*
X79979780Y-108735666D01*
X78932161Y-108497571D02*
X79646447Y-108259476D01*
X79646447Y-108878523D01*
X81618080Y-106989642D02*
X81141890Y-106656309D01*
X81618080Y-106418214D02*
X80618080Y-106418214D01*
X80618080Y-106799166D01*
X80665700Y-106894404D01*
X80713319Y-106942023D01*
X80808557Y-106989642D01*
X80951414Y-106989642D01*
X81046652Y-106942023D01*
X81094271Y-106894404D01*
X81141890Y-106799166D01*
X81141890Y-106418214D01*
X80713319Y-107370595D02*
X80665700Y-107418214D01*
X80618080Y-107513452D01*
X80618080Y-107751547D01*
X80665700Y-107846785D01*
X80713319Y-107894404D01*
X80808557Y-107942023D01*
X80903795Y-107942023D01*
X81046652Y-107894404D01*
X81618080Y-107322976D01*
X81618080Y-107942023D01*
X80618080Y-108275357D02*
X80618080Y-108894404D01*
X80999033Y-108561071D01*
X80999033Y-108703928D01*
X81046652Y-108799166D01*
X81094271Y-108846785D01*
X81189509Y-108894404D01*
X81427604Y-108894404D01*
X81522842Y-108846785D01*
X81570461Y-108799166D01*
X81618080Y-108703928D01*
X81618080Y-108418214D01*
X81570461Y-108322976D01*
X81522842Y-108275357D01*
X102242857Y-140665480D02*
X102576190Y-140189290D01*
X102814285Y-140665480D02*
X102814285Y-139665480D01*
X102433333Y-139665480D01*
X102338095Y-139713100D01*
X102290476Y-139760719D01*
X102242857Y-139855957D01*
X102242857Y-139998814D01*
X102290476Y-140094052D01*
X102338095Y-140141671D01*
X102433333Y-140189290D01*
X102814285Y-140189290D01*
X101861904Y-139760719D02*
X101814285Y-139713100D01*
X101719047Y-139665480D01*
X101480952Y-139665480D01*
X101385714Y-139713100D01*
X101338095Y-139760719D01*
X101290476Y-139855957D01*
X101290476Y-139951195D01*
X101338095Y-140094052D01*
X101909523Y-140665480D01*
X101290476Y-140665480D01*
X100338095Y-140665480D02*
X100909523Y-140665480D01*
X100623809Y-140665480D02*
X100623809Y-139665480D01*
X100719047Y-139808338D01*
X100814285Y-139903576D01*
X100909523Y-139951195D01*
X83002380Y-107040442D02*
X82526190Y-106707109D01*
X83002380Y-106469014D02*
X82002380Y-106469014D01*
X82002380Y-106849966D01*
X82050000Y-106945204D01*
X82097619Y-106992823D01*
X82192857Y-107040442D01*
X82335714Y-107040442D01*
X82430952Y-106992823D01*
X82478571Y-106945204D01*
X82526190Y-106849966D01*
X82526190Y-106469014D01*
X83002380Y-107992823D02*
X83002380Y-107421395D01*
X83002380Y-107707109D02*
X82002380Y-107707109D01*
X82145238Y-107611871D01*
X82240476Y-107516633D01*
X82288095Y-107421395D01*
X83002380Y-108469014D02*
X83002380Y-108659490D01*
X82954761Y-108754728D01*
X82907142Y-108802347D01*
X82764285Y-108897585D01*
X82573809Y-108945204D01*
X82192857Y-108945204D01*
X82097619Y-108897585D01*
X82050000Y-108849966D01*
X82002380Y-108754728D01*
X82002380Y-108564252D01*
X82050000Y-108469014D01*
X82097619Y-108421395D01*
X82192857Y-108373776D01*
X82430952Y-108373776D01*
X82526190Y-108421395D01*
X82573809Y-108469014D01*
X82621428Y-108564252D01*
X82621428Y-108754728D01*
X82573809Y-108849966D01*
X82526190Y-108897585D01*
X82430952Y-108945204D01*
X84551780Y-107027742D02*
X84075590Y-106694409D01*
X84551780Y-106456314D02*
X83551780Y-106456314D01*
X83551780Y-106837266D01*
X83599400Y-106932504D01*
X83647019Y-106980123D01*
X83742257Y-107027742D01*
X83885114Y-107027742D01*
X83980352Y-106980123D01*
X84027971Y-106932504D01*
X84075590Y-106837266D01*
X84075590Y-106456314D01*
X84551780Y-107980123D02*
X84551780Y-107408695D01*
X84551780Y-107694409D02*
X83551780Y-107694409D01*
X83694638Y-107599171D01*
X83789876Y-107503933D01*
X83837495Y-107408695D01*
X83551780Y-108837266D02*
X83551780Y-108646790D01*
X83599400Y-108551552D01*
X83647019Y-108503933D01*
X83789876Y-108408695D01*
X83980352Y-108361076D01*
X84361304Y-108361076D01*
X84456542Y-108408695D01*
X84504161Y-108456314D01*
X84551780Y-108551552D01*
X84551780Y-108742028D01*
X84504161Y-108837266D01*
X84456542Y-108884885D01*
X84361304Y-108932504D01*
X84123209Y-108932504D01*
X84027971Y-108884885D01*
X83980352Y-108837266D01*
X83932733Y-108742028D01*
X83932733Y-108551552D01*
X83980352Y-108456314D01*
X84027971Y-108408695D01*
X84123209Y-108361076D01*
X86063080Y-107078542D02*
X85586890Y-106745209D01*
X86063080Y-106507114D02*
X85063080Y-106507114D01*
X85063080Y-106888066D01*
X85110700Y-106983304D01*
X85158319Y-107030923D01*
X85253557Y-107078542D01*
X85396414Y-107078542D01*
X85491652Y-107030923D01*
X85539271Y-106983304D01*
X85586890Y-106888066D01*
X85586890Y-106507114D01*
X86063080Y-108030923D02*
X86063080Y-107459495D01*
X86063080Y-107745209D02*
X85063080Y-107745209D01*
X85205938Y-107649971D01*
X85301176Y-107554733D01*
X85348795Y-107459495D01*
X85063080Y-108935685D02*
X85063080Y-108459495D01*
X85539271Y-108411876D01*
X85491652Y-108459495D01*
X85444033Y-108554733D01*
X85444033Y-108792828D01*
X85491652Y-108888066D01*
X85539271Y-108935685D01*
X85634509Y-108983304D01*
X85872604Y-108983304D01*
X85967842Y-108935685D01*
X86015461Y-108888066D01*
X86063080Y-108792828D01*
X86063080Y-108554733D01*
X86015461Y-108459495D01*
X85967842Y-108411876D01*
X87536280Y-107015042D02*
X87060090Y-106681709D01*
X87536280Y-106443614D02*
X86536280Y-106443614D01*
X86536280Y-106824566D01*
X86583900Y-106919804D01*
X86631519Y-106967423D01*
X86726757Y-107015042D01*
X86869614Y-107015042D01*
X86964852Y-106967423D01*
X87012471Y-106919804D01*
X87060090Y-106824566D01*
X87060090Y-106443614D01*
X87536280Y-107967423D02*
X87536280Y-107395995D01*
X87536280Y-107681709D02*
X86536280Y-107681709D01*
X86679138Y-107586471D01*
X86774376Y-107491233D01*
X86821995Y-107395995D01*
X86869614Y-108824566D02*
X87536280Y-108824566D01*
X86488661Y-108586471D02*
X87202947Y-108348376D01*
X87202947Y-108967423D01*
X119260857Y-146964680D02*
X119594190Y-146488490D01*
X119832285Y-146964680D02*
X119832285Y-145964680D01*
X119451333Y-145964680D01*
X119356095Y-146012300D01*
X119308476Y-146059919D01*
X119260857Y-146155157D01*
X119260857Y-146298014D01*
X119308476Y-146393252D01*
X119356095Y-146440871D01*
X119451333Y-146488490D01*
X119832285Y-146488490D01*
X118308476Y-146964680D02*
X118879904Y-146964680D01*
X118594190Y-146964680D02*
X118594190Y-145964680D01*
X118689428Y-146107538D01*
X118784666Y-146202776D01*
X118879904Y-146250395D01*
X117356095Y-146964680D02*
X117927523Y-146964680D01*
X117641809Y-146964680D02*
X117641809Y-145964680D01*
X117737047Y-146107538D01*
X117832285Y-146202776D01*
X117927523Y-146250395D01*
X46334020Y-109956386D02*
X47048306Y-109956386D01*
X47191163Y-109908767D01*
X47286401Y-109813529D01*
X47334020Y-109670672D01*
X47334020Y-109575434D01*
X47334020Y-110432577D02*
X46334020Y-110432577D01*
X46334020Y-110813529D01*
X46381640Y-110908767D01*
X46429259Y-110956386D01*
X46524497Y-111004005D01*
X46667354Y-111004005D01*
X46762592Y-110956386D01*
X46810211Y-110908767D01*
X46857830Y-110813529D01*
X46857830Y-110432577D01*
X47334020Y-111480196D02*
X47334020Y-111670672D01*
X47286401Y-111765910D01*
X47238782Y-111813529D01*
X47095925Y-111908767D01*
X46905449Y-111956386D01*
X46524497Y-111956386D01*
X46429259Y-111908767D01*
X46381640Y-111861148D01*
X46334020Y-111765910D01*
X46334020Y-111575434D01*
X46381640Y-111480196D01*
X46429259Y-111432577D01*
X46524497Y-111384958D01*
X46762592Y-111384958D01*
X46857830Y-111432577D01*
X46905449Y-111480196D01*
X46953068Y-111575434D01*
X46953068Y-111765910D01*
X46905449Y-111861148D01*
X46857830Y-111908767D01*
X46762592Y-111956386D01*
X116451833Y-143098680D02*
X116451833Y-143812966D01*
X116499452Y-143955823D01*
X116594690Y-144051061D01*
X116737547Y-144098680D01*
X116832785Y-144098680D01*
X115975642Y-144098680D02*
X115975642Y-143098680D01*
X115594690Y-143098680D01*
X115499452Y-143146300D01*
X115451833Y-143193919D01*
X115404214Y-143289157D01*
X115404214Y-143432014D01*
X115451833Y-143527252D01*
X115499452Y-143574871D01*
X115594690Y-143622490D01*
X115975642Y-143622490D01*
X114832785Y-143527252D02*
X114928023Y-143479633D01*
X114975642Y-143432014D01*
X115023261Y-143336776D01*
X115023261Y-143289157D01*
X114975642Y-143193919D01*
X114928023Y-143146300D01*
X114832785Y-143098680D01*
X114642309Y-143098680D01*
X114547071Y-143146300D01*
X114499452Y-143193919D01*
X114451833Y-143289157D01*
X114451833Y-143336776D01*
X114499452Y-143432014D01*
X114547071Y-143479633D01*
X114642309Y-143527252D01*
X114832785Y-143527252D01*
X114928023Y-143574871D01*
X114975642Y-143622490D01*
X115023261Y-143717728D01*
X115023261Y-143908204D01*
X114975642Y-144003442D01*
X114928023Y-144051061D01*
X114832785Y-144098680D01*
X114642309Y-144098680D01*
X114547071Y-144051061D01*
X114499452Y-144003442D01*
X114451833Y-143908204D01*
X114451833Y-143717728D01*
X114499452Y-143622490D01*
X114547071Y-143574871D01*
X114642309Y-143527252D01*
X95822995Y-144566880D02*
X95822995Y-143566880D01*
X95584900Y-143566880D01*
X95442042Y-143614500D01*
X95346804Y-143709738D01*
X95299185Y-143804976D01*
X95251566Y-143995452D01*
X95251566Y-144138309D01*
X95299185Y-144328785D01*
X95346804Y-144424023D01*
X95442042Y-144519261D01*
X95584900Y-144566880D01*
X95822995Y-144566880D01*
X94394423Y-143566880D02*
X94584900Y-143566880D01*
X94680138Y-143614500D01*
X94727757Y-143662119D01*
X94822995Y-143804976D01*
X94870614Y-143995452D01*
X94870614Y-144376404D01*
X94822995Y-144471642D01*
X94775376Y-144519261D01*
X94680138Y-144566880D01*
X94489661Y-144566880D01*
X94394423Y-144519261D01*
X94346804Y-144471642D01*
X94299185Y-144376404D01*
X94299185Y-144138309D01*
X94346804Y-144043071D01*
X94394423Y-143995452D01*
X94489661Y-143947833D01*
X94680138Y-143947833D01*
X94775376Y-143995452D01*
X94822995Y-144043071D01*
X94870614Y-144138309D01*
X49716942Y-116501942D02*
X49764561Y-116454323D01*
X49812180Y-116311466D01*
X49812180Y-116216228D01*
X49764561Y-116073371D01*
X49669323Y-115978133D01*
X49574085Y-115930514D01*
X49383609Y-115882895D01*
X49240752Y-115882895D01*
X49050276Y-115930514D01*
X48955038Y-115978133D01*
X48859800Y-116073371D01*
X48812180Y-116216228D01*
X48812180Y-116311466D01*
X48859800Y-116454323D01*
X48907419Y-116501942D01*
X49812180Y-117454323D02*
X49812180Y-116882895D01*
X49812180Y-117168609D02*
X48812180Y-117168609D01*
X48955038Y-117073371D01*
X49050276Y-116978133D01*
X49097895Y-116882895D01*
X49812180Y-118406704D02*
X49812180Y-117835276D01*
X49812180Y-118120990D02*
X48812180Y-118120990D01*
X48955038Y-118025752D01*
X49050276Y-117930514D01*
X49097895Y-117835276D01*
X51778160Y-110082104D02*
X50778160Y-110082104D01*
X50778160Y-110320200D01*
X50825780Y-110463057D01*
X50921018Y-110558295D01*
X51016256Y-110605914D01*
X51206732Y-110653533D01*
X51349589Y-110653533D01*
X51540065Y-110605914D01*
X51635303Y-110558295D01*
X51730541Y-110463057D01*
X51778160Y-110320200D01*
X51778160Y-110082104D01*
X50778160Y-110986866D02*
X50778160Y-111653533D01*
X51778160Y-111224961D01*
X133959504Y-128268480D02*
X133959504Y-129078004D01*
X133911885Y-129173242D01*
X133864266Y-129220861D01*
X133769028Y-129268480D01*
X133578552Y-129268480D01*
X133483314Y-129220861D01*
X133435695Y-129173242D01*
X133388076Y-129078004D01*
X133388076Y-128268480D01*
X132388076Y-129268480D02*
X132959504Y-129268480D01*
X132673790Y-129268480D02*
X132673790Y-128268480D01*
X132769028Y-128411338D01*
X132864266Y-128506576D01*
X132959504Y-128554195D01*
X61281695Y-156729980D02*
X61281695Y-155729980D01*
X61043600Y-155729980D01*
X60900742Y-155777600D01*
X60805504Y-155872838D01*
X60757885Y-155968076D01*
X60710266Y-156158552D01*
X60710266Y-156301409D01*
X60757885Y-156491885D01*
X60805504Y-156587123D01*
X60900742Y-156682361D01*
X61043600Y-156729980D01*
X61281695Y-156729980D01*
X59757885Y-156729980D02*
X60329314Y-156729980D01*
X60043600Y-156729980D02*
X60043600Y-155729980D01*
X60138838Y-155872838D01*
X60234076Y-155968076D01*
X60329314Y-156015695D01*
X64689947Y-159666480D02*
X65166138Y-159666480D01*
X65166138Y-158666480D01*
X64356614Y-159142671D02*
X64023280Y-159142671D01*
X63880423Y-159666480D02*
X64356614Y-159666480D01*
X64356614Y-158666480D01*
X63880423Y-158666480D01*
X63451852Y-159666480D02*
X63451852Y-158666480D01*
X63213757Y-158666480D01*
X63070900Y-158714100D01*
X62975661Y-158809338D01*
X62928042Y-158904576D01*
X62880423Y-159095052D01*
X62880423Y-159237909D01*
X62928042Y-159428385D01*
X62975661Y-159523623D01*
X63070900Y-159618861D01*
X63213757Y-159666480D01*
X63451852Y-159666480D01*
X62689947Y-159761719D02*
X61928042Y-159761719D01*
X61785185Y-158666480D02*
X61547090Y-159666480D01*
X61356614Y-158952195D01*
X61166138Y-159666480D01*
X60928042Y-158666480D01*
X60642328Y-158666480D02*
X60404233Y-159666480D01*
X60213757Y-158952195D01*
X60023280Y-159666480D01*
X59785185Y-158666480D01*
X59451852Y-159380766D02*
X58975661Y-159380766D01*
X59547090Y-159666480D02*
X59213757Y-158666480D01*
X58880423Y-159666480D01*
X58547090Y-159666480D02*
X58547090Y-158666480D01*
X57975661Y-159666480D01*
X57975661Y-158666480D01*
X150107590Y-150273890D02*
X150107590Y-150750080D01*
X150440923Y-149750080D02*
X150107590Y-150273890D01*
X149774257Y-149750080D01*
X148917114Y-150750080D02*
X149488542Y-150750080D01*
X149202828Y-150750080D02*
X149202828Y-149750080D01*
X149298066Y-149892938D01*
X149393304Y-149988176D01*
X149488542Y-150035795D01*
X54690140Y-75180866D02*
X55404426Y-75180866D01*
X55547283Y-75133247D01*
X55642521Y-75038009D01*
X55690140Y-74895152D01*
X55690140Y-74799914D01*
X54690140Y-76133247D02*
X54690140Y-75657057D01*
X55166331Y-75609438D01*
X55118712Y-75657057D01*
X55071093Y-75752295D01*
X55071093Y-75990390D01*
X55118712Y-76085628D01*
X55166331Y-76133247D01*
X55261569Y-76180866D01*
X55499664Y-76180866D01*
X55594902Y-76133247D01*
X55642521Y-76085628D01*
X55690140Y-75990390D01*
X55690140Y-75752295D01*
X55642521Y-75657057D01*
X55594902Y-75609438D01*
X125719104Y-32764580D02*
X125719104Y-33574104D01*
X125671485Y-33669342D01*
X125623866Y-33716961D01*
X125528628Y-33764580D01*
X125338152Y-33764580D01*
X125242914Y-33716961D01*
X125195295Y-33669342D01*
X125147676Y-33574104D01*
X125147676Y-32764580D01*
X124766723Y-32764580D02*
X124147676Y-32764580D01*
X124481009Y-33145533D01*
X124338152Y-33145533D01*
X124242914Y-33193152D01*
X124195295Y-33240771D01*
X124147676Y-33336009D01*
X124147676Y-33574104D01*
X124195295Y-33669342D01*
X124242914Y-33716961D01*
X124338152Y-33764580D01*
X124623866Y-33764580D01*
X124719104Y-33716961D01*
X124766723Y-33669342D01*
X93594157Y-146748780D02*
X93927490Y-146272590D01*
X94165585Y-146748780D02*
X94165585Y-145748780D01*
X93784633Y-145748780D01*
X93689395Y-145796400D01*
X93641776Y-145844019D01*
X93594157Y-145939257D01*
X93594157Y-146082114D01*
X93641776Y-146177352D01*
X93689395Y-146224971D01*
X93784633Y-146272590D01*
X94165585Y-146272590D01*
X92641776Y-146748780D02*
X93213204Y-146748780D01*
X92927490Y-146748780D02*
X92927490Y-145748780D01*
X93022728Y-145891638D01*
X93117966Y-145986876D01*
X93213204Y-146034495D01*
X92070347Y-146177352D02*
X92165585Y-146129733D01*
X92213204Y-146082114D01*
X92260823Y-145986876D01*
X92260823Y-145939257D01*
X92213204Y-145844019D01*
X92165585Y-145796400D01*
X92070347Y-145748780D01*
X91879871Y-145748780D01*
X91784633Y-145796400D01*
X91737014Y-145844019D01*
X91689395Y-145939257D01*
X91689395Y-145986876D01*
X91737014Y-146082114D01*
X91784633Y-146129733D01*
X91879871Y-146177352D01*
X92070347Y-146177352D01*
X92165585Y-146224971D01*
X92213204Y-146272590D01*
X92260823Y-146367828D01*
X92260823Y-146558304D01*
X92213204Y-146653542D01*
X92165585Y-146701161D01*
X92070347Y-146748780D01*
X91879871Y-146748780D01*
X91784633Y-146701161D01*
X91737014Y-146653542D01*
X91689395Y-146558304D01*
X91689395Y-146367828D01*
X91737014Y-146272590D01*
X91784633Y-146224971D01*
X91879871Y-146177352D01*
X81110057Y-159794180D02*
X81443390Y-159317990D01*
X81681485Y-159794180D02*
X81681485Y-158794180D01*
X81300533Y-158794180D01*
X81205295Y-158841800D01*
X81157676Y-158889419D01*
X81110057Y-158984657D01*
X81110057Y-159127514D01*
X81157676Y-159222752D01*
X81205295Y-159270371D01*
X81300533Y-159317990D01*
X81681485Y-159317990D01*
X80157676Y-159794180D02*
X80729104Y-159794180D01*
X80443390Y-159794180D02*
X80443390Y-158794180D01*
X80538628Y-158937038D01*
X80633866Y-159032276D01*
X80729104Y-159079895D01*
X79824342Y-158794180D02*
X79157676Y-158794180D01*
X79586247Y-159794180D01*
X85936033Y-156497180D02*
X85936033Y-157211466D01*
X85983652Y-157354323D01*
X86078890Y-157449561D01*
X86221747Y-157497180D01*
X86316985Y-157497180D01*
X85459842Y-157497180D02*
X85459842Y-156497180D01*
X85078890Y-156497180D01*
X84983652Y-156544800D01*
X84936033Y-156592419D01*
X84888414Y-156687657D01*
X84888414Y-156830514D01*
X84936033Y-156925752D01*
X84983652Y-156973371D01*
X85078890Y-157020990D01*
X85459842Y-157020990D01*
X84555080Y-156497180D02*
X83888414Y-156497180D01*
X84316985Y-157497180D01*
X92221180Y-156780076D02*
X91221180Y-156780076D01*
X91935466Y-157113409D01*
X91221180Y-157446742D01*
X92221180Y-157446742D01*
X92221180Y-157922933D02*
X91221180Y-157922933D01*
X92221180Y-158494361D02*
X91649752Y-158065790D01*
X91221180Y-158494361D02*
X91792609Y-157922933D01*
X92221180Y-159446742D02*
X92221180Y-158875314D01*
X92221180Y-159161028D02*
X91221180Y-159161028D01*
X91364038Y-159065790D01*
X91459276Y-158970552D01*
X91506895Y-158875314D01*
X77444504Y-154905980D02*
X77444504Y-155715504D01*
X77396885Y-155810742D01*
X77349266Y-155858361D01*
X77254028Y-155905980D01*
X77063552Y-155905980D01*
X76968314Y-155858361D01*
X76920695Y-155810742D01*
X76873076Y-155715504D01*
X76873076Y-154905980D01*
X76492123Y-154905980D02*
X75825457Y-154905980D01*
X76254028Y-155905980D01*
X124885804Y-126381280D02*
X124885804Y-127190804D01*
X124838185Y-127286042D01*
X124790566Y-127333661D01*
X124695328Y-127381280D01*
X124504852Y-127381280D01*
X124409614Y-127333661D01*
X124361995Y-127286042D01*
X124314376Y-127190804D01*
X124314376Y-126381280D01*
X123409614Y-126381280D02*
X123600090Y-126381280D01*
X123695328Y-126428900D01*
X123742947Y-126476519D01*
X123838185Y-126619376D01*
X123885804Y-126809852D01*
X123885804Y-127190804D01*
X123838185Y-127286042D01*
X123790566Y-127333661D01*
X123695328Y-127381280D01*
X123504852Y-127381280D01*
X123409614Y-127333661D01*
X123361995Y-127286042D01*
X123314376Y-127190804D01*
X123314376Y-126952709D01*
X123361995Y-126857471D01*
X123409614Y-126809852D01*
X123504852Y-126762233D01*
X123695328Y-126762233D01*
X123790566Y-126809852D01*
X123838185Y-126857471D01*
X123885804Y-126952709D01*
X137889704Y-126304080D02*
X137889704Y-127113604D01*
X137842085Y-127208842D01*
X137794466Y-127256461D01*
X137699228Y-127304080D01*
X137508752Y-127304080D01*
X137413514Y-127256461D01*
X137365895Y-127208842D01*
X137318276Y-127113604D01*
X137318276Y-126304080D01*
X136365895Y-126304080D02*
X136842085Y-126304080D01*
X136889704Y-126780271D01*
X136842085Y-126732652D01*
X136746847Y-126685033D01*
X136508752Y-126685033D01*
X136413514Y-126732652D01*
X136365895Y-126780271D01*
X136318276Y-126875509D01*
X136318276Y-127113604D01*
X136365895Y-127208842D01*
X136413514Y-127256461D01*
X136508752Y-127304080D01*
X136746847Y-127304080D01*
X136842085Y-127256461D01*
X136889704Y-127208842D01*
X66978204Y-63291680D02*
X66978204Y-64101204D01*
X66930585Y-64196442D01*
X66882966Y-64244061D01*
X66787728Y-64291680D01*
X66597252Y-64291680D01*
X66502014Y-64244061D01*
X66454395Y-64196442D01*
X66406776Y-64101204D01*
X66406776Y-63291680D01*
X65502014Y-63625014D02*
X65502014Y-64291680D01*
X65740109Y-63244061D02*
X65978204Y-63958347D01*
X65359157Y-63958347D01*
X85443795Y-147636180D02*
X84872366Y-147636180D01*
X85158080Y-148636180D02*
X85158080Y-147636180D01*
X84539033Y-148636180D02*
X84539033Y-147636180D01*
X84158080Y-147636180D01*
X84062842Y-147683800D01*
X84015223Y-147731419D01*
X83967604Y-147826657D01*
X83967604Y-147969514D01*
X84015223Y-148064752D01*
X84062842Y-148112371D01*
X84158080Y-148159990D01*
X84539033Y-148159990D01*
X83015223Y-148636180D02*
X83586652Y-148636180D01*
X83300938Y-148636180D02*
X83300938Y-147636180D01*
X83396176Y-147779038D01*
X83491414Y-147874276D01*
X83586652Y-147921895D01*
X82158080Y-147969514D02*
X82158080Y-148636180D01*
X82396176Y-147588561D02*
X82634271Y-148302847D01*
X82015223Y-148302847D01*
X77671395Y-158507380D02*
X77099966Y-158507380D01*
X77385680Y-159507380D02*
X77385680Y-158507380D01*
X76766633Y-159507380D02*
X76766633Y-158507380D01*
X76385680Y-158507380D01*
X76290442Y-158555000D01*
X76242823Y-158602619D01*
X76195204Y-158697857D01*
X76195204Y-158840714D01*
X76242823Y-158935952D01*
X76290442Y-158983571D01*
X76385680Y-159031190D01*
X76766633Y-159031190D01*
X75242823Y-159507380D02*
X75814252Y-159507380D01*
X75528538Y-159507380D02*
X75528538Y-158507380D01*
X75623776Y-158650238D01*
X75719014Y-158745476D01*
X75814252Y-158793095D01*
X74909490Y-158507380D02*
X74290442Y-158507380D01*
X74623776Y-158888333D01*
X74480919Y-158888333D01*
X74385680Y-158935952D01*
X74338061Y-158983571D01*
X74290442Y-159078809D01*
X74290442Y-159316904D01*
X74338061Y-159412142D01*
X74385680Y-159459761D01*
X74480919Y-159507380D01*
X74766633Y-159507380D01*
X74861871Y-159459761D01*
X74909490Y-159412142D01*
X73886795Y-158583580D02*
X73315366Y-158583580D01*
X73601080Y-159583580D02*
X73601080Y-158583580D01*
X72982033Y-159583580D02*
X72982033Y-158583580D01*
X72601080Y-158583580D01*
X72505842Y-158631200D01*
X72458223Y-158678819D01*
X72410604Y-158774057D01*
X72410604Y-158916914D01*
X72458223Y-159012152D01*
X72505842Y-159059771D01*
X72601080Y-159107390D01*
X72982033Y-159107390D01*
X71458223Y-159583580D02*
X72029652Y-159583580D01*
X71743938Y-159583580D02*
X71743938Y-158583580D01*
X71839176Y-158726438D01*
X71934414Y-158821676D01*
X72029652Y-158869295D01*
X71077271Y-158678819D02*
X71029652Y-158631200D01*
X70934414Y-158583580D01*
X70696319Y-158583580D01*
X70601080Y-158631200D01*
X70553461Y-158678819D01*
X70505842Y-158774057D01*
X70505842Y-158869295D01*
X70553461Y-159012152D01*
X71124890Y-159583580D01*
X70505842Y-159583580D01*
X70406995Y-154354480D02*
X69835566Y-154354480D01*
X70121280Y-155354480D02*
X70121280Y-154354480D01*
X69502233Y-155354480D02*
X69502233Y-154354480D01*
X69121280Y-154354480D01*
X69026042Y-154402100D01*
X68978423Y-154449719D01*
X68930804Y-154544957D01*
X68930804Y-154687814D01*
X68978423Y-154783052D01*
X69026042Y-154830671D01*
X69121280Y-154878290D01*
X69502233Y-154878290D01*
X67978423Y-155354480D02*
X68549852Y-155354480D01*
X68264138Y-155354480D02*
X68264138Y-154354480D01*
X68359376Y-154497338D01*
X68454614Y-154592576D01*
X68549852Y-154640195D01*
X67026042Y-155354480D02*
X67597471Y-155354480D01*
X67311757Y-155354480D02*
X67311757Y-154354480D01*
X67406995Y-154497338D01*
X67502233Y-154592576D01*
X67597471Y-154640195D01*
X86542404Y-150569880D02*
X85970976Y-150569880D01*
X86256690Y-151569880D02*
X86256690Y-150569880D01*
X85637642Y-151569880D02*
X85637642Y-150569880D01*
X85256690Y-150569880D01*
X85161452Y-150617500D01*
X85113833Y-150665119D01*
X85066214Y-150760357D01*
X85066214Y-150903214D01*
X85113833Y-150998452D01*
X85161452Y-151046071D01*
X85256690Y-151093690D01*
X85637642Y-151093690D01*
X84590023Y-151569880D02*
X84399547Y-151569880D01*
X84304309Y-151522261D01*
X84256690Y-151474642D01*
X84161452Y-151331785D01*
X84113833Y-151141309D01*
X84113833Y-150760357D01*
X84161452Y-150665119D01*
X84209071Y-150617500D01*
X84304309Y-150569880D01*
X84494785Y-150569880D01*
X84590023Y-150617500D01*
X84637642Y-150665119D01*
X84685261Y-150760357D01*
X84685261Y-150998452D01*
X84637642Y-151093690D01*
X84590023Y-151141309D01*
X84494785Y-151188928D01*
X84304309Y-151188928D01*
X84209071Y-151141309D01*
X84161452Y-151093690D01*
X84113833Y-150998452D01*
X90314304Y-37362080D02*
X89742876Y-37362080D01*
X90028590Y-38362080D02*
X90028590Y-37362080D01*
X89409542Y-38362080D02*
X89409542Y-37362080D01*
X89028590Y-37362080D01*
X88933352Y-37409700D01*
X88885733Y-37457319D01*
X88838114Y-37552557D01*
X88838114Y-37695414D01*
X88885733Y-37790652D01*
X88933352Y-37838271D01*
X89028590Y-37885890D01*
X89409542Y-37885890D01*
X87933352Y-37362080D02*
X88409542Y-37362080D01*
X88457161Y-37838271D01*
X88409542Y-37790652D01*
X88314304Y-37743033D01*
X88076209Y-37743033D01*
X87980971Y-37790652D01*
X87933352Y-37838271D01*
X87885733Y-37933509D01*
X87885733Y-38171604D01*
X87933352Y-38266842D01*
X87980971Y-38314461D01*
X88076209Y-38362080D01*
X88314304Y-38362080D01*
X88409542Y-38314461D01*
X88457161Y-38266842D01*
X79392304Y-133335980D02*
X78820876Y-133335980D01*
X79106590Y-134335980D02*
X79106590Y-133335980D01*
X78487542Y-134335980D02*
X78487542Y-133335980D01*
X78106590Y-133335980D01*
X78011352Y-133383600D01*
X77963733Y-133431219D01*
X77916114Y-133526457D01*
X77916114Y-133669314D01*
X77963733Y-133764552D01*
X78011352Y-133812171D01*
X78106590Y-133859790D01*
X78487542Y-133859790D01*
X77582780Y-133335980D02*
X76963733Y-133335980D01*
X77297066Y-133716933D01*
X77154209Y-133716933D01*
X77058971Y-133764552D01*
X77011352Y-133812171D01*
X76963733Y-133907409D01*
X76963733Y-134145504D01*
X77011352Y-134240742D01*
X77058971Y-134288361D01*
X77154209Y-134335980D01*
X77439923Y-134335980D01*
X77535161Y-134288361D01*
X77582780Y-134240742D01*
X71491080Y-145457942D02*
X71014890Y-145124609D01*
X71491080Y-144886514D02*
X70491080Y-144886514D01*
X70491080Y-145267466D01*
X70538700Y-145362704D01*
X70586319Y-145410323D01*
X70681557Y-145457942D01*
X70824414Y-145457942D01*
X70919652Y-145410323D01*
X70967271Y-145362704D01*
X71014890Y-145267466D01*
X71014890Y-144886514D01*
X71491080Y-146410323D02*
X71491080Y-145838895D01*
X71491080Y-146124609D02*
X70491080Y-146124609D01*
X70633938Y-146029371D01*
X70729176Y-145934133D01*
X70776795Y-145838895D01*
X70491080Y-146743657D02*
X70491080Y-147362704D01*
X70872033Y-147029371D01*
X70872033Y-147172228D01*
X70919652Y-147267466D01*
X70967271Y-147315085D01*
X71062509Y-147362704D01*
X71300604Y-147362704D01*
X71395842Y-147315085D01*
X71443461Y-147267466D01*
X71491080Y-147172228D01*
X71491080Y-146886514D01*
X71443461Y-146791276D01*
X71395842Y-146743657D01*
X93490017Y-149842500D02*
X93823350Y-149366310D01*
X94061445Y-149842500D02*
X94061445Y-148842500D01*
X93680493Y-148842500D01*
X93585255Y-148890120D01*
X93537636Y-148937739D01*
X93490017Y-149032977D01*
X93490017Y-149175834D01*
X93537636Y-149271072D01*
X93585255Y-149318691D01*
X93680493Y-149366310D01*
X94061445Y-149366310D01*
X92537636Y-149842500D02*
X93109064Y-149842500D01*
X92823350Y-149842500D02*
X92823350Y-148842500D01*
X92918588Y-148985358D01*
X93013826Y-149080596D01*
X93109064Y-149128215D01*
X92156683Y-148937739D02*
X92109064Y-148890120D01*
X92013826Y-148842500D01*
X91775731Y-148842500D01*
X91680493Y-148890120D01*
X91632874Y-148937739D01*
X91585255Y-149032977D01*
X91585255Y-149128215D01*
X91632874Y-149271072D01*
X92204302Y-149842500D01*
X91585255Y-149842500D01*
X123358566Y-123673780D02*
X123691900Y-123197590D01*
X123929995Y-123673780D02*
X123929995Y-122673780D01*
X123549042Y-122673780D01*
X123453804Y-122721400D01*
X123406185Y-122769019D01*
X123358566Y-122864257D01*
X123358566Y-123007114D01*
X123406185Y-123102352D01*
X123453804Y-123149971D01*
X123549042Y-123197590D01*
X123929995Y-123197590D01*
X122882376Y-123673780D02*
X122691900Y-123673780D01*
X122596661Y-123626161D01*
X122549042Y-123578542D01*
X122453804Y-123435685D01*
X122406185Y-123245209D01*
X122406185Y-122864257D01*
X122453804Y-122769019D01*
X122501423Y-122721400D01*
X122596661Y-122673780D01*
X122787138Y-122673780D01*
X122882376Y-122721400D01*
X122929995Y-122769019D01*
X122977614Y-122864257D01*
X122977614Y-123102352D01*
X122929995Y-123197590D01*
X122882376Y-123245209D01*
X122787138Y-123292828D01*
X122596661Y-123292828D01*
X122501423Y-123245209D01*
X122453804Y-123197590D01*
X122406185Y-123102352D01*
X90743066Y-154749780D02*
X91076400Y-154273590D01*
X91314495Y-154749780D02*
X91314495Y-153749780D01*
X90933542Y-153749780D01*
X90838304Y-153797400D01*
X90790685Y-153845019D01*
X90743066Y-153940257D01*
X90743066Y-154083114D01*
X90790685Y-154178352D01*
X90838304Y-154225971D01*
X90933542Y-154273590D01*
X91314495Y-154273590D01*
X90171638Y-154178352D02*
X90266876Y-154130733D01*
X90314495Y-154083114D01*
X90362114Y-153987876D01*
X90362114Y-153940257D01*
X90314495Y-153845019D01*
X90266876Y-153797400D01*
X90171638Y-153749780D01*
X89981161Y-153749780D01*
X89885923Y-153797400D01*
X89838304Y-153845019D01*
X89790685Y-153940257D01*
X89790685Y-153987876D01*
X89838304Y-154083114D01*
X89885923Y-154130733D01*
X89981161Y-154178352D01*
X90171638Y-154178352D01*
X90266876Y-154225971D01*
X90314495Y-154273590D01*
X90362114Y-154368828D01*
X90362114Y-154559304D01*
X90314495Y-154654542D01*
X90266876Y-154702161D01*
X90171638Y-154749780D01*
X89981161Y-154749780D01*
X89885923Y-154702161D01*
X89838304Y-154654542D01*
X89790685Y-154559304D01*
X89790685Y-154368828D01*
X89838304Y-154273590D01*
X89885923Y-154225971D01*
X89981161Y-154178352D01*
X102071466Y-151828780D02*
X102404800Y-151352590D01*
X102642895Y-151828780D02*
X102642895Y-150828780D01*
X102261942Y-150828780D01*
X102166704Y-150876400D01*
X102119085Y-150924019D01*
X102071466Y-151019257D01*
X102071466Y-151162114D01*
X102119085Y-151257352D01*
X102166704Y-151304971D01*
X102261942Y-151352590D01*
X102642895Y-151352590D01*
X101738133Y-150828780D02*
X101071466Y-150828780D01*
X101500038Y-151828780D01*
X71527966Y-136819880D02*
X71861300Y-136343690D01*
X72099395Y-136819880D02*
X72099395Y-135819880D01*
X71718442Y-135819880D01*
X71623204Y-135867500D01*
X71575585Y-135915119D01*
X71527966Y-136010357D01*
X71527966Y-136153214D01*
X71575585Y-136248452D01*
X71623204Y-136296071D01*
X71718442Y-136343690D01*
X72099395Y-136343690D01*
X70670823Y-135819880D02*
X70861300Y-135819880D01*
X70956538Y-135867500D01*
X71004157Y-135915119D01*
X71099395Y-136057976D01*
X71147014Y-136248452D01*
X71147014Y-136629404D01*
X71099395Y-136724642D01*
X71051776Y-136772261D01*
X70956538Y-136819880D01*
X70766061Y-136819880D01*
X70670823Y-136772261D01*
X70623204Y-136724642D01*
X70575585Y-136629404D01*
X70575585Y-136391309D01*
X70623204Y-136296071D01*
X70670823Y-136248452D01*
X70766061Y-136200833D01*
X70956538Y-136200833D01*
X71051776Y-136248452D01*
X71099395Y-136296071D01*
X71147014Y-136391309D01*
X59737566Y-158096480D02*
X60070900Y-157620290D01*
X60308995Y-158096480D02*
X60308995Y-157096480D01*
X59928042Y-157096480D01*
X59832804Y-157144100D01*
X59785185Y-157191719D01*
X59737566Y-157286957D01*
X59737566Y-157429814D01*
X59785185Y-157525052D01*
X59832804Y-157572671D01*
X59928042Y-157620290D01*
X60308995Y-157620290D01*
X58832804Y-157096480D02*
X59308995Y-157096480D01*
X59356614Y-157572671D01*
X59308995Y-157525052D01*
X59213757Y-157477433D01*
X58975661Y-157477433D01*
X58880423Y-157525052D01*
X58832804Y-157572671D01*
X58785185Y-157667909D01*
X58785185Y-157906004D01*
X58832804Y-158001242D01*
X58880423Y-158048861D01*
X58975661Y-158096480D01*
X59213757Y-158096480D01*
X59308995Y-158048861D01*
X59356614Y-158001242D01*
X140292080Y-50138033D02*
X139815890Y-49804700D01*
X140292080Y-49566604D02*
X139292080Y-49566604D01*
X139292080Y-49947557D01*
X139339700Y-50042795D01*
X139387319Y-50090414D01*
X139482557Y-50138033D01*
X139625414Y-50138033D01*
X139720652Y-50090414D01*
X139768271Y-50042795D01*
X139815890Y-49947557D01*
X139815890Y-49566604D01*
X139625414Y-50995176D02*
X140292080Y-50995176D01*
X139244461Y-50757080D02*
X139958747Y-50518985D01*
X139958747Y-51138033D01*
X142247880Y-52398633D02*
X141771690Y-52065300D01*
X142247880Y-51827204D02*
X141247880Y-51827204D01*
X141247880Y-52208157D01*
X141295500Y-52303395D01*
X141343119Y-52351014D01*
X141438357Y-52398633D01*
X141581214Y-52398633D01*
X141676452Y-52351014D01*
X141724071Y-52303395D01*
X141771690Y-52208157D01*
X141771690Y-51827204D01*
X141247880Y-52731966D02*
X141247880Y-53351014D01*
X141628833Y-53017680D01*
X141628833Y-53160538D01*
X141676452Y-53255776D01*
X141724071Y-53303395D01*
X141819309Y-53351014D01*
X142057404Y-53351014D01*
X142152642Y-53303395D01*
X142200261Y-53255776D01*
X142247880Y-53160538D01*
X142247880Y-52874823D01*
X142200261Y-52779585D01*
X142152642Y-52731966D01*
X144876180Y-53732133D02*
X144399990Y-53398800D01*
X144876180Y-53160704D02*
X143876180Y-53160704D01*
X143876180Y-53541657D01*
X143923800Y-53636895D01*
X143971419Y-53684514D01*
X144066657Y-53732133D01*
X144209514Y-53732133D01*
X144304752Y-53684514D01*
X144352371Y-53636895D01*
X144399990Y-53541657D01*
X144399990Y-53160704D01*
X143971419Y-54113085D02*
X143923800Y-54160704D01*
X143876180Y-54255942D01*
X143876180Y-54494038D01*
X143923800Y-54589276D01*
X143971419Y-54636895D01*
X144066657Y-54684514D01*
X144161895Y-54684514D01*
X144304752Y-54636895D01*
X144876180Y-54065466D01*
X144876180Y-54684514D01*
X129382733Y-133097880D02*
X129382733Y-133812166D01*
X129430352Y-133955023D01*
X129525590Y-134050261D01*
X129668447Y-134097880D01*
X129763685Y-134097880D01*
X128906542Y-134097880D02*
X128906542Y-133097880D01*
X128525590Y-133097880D01*
X128430352Y-133145500D01*
X128382733Y-133193119D01*
X128335114Y-133288357D01*
X128335114Y-133431214D01*
X128382733Y-133526452D01*
X128430352Y-133574071D01*
X128525590Y-133621690D01*
X128906542Y-133621690D01*
X127477971Y-133097880D02*
X127668447Y-133097880D01*
X127763685Y-133145500D01*
X127811304Y-133193119D01*
X127906542Y-133335976D01*
X127954161Y-133526452D01*
X127954161Y-133907404D01*
X127906542Y-134002642D01*
X127858923Y-134050261D01*
X127763685Y-134097880D01*
X127573209Y-134097880D01*
X127477971Y-134050261D01*
X127430352Y-134002642D01*
X127382733Y-133907404D01*
X127382733Y-133669309D01*
X127430352Y-133574071D01*
X127477971Y-133526452D01*
X127573209Y-133478833D01*
X127763685Y-133478833D01*
X127858923Y-133526452D01*
X127906542Y-133574071D01*
X127954161Y-133669309D01*
X70543633Y-67448180D02*
X70543633Y-68162466D01*
X70591252Y-68305323D01*
X70686490Y-68400561D01*
X70829347Y-68448180D01*
X70924585Y-68448180D01*
X70067442Y-68448180D02*
X70067442Y-67448180D01*
X69686490Y-67448180D01*
X69591252Y-67495800D01*
X69543633Y-67543419D01*
X69496014Y-67638657D01*
X69496014Y-67781514D01*
X69543633Y-67876752D01*
X69591252Y-67924371D01*
X69686490Y-67971990D01*
X70067442Y-67971990D01*
X68591252Y-67448180D02*
X69067442Y-67448180D01*
X69115061Y-67924371D01*
X69067442Y-67876752D01*
X68972204Y-67829133D01*
X68734109Y-67829133D01*
X68638871Y-67876752D01*
X68591252Y-67924371D01*
X68543633Y-68019609D01*
X68543633Y-68257704D01*
X68591252Y-68352942D01*
X68638871Y-68400561D01*
X68734109Y-68448180D01*
X68972204Y-68448180D01*
X69067442Y-68400561D01*
X69115061Y-68352942D01*
X73083633Y-67283080D02*
X73083633Y-67997366D01*
X73131252Y-68140223D01*
X73226490Y-68235461D01*
X73369347Y-68283080D01*
X73464585Y-68283080D01*
X72607442Y-68283080D02*
X72607442Y-67283080D01*
X72226490Y-67283080D01*
X72131252Y-67330700D01*
X72083633Y-67378319D01*
X72036014Y-67473557D01*
X72036014Y-67616414D01*
X72083633Y-67711652D01*
X72131252Y-67759271D01*
X72226490Y-67806890D01*
X72607442Y-67806890D01*
X71178871Y-67616414D02*
X71178871Y-68283080D01*
X71416966Y-67235461D02*
X71655061Y-67949747D01*
X71036014Y-67949747D01*
X139833333Y-106252380D02*
X139833333Y-106966666D01*
X139880952Y-107109523D01*
X139976190Y-107204761D01*
X140119047Y-107252380D01*
X140214285Y-107252380D01*
X139357142Y-107252380D02*
X139357142Y-106252380D01*
X138976190Y-106252380D01*
X138880952Y-106300000D01*
X138833333Y-106347619D01*
X138785714Y-106442857D01*
X138785714Y-106585714D01*
X138833333Y-106680952D01*
X138880952Y-106728571D01*
X138976190Y-106776190D01*
X139357142Y-106776190D01*
X138452380Y-106252380D02*
X137833333Y-106252380D01*
X138166666Y-106633333D01*
X138023809Y-106633333D01*
X137928571Y-106680952D01*
X137880952Y-106728571D01*
X137833333Y-106823809D01*
X137833333Y-107061904D01*
X137880952Y-107157142D01*
X137928571Y-107204761D01*
X138023809Y-107252380D01*
X138309523Y-107252380D01*
X138404761Y-107204761D01*
X138452380Y-107157142D01*
X88107733Y-140628980D02*
X88107733Y-141343266D01*
X88155352Y-141486123D01*
X88250590Y-141581361D01*
X88393447Y-141628980D01*
X88488685Y-141628980D01*
X87631542Y-141628980D02*
X87631542Y-140628980D01*
X87250590Y-140628980D01*
X87155352Y-140676600D01*
X87107733Y-140724219D01*
X87060114Y-140819457D01*
X87060114Y-140962314D01*
X87107733Y-141057552D01*
X87155352Y-141105171D01*
X87250590Y-141152790D01*
X87631542Y-141152790D01*
X86679161Y-140724219D02*
X86631542Y-140676600D01*
X86536304Y-140628980D01*
X86298209Y-140628980D01*
X86202971Y-140676600D01*
X86155352Y-140724219D01*
X86107733Y-140819457D01*
X86107733Y-140914695D01*
X86155352Y-141057552D01*
X86726780Y-141628980D01*
X86107733Y-141628980D01*
X88196633Y-143295980D02*
X88196633Y-144010266D01*
X88244252Y-144153123D01*
X88339490Y-144248361D01*
X88482347Y-144295980D01*
X88577585Y-144295980D01*
X87720442Y-144295980D02*
X87720442Y-143295980D01*
X87339490Y-143295980D01*
X87244252Y-143343600D01*
X87196633Y-143391219D01*
X87149014Y-143486457D01*
X87149014Y-143629314D01*
X87196633Y-143724552D01*
X87244252Y-143772171D01*
X87339490Y-143819790D01*
X87720442Y-143819790D01*
X86196633Y-144295980D02*
X86768061Y-144295980D01*
X86482347Y-144295980D02*
X86482347Y-143295980D01*
X86577585Y-143438838D01*
X86672823Y-143534076D01*
X86768061Y-143581695D01*
X124700563Y-113906200D02*
X124700563Y-114620486D01*
X124748182Y-114763343D01*
X124843420Y-114858581D01*
X124986278Y-114906200D01*
X125081516Y-114906200D01*
X123700563Y-114906200D02*
X124271992Y-114906200D01*
X123986278Y-114906200D02*
X123986278Y-113906200D01*
X124081516Y-114049058D01*
X124176754Y-114144296D01*
X124271992Y-114191915D01*
X122748182Y-114906200D02*
X123319611Y-114906200D01*
X123033897Y-114906200D02*
X123033897Y-113906200D01*
X123129135Y-114049058D01*
X123224373Y-114144296D01*
X123319611Y-114191915D01*
X142801980Y-110842466D02*
X143516266Y-110842466D01*
X143659123Y-110794847D01*
X143754361Y-110699609D01*
X143801980Y-110556752D01*
X143801980Y-110461514D01*
X142801980Y-111223419D02*
X142801980Y-111890085D01*
X143801980Y-111461514D01*
X128258795Y-121414780D02*
X128258795Y-120414780D01*
X128020700Y-120414780D01*
X127877842Y-120462400D01*
X127782604Y-120557638D01*
X127734985Y-120652876D01*
X127687366Y-120843352D01*
X127687366Y-120986209D01*
X127734985Y-121176685D01*
X127782604Y-121271923D01*
X127877842Y-121367161D01*
X128020700Y-121414780D01*
X128258795Y-121414780D01*
X126830223Y-120748114D02*
X126830223Y-121414780D01*
X127068319Y-120367161D02*
X127306414Y-121081447D01*
X126687366Y-121081447D01*
X143484880Y-118208804D02*
X142484880Y-118208804D01*
X142484880Y-118446900D01*
X142532500Y-118589757D01*
X142627738Y-118684995D01*
X142722976Y-118732614D01*
X142913452Y-118780233D01*
X143056309Y-118780233D01*
X143246785Y-118732614D01*
X143342023Y-118684995D01*
X143437261Y-118589757D01*
X143484880Y-118446900D01*
X143484880Y-118208804D01*
X142484880Y-119113566D02*
X142484880Y-119732614D01*
X142865833Y-119399280D01*
X142865833Y-119542138D01*
X142913452Y-119637376D01*
X142961071Y-119684995D01*
X143056309Y-119732614D01*
X143294404Y-119732614D01*
X143389642Y-119684995D01*
X143437261Y-119637376D01*
X143484880Y-119542138D01*
X143484880Y-119256423D01*
X143437261Y-119161185D01*
X143389642Y-119113566D01*
X133239595Y-123772680D02*
X133239595Y-122772680D01*
X133001500Y-122772680D01*
X132858642Y-122820300D01*
X132763404Y-122915538D01*
X132715785Y-123010776D01*
X132668166Y-123201252D01*
X132668166Y-123344109D01*
X132715785Y-123534585D01*
X132763404Y-123629823D01*
X132858642Y-123725061D01*
X133001500Y-123772680D01*
X133239595Y-123772680D01*
X132287214Y-122867919D02*
X132239595Y-122820300D01*
X132144357Y-122772680D01*
X131906261Y-122772680D01*
X131811023Y-122820300D01*
X131763404Y-122867919D01*
X131715785Y-122963157D01*
X131715785Y-123058395D01*
X131763404Y-123201252D01*
X132334833Y-123772680D01*
X131715785Y-123772680D01*
X136629600Y-122199180D02*
X136629600Y-121199180D01*
X136391504Y-121199180D01*
X136248647Y-121246800D01*
X136153409Y-121342038D01*
X136105790Y-121437276D01*
X136058171Y-121627752D01*
X136058171Y-121770609D01*
X136105790Y-121961085D01*
X136153409Y-122056323D01*
X136248647Y-122151561D01*
X136391504Y-122199180D01*
X136629600Y-122199180D01*
X135486742Y-122199180D02*
X135581980Y-122151561D01*
X135629600Y-122103942D01*
X135677219Y-122008704D01*
X135677219Y-121722990D01*
X135629600Y-121627752D01*
X135581980Y-121580133D01*
X135486742Y-121532514D01*
X135343885Y-121532514D01*
X135248647Y-121580133D01*
X135201028Y-121627752D01*
X135153409Y-121722990D01*
X135153409Y-122008704D01*
X135201028Y-122103942D01*
X135248647Y-122151561D01*
X135343885Y-122199180D01*
X135486742Y-122199180D01*
X134820076Y-121532514D02*
X134629600Y-122199180D01*
X134439123Y-121722990D01*
X134248647Y-122199180D01*
X134058171Y-121532514D01*
X133677219Y-121532514D02*
X133677219Y-122199180D01*
X133677219Y-121627752D02*
X133629600Y-121580133D01*
X133534361Y-121532514D01*
X133391504Y-121532514D01*
X133296266Y-121580133D01*
X133248647Y-121675371D01*
X133248647Y-122199180D01*
X132820076Y-122151561D02*
X132724838Y-122199180D01*
X132534361Y-122199180D01*
X132439123Y-122151561D01*
X132391504Y-122056323D01*
X132391504Y-122008704D01*
X132439123Y-121913466D01*
X132534361Y-121865847D01*
X132677219Y-121865847D01*
X132772457Y-121818228D01*
X132820076Y-121722990D01*
X132820076Y-121675371D01*
X132772457Y-121580133D01*
X132677219Y-121532514D01*
X132534361Y-121532514D01*
X132439123Y-121580133D01*
X132105790Y-121532514D02*
X131724838Y-121532514D01*
X131962933Y-121199180D02*
X131962933Y-122056323D01*
X131915314Y-122151561D01*
X131820076Y-122199180D01*
X131724838Y-122199180D01*
X131391504Y-122199180D02*
X131391504Y-121532514D01*
X131391504Y-121722990D02*
X131343885Y-121627752D01*
X131296266Y-121580133D01*
X131201028Y-121532514D01*
X131105790Y-121532514D01*
X130391504Y-122151561D02*
X130486742Y-122199180D01*
X130677219Y-122199180D01*
X130772457Y-122151561D01*
X130820076Y-122056323D01*
X130820076Y-121675371D01*
X130772457Y-121580133D01*
X130677219Y-121532514D01*
X130486742Y-121532514D01*
X130391504Y-121580133D01*
X130343885Y-121675371D01*
X130343885Y-121770609D01*
X130820076Y-121865847D01*
X129486742Y-122199180D02*
X129486742Y-121675371D01*
X129534361Y-121580133D01*
X129629600Y-121532514D01*
X129820076Y-121532514D01*
X129915314Y-121580133D01*
X129486742Y-122151561D02*
X129581980Y-122199180D01*
X129820076Y-122199180D01*
X129915314Y-122151561D01*
X129962933Y-122056323D01*
X129962933Y-121961085D01*
X129915314Y-121865847D01*
X129820076Y-121818228D01*
X129581980Y-121818228D01*
X129486742Y-121770609D01*
X129010552Y-122199180D02*
X129010552Y-121532514D01*
X129010552Y-121627752D02*
X128962933Y-121580133D01*
X128867695Y-121532514D01*
X128724838Y-121532514D01*
X128629600Y-121580133D01*
X128581980Y-121675371D01*
X128581980Y-122199180D01*
X128581980Y-121675371D02*
X128534361Y-121580133D01*
X128439123Y-121532514D01*
X128296266Y-121532514D01*
X128201028Y-121580133D01*
X128153409Y-121675371D01*
X128153409Y-122199180D01*
X126581980Y-121675371D02*
X126915314Y-121675371D01*
X126915314Y-122199180D02*
X126915314Y-121199180D01*
X126439123Y-121199180D01*
X125629600Y-122199180D02*
X125629600Y-121675371D01*
X125677219Y-121580133D01*
X125772457Y-121532514D01*
X125962933Y-121532514D01*
X126058171Y-121580133D01*
X125629600Y-122151561D02*
X125724838Y-122199180D01*
X125962933Y-122199180D01*
X126058171Y-122151561D01*
X126105790Y-122056323D01*
X126105790Y-121961085D01*
X126058171Y-121865847D01*
X125962933Y-121818228D01*
X125724838Y-121818228D01*
X125629600Y-121770609D01*
X124724838Y-122151561D02*
X124820076Y-122199180D01*
X125010552Y-122199180D01*
X125105790Y-122151561D01*
X125153409Y-122103942D01*
X125201028Y-122008704D01*
X125201028Y-121722990D01*
X125153409Y-121627752D01*
X125105790Y-121580133D01*
X125010552Y-121532514D01*
X124820076Y-121532514D01*
X124724838Y-121580133D01*
X124296266Y-122199180D02*
X124296266Y-121532514D01*
X124296266Y-121199180D02*
X124343885Y-121246800D01*
X124296266Y-121294419D01*
X124248647Y-121246800D01*
X124296266Y-121199180D01*
X124296266Y-121294419D01*
X123820076Y-121532514D02*
X123820076Y-122199180D01*
X123820076Y-121627752D02*
X123772457Y-121580133D01*
X123677219Y-121532514D01*
X123534361Y-121532514D01*
X123439123Y-121580133D01*
X123391504Y-121675371D01*
X123391504Y-122199180D01*
X122486742Y-121532514D02*
X122486742Y-122342038D01*
X122534361Y-122437276D01*
X122581980Y-122484895D01*
X122677219Y-122532514D01*
X122820076Y-122532514D01*
X122915314Y-122484895D01*
X122486742Y-122151561D02*
X122581980Y-122199180D01*
X122772457Y-122199180D01*
X122867695Y-122151561D01*
X122915314Y-122103942D01*
X122962933Y-122008704D01*
X122962933Y-121722990D01*
X122915314Y-121627752D01*
X122867695Y-121580133D01*
X122772457Y-121532514D01*
X122581980Y-121532514D01*
X122486742Y-121580133D01*
X121248647Y-122199180D02*
X121248647Y-121199180D01*
X120867695Y-121199180D01*
X120772457Y-121246800D01*
X120724838Y-121294419D01*
X120677219Y-121389657D01*
X120677219Y-121532514D01*
X120724838Y-121627752D01*
X120772457Y-121675371D01*
X120867695Y-121722990D01*
X121248647Y-121722990D01*
X120105790Y-122199180D02*
X120201028Y-122151561D01*
X120248647Y-122103942D01*
X120296266Y-122008704D01*
X120296266Y-121722990D01*
X120248647Y-121627752D01*
X120201028Y-121580133D01*
X120105790Y-121532514D01*
X119962933Y-121532514D01*
X119867695Y-121580133D01*
X119820076Y-121627752D01*
X119772457Y-121722990D01*
X119772457Y-122008704D01*
X119820076Y-122103942D01*
X119867695Y-122151561D01*
X119962933Y-122199180D01*
X120105790Y-122199180D01*
X119343885Y-122199180D02*
X119343885Y-121532514D01*
X119343885Y-121722990D02*
X119296266Y-121627752D01*
X119248647Y-121580133D01*
X119153409Y-121532514D01*
X119058171Y-121532514D01*
X118867695Y-121532514D02*
X118486742Y-121532514D01*
X118724838Y-121199180D02*
X118724838Y-122056323D01*
X118677219Y-122151561D01*
X118581980Y-122199180D01*
X118486742Y-122199180D01*
X104903566Y-155543542D02*
X104951185Y-155591161D01*
X105094042Y-155638780D01*
X105189280Y-155638780D01*
X105332138Y-155591161D01*
X105427376Y-155495923D01*
X105474995Y-155400685D01*
X105522614Y-155210209D01*
X105522614Y-155067352D01*
X105474995Y-154876876D01*
X105427376Y-154781638D01*
X105332138Y-154686400D01*
X105189280Y-154638780D01*
X105094042Y-154638780D01*
X104951185Y-154686400D01*
X104903566Y-154734019D01*
X104570233Y-154638780D02*
X103903566Y-154638780D01*
X104332138Y-155638780D01*
X107329266Y-155304742D02*
X107376885Y-155352361D01*
X107519742Y-155399980D01*
X107614980Y-155399980D01*
X107757838Y-155352361D01*
X107853076Y-155257123D01*
X107900695Y-155161885D01*
X107948314Y-154971409D01*
X107948314Y-154828552D01*
X107900695Y-154638076D01*
X107853076Y-154542838D01*
X107757838Y-154447600D01*
X107614980Y-154399980D01*
X107519742Y-154399980D01*
X107376885Y-154447600D01*
X107329266Y-154495219D01*
X106472123Y-154399980D02*
X106662600Y-154399980D01*
X106757838Y-154447600D01*
X106805457Y-154495219D01*
X106900695Y-154638076D01*
X106948314Y-154828552D01*
X106948314Y-155209504D01*
X106900695Y-155304742D01*
X106853076Y-155352361D01*
X106757838Y-155399980D01*
X106567361Y-155399980D01*
X106472123Y-155352361D01*
X106424504Y-155304742D01*
X106376885Y-155209504D01*
X106376885Y-154971409D01*
X106424504Y-154876171D01*
X106472123Y-154828552D01*
X106567361Y-154780933D01*
X106757838Y-154780933D01*
X106853076Y-154828552D01*
X106900695Y-154876171D01*
X106948314Y-154971409D01*
M02*
