(module DF40C-70DS (layer F.Cu) (tedit 5E1FC7D6)
  (fp_text reference REF** (at 2.032 0.762) (layer F.SilkS)
    (effects (font (size 1 1) (thickness 0.15)))
  )
  (fp_text value DF40C-70DS (at 9.652 0.762) (layer F.Fab)
    (effects (font (size 1 1) (thickness 0.15)))
  )
  (fp_line (start 0 -0.254) (end 0 0) (layer F.SilkS) (width 0.12))
  (fp_line (start 0 -5.08) (end 0 -0.254) (layer F.SilkS) (width 0.12))
  (fp_line (start 14.478 -5.08) (end 0 -5.08) (layer F.SilkS) (width 0.12))
  (fp_line (start 14.478 0) (end 14.478 -5.08) (layer F.SilkS) (width 0.12))
  (fp_line (start 0 0) (end 14.478 0) (layer F.SilkS) (width 0.12))
  (pad 1 smd rect (at 0.508 -4.064) (size 0.2 1.5) (layers F.Cu F.Paste F.Mask))
  (pad 2 smd rect (at 0.508 -1.064) (size 0.2 1.5) (layers F.Cu F.Paste F.Mask))
  (pad 3 smd rect (at 0.908 -4.064) (size 0.2 1.5) (layers F.Cu F.Paste F.Mask))
  (pad 4 smd rect (at 0.908 -1.064) (size 0.2 1.5) (layers F.Cu F.Paste F.Mask))
  (pad 5 smd rect (at 1.308 -4.064) (size 0.2 1.5) (layers F.Cu F.Paste F.Mask))
  (pad 6 smd rect (at 1.308 -1.064) (size 0.2 1.5) (layers F.Cu F.Paste F.Mask))
  (pad 7 smd rect (at 1.708 -4.064) (size 0.2 1.5) (layers F.Cu F.Paste F.Mask))
  (pad 8 smd rect (at 1.708 -1.064) (size 0.2 1.5) (layers F.Cu F.Paste F.Mask))
  (pad 9 smd rect (at 2.108 -4.064) (size 0.2 1.5) (layers F.Cu F.Paste F.Mask))
  (pad 10 smd rect (at 2.108 -1.064) (size 0.2 1.5) (layers F.Cu F.Paste F.Mask))
  (pad 11 smd rect (at 2.508 -4.064) (size 0.2 1.5) (layers F.Cu F.Paste F.Mask))
  (pad 12 smd rect (at 2.508 -1.064) (size 0.2 1.5) (layers F.Cu F.Paste F.Mask))
  (pad 13 smd rect (at 2.908 -4.064) (size 0.2 1.5) (layers F.Cu F.Paste F.Mask))
  (pad 14 smd rect (at 2.908 -1.064) (size 0.2 1.5) (layers F.Cu F.Paste F.Mask))
  (pad 15 smd rect (at 3.308 -4.064) (size 0.2 1.5) (layers F.Cu F.Paste F.Mask))
  (pad 16 smd rect (at 3.308 -1.064) (size 0.2 1.5) (layers F.Cu F.Paste F.Mask))
  (pad 17 smd rect (at 3.708 -4.064) (size 0.2 1.5) (layers F.Cu F.Paste F.Mask))
  (pad 18 smd rect (at 3.708 -1.064) (size 0.2 1.5) (layers F.Cu F.Paste F.Mask))
  (pad 19 smd rect (at 4.108 -4.064) (size 0.2 1.5) (layers F.Cu F.Paste F.Mask))
  (pad 20 smd rect (at 4.108 -1.064) (size 0.2 1.5) (layers F.Cu F.Paste F.Mask))
  (pad 21 smd rect (at 4.508 -4.064) (size 0.2 1.5) (layers F.Cu F.Paste F.Mask))
  (pad 22 smd rect (at 4.508 -1.064) (size 0.2 1.5) (layers F.Cu F.Paste F.Mask))
  (pad 23 smd rect (at 4.908 -4.064) (size 0.2 1.5) (layers F.Cu F.Paste F.Mask))
  (pad 24 smd rect (at 4.908 -1.064) (size 0.2 1.5) (layers F.Cu F.Paste F.Mask))
  (pad 25 smd rect (at 5.308 -4.064) (size 0.2 1.5) (layers F.Cu F.Paste F.Mask))
  (pad 26 smd rect (at 5.308 -1.064) (size 0.2 1.5) (layers F.Cu F.Paste F.Mask))
  (pad 27 smd rect (at 5.708 -4.064) (size 0.2 1.5) (layers F.Cu F.Paste F.Mask))
  (pad 28 smd rect (at 5.708 -1.064) (size 0.2 1.5) (layers F.Cu F.Paste F.Mask))
  (pad 29 smd rect (at 6.108 -4.064) (size 0.2 1.5) (layers F.Cu F.Paste F.Mask))
  (pad 30 smd rect (at 6.108 -1.064) (size 0.2 1.5) (layers F.Cu F.Paste F.Mask))
  (pad 31 smd rect (at 6.508 -4.064) (size 0.2 1.5) (layers F.Cu F.Paste F.Mask))
  (pad 32 smd rect (at 6.508 -1.064) (size 0.2 1.5) (layers F.Cu F.Paste F.Mask))
  (pad 33 smd rect (at 6.908 -4.064) (size 0.2 1.5) (layers F.Cu F.Paste F.Mask))
  (pad 34 smd rect (at 6.908 -1.064) (size 0.2 1.5) (layers F.Cu F.Paste F.Mask))
  (pad 35 smd rect (at 7.308 -4.064) (size 0.2 1.5) (layers F.Cu F.Paste F.Mask))
  (pad 36 smd rect (at 7.308 -1.064) (size 0.2 1.5) (layers F.Cu F.Paste F.Mask))
  (pad 37 smd rect (at 7.708 -4.064) (size 0.2 1.5) (layers F.Cu F.Paste F.Mask))
  (pad 38 smd rect (at 7.708 -1.064) (size 0.2 1.5) (layers F.Cu F.Paste F.Mask))
  (pad 39 smd rect (at 8.108 -4.064) (size 0.2 1.5) (layers F.Cu F.Paste F.Mask))
  (pad 40 smd rect (at 8.108 -1.064) (size 0.2 1.5) (layers F.Cu F.Paste F.Mask))
  (pad 41 smd rect (at 8.508 -4.064) (size 0.2 1.5) (layers F.Cu F.Paste F.Mask))
  (pad 42 smd rect (at 8.508 -1.064) (size 0.2 1.5) (layers F.Cu F.Paste F.Mask))
  (pad 43 smd rect (at 8.908 -4.064) (size 0.2 1.5) (layers F.Cu F.Paste F.Mask))
  (pad 44 smd rect (at 8.908 -1.064) (size 0.2 1.5) (layers F.Cu F.Paste F.Mask))
  (pad 45 smd rect (at 9.308 -4.064) (size 0.2 1.5) (layers F.Cu F.Paste F.Mask))
  (pad 46 smd rect (at 9.308 -1.064) (size 0.2 1.5) (layers F.Cu F.Paste F.Mask))
  (pad 47 smd rect (at 9.708 -4.064) (size 0.2 1.5) (layers F.Cu F.Paste F.Mask))
  (pad 48 smd rect (at 9.708 -1.064) (size 0.2 1.5) (layers F.Cu F.Paste F.Mask))
  (pad 49 smd rect (at 10.108 -4.064) (size 0.2 1.5) (layers F.Cu F.Paste F.Mask))
  (pad 50 smd rect (at 10.108 -1.064) (size 0.2 1.5) (layers F.Cu F.Paste F.Mask))
  (pad 51 smd rect (at 10.508 -4.064) (size 0.2 1.5) (layers F.Cu F.Paste F.Mask))
  (pad 52 smd rect (at 10.508 -1.064) (size 0.2 1.5) (layers F.Cu F.Paste F.Mask))
  (pad 53 smd rect (at 10.908 -4.064) (size 0.2 1.5) (layers F.Cu F.Paste F.Mask))
  (pad 54 smd rect (at 10.908 -1.064) (size 0.2 1.5) (layers F.Cu F.Paste F.Mask))
  (pad 55 smd rect (at 11.308 -4.064) (size 0.2 1.5) (layers F.Cu F.Paste F.Mask))
  (pad 56 smd rect (at 11.308 -1.064) (size 0.2 1.5) (layers F.Cu F.Paste F.Mask))
  (pad 57 smd rect (at 11.708 -4.064) (size 0.2 1.5) (layers F.Cu F.Paste F.Mask))
  (pad 58 smd rect (at 11.708 -1.064) (size 0.2 1.5) (layers F.Cu F.Paste F.Mask))
  (pad 59 smd rect (at 12.108 -4.064) (size 0.2 1.5) (layers F.Cu F.Paste F.Mask))
  (pad 60 smd rect (at 12.108 -1.064) (size 0.2 1.5) (layers F.Cu F.Paste F.Mask))
  (pad 61 smd rect (at 12.508 -4.064) (size 0.2 1.5) (layers F.Cu F.Paste F.Mask))
  (pad 62 smd rect (at 12.508 -1.064) (size 0.2 1.5) (layers F.Cu F.Paste F.Mask))
  (pad 63 smd rect (at 12.908 -4.064) (size 0.2 1.5) (layers F.Cu F.Paste F.Mask))
  (pad 64 smd rect (at 12.908 -1.064) (size 0.2 1.5) (layers F.Cu F.Paste F.Mask))
  (pad 65 smd rect (at 13.308 -4.064) (size 0.2 1.5) (layers F.Cu F.Paste F.Mask))
  (pad 66 smd rect (at 13.308 -1.064) (size 0.2 1.5) (layers F.Cu F.Paste F.Mask))
  (pad 67 smd rect (at 13.708 -4.064) (size 0.2 1.5) (layers F.Cu F.Paste F.Mask))
  (pad 68 smd rect (at 13.708 -1.064) (size 0.2 1.5) (layers F.Cu F.Paste F.Mask))
  (pad 69 smd rect (at 14.108 -4.064) (size 0.2 1.5) (layers F.Cu F.Paste F.Mask))
  (pad 70 smd rect (at 14.108 -1.064) (size 0.2 1.5) (layers F.Cu F.Paste F.Mask))
)
