EESchema Schematic File Version 4
EELAYER 30 0
EELAYER END
$Descr A4 11693 8268
encoding utf-8
Sheet 3 8
Title ""
Date ""
Rev ""
Comp ""
Comment1 ""
Comment2 ""
Comment3 ""
Comment4 ""
$EndDescr
$Comp
L SparkFun-Batteries:BATTERY-18650 BT0
U 1 1 5D9D0252
P 5200 6950
AR Path="/5D9D0252" Ref="BT0"  Part="1" 
AR Path="/5D953969/5D9D0252" Ref="BT0"  Part="1" 
F 0 "BT0" H 5200 7360 45  0000 C CNN
F 1 "BATTERY-18650" H 5200 7276 45  0000 C CNN
F 2 "Battery:BatteryHolder_Keystone_1042_1x18650" H 5200 7200 20  0001 C CNN
F 3 "" H 5200 6950 50  0001 C CNN
F 4 "BATT-12327" H 5200 7181 60  0000 C CNN "Field4"
F 5 "I" H 5200 6950 50  0001 C CNN "Spice_Primitive"
F 6 "dc 3.7" H 5200 6950 50  0001 C CNN "Spice_Model"
F 7 "Y" H 5200 6950 50  0001 C CNN "Spice_Netlist_Enabled"
	1    5200 6950
	1    0    0    -1  
$EndComp
$Comp
L power:GND #PWR0105
U 1 1 5D9F4E42
P 5500 7100
F 0 "#PWR0105" H 5500 6850 50  0001 C CNN
F 1 "GND" H 5505 6927 50  0000 C CNN
F 2 "" H 5500 7100 50  0001 C CNN
F 3 "" H 5500 7100 50  0001 C CNN
	1    5500 7100
	1    0    0    -1  
$EndComp
Wire Wire Line
	5400 6950 5500 6950
Wire Wire Line
	5500 6950 5500 7100
Wire Wire Line
	4800 6700 4800 6950
Wire Wire Line
	4800 6950 5000 6950
Text Notes 5100 7200 0    50   ~ 0
Battery
$Comp
L power:+BATT #PWR0106
U 1 1 5DCB6B81
P 4800 6700
F 0 "#PWR0106" H 4800 6550 50  0001 C CNN
F 1 "+BATT" H 4815 6873 50  0000 C CNN
F 2 "" H 4800 6700 50  0001 C CNN
F 3 "" H 4800 6700 50  0001 C CNN
	1    4800 6700
	1    0    0    -1  
$EndComp
$Comp
L power:+1V8 #PWR0126
U 1 1 5E2A8AFD
P 2050 6400
F 0 "#PWR0126" H 2050 6250 50  0001 C CNN
F 1 "+1V8" H 2065 6573 50  0000 C CNN
F 2 "" H 2050 6400 50  0001 C CNN
F 3 "" H 2050 6400 50  0001 C CNN
	1    2050 6400
	1    0    0    -1  
$EndComp
Wire Wire Line
	1850 6600 2050 6600
Wire Wire Line
	2050 6600 2050 6400
$Comp
L power:GND #PWR0127
U 1 1 5E2A8B05
P 1550 7000
F 0 "#PWR0127" H 1550 6750 50  0001 C CNN
F 1 "GND" H 1555 6827 50  0000 C CNN
F 2 "" H 1550 7000 50  0001 C CNN
F 3 "" H 1550 7000 50  0001 C CNN
	1    1550 7000
	1    0    0    -1  
$EndComp
Wire Wire Line
	1550 7000 1550 6950
Wire Wire Line
	1250 6600 1100 6600
$Comp
L Device:C_Small C1
U 1 1 5E2A8B14
P 1100 6700
F 0 "C1" H 1192 6746 50  0000 L CNN
F 1 "1uF" H 1192 6655 50  0000 L CNN
F 2 "Capacitor_SMD:C_0603_1608Metric_Pad1.05x0.95mm_HandSolder" H 1100 6700 50  0001 C CNN
F 3 "~" H 1100 6700 50  0001 C CNN
	1    1100 6700
	1    0    0    -1  
$EndComp
$Comp
L Device:C_Small C2
U 1 1 5E2A8B1B
P 2050 6700
F 0 "C2" H 2142 6746 50  0000 L CNN
F 1 "1uF" H 2142 6655 50  0000 L CNN
F 2 "Capacitor_SMD:C_0603_1608Metric_Pad1.05x0.95mm_HandSolder" H 2050 6700 50  0001 C CNN
F 3 "~" H 2050 6700 50  0001 C CNN
	1    2050 6700
	1    0    0    -1  
$EndComp
Connection ~ 2050 6600
Wire Wire Line
	2050 6800 2050 6950
Wire Wire Line
	2050 6950 1550 6950
Connection ~ 1550 6950
Wire Wire Line
	1550 6950 1550 6900
Wire Wire Line
	1100 6800 1100 6950
Wire Wire Line
	1100 6950 1550 6950
$Comp
L Regulator_Linear:MCP1700-1802E_SOT23 U2
U 1 1 5E2A8B28
P 1550 6600
F 0 "U2" H 1550 6842 50  0000 C CNN
F 1 "MCP1700-1802E_SOT23" H 1550 6751 50  0000 C CNN
F 2 "Package_TO_SOT_SMD:SOT-23" H 1550 6825 50  0001 C CNN
F 3 "http://ww1.microchip.com/downloads/en/DeviceDoc/20001826D.pdf" H 1550 6600 50  0001 C CNN
	1    1550 6600
	1    0    0    -1  
$EndComp
Wire Notes Line
	550  6000 550  7750
Wire Notes Line
	550  7750 2550 7750
Wire Notes Line
	2550 7750 2550 6000
Wire Notes Line
	2550 6000 550  6000
Text Notes 600  7700 0    50   ~ 0
1.8v Rail\n(Needed for DAC for Cellular Module)
Wire Notes Line
	2600 7750 2600 6000
Wire Notes Line
	2600 6000 4250 6000
Wire Notes Line
	4250 6000 4250 7750
Wire Notes Line
	4250 7750 2600 7750
Text Notes 2650 7700 0    50   ~ 0
Battery Management System
Wire Notes Line
	4300 6000 6250 6000
Wire Notes Line
	6250 6000 6250 7750
Wire Notes Line
	6250 7750 4300 7750
Wire Notes Line
	4300 7750 4300 6000
Text Notes 4350 7700 0    50   ~ 0
(18650) Battery \n(With built-in Protection)
$Comp
L power:+5V #PWR0156
U 1 1 5E295F32
P 1950 5550
F 0 "#PWR0156" H 1950 5400 50  0001 C CNN
F 1 "+5V" V 1965 5678 50  0000 L CNN
F 2 "" H 1950 5550 50  0001 C CNN
F 3 "" H 1950 5550 50  0001 C CNN
	1    1950 5550
	0    1    1    0   
$EndComp
$Comp
L power:GND #PWR0157
U 1 1 5E29699D
P 1950 5650
F 0 "#PWR0157" H 1950 5400 50  0001 C CNN
F 1 "GND" V 1955 5522 50  0000 R CNN
F 2 "" H 1950 5650 50  0001 C CNN
F 3 "" H 1950 5650 50  0001 C CNN
	1    1950 5650
	0    -1   -1   0   
$EndComp
$Comp
L power:+3.3V #PWR0158
U 1 1 5E2971F6
P 1950 5450
F 0 "#PWR0158" H 1950 5300 50  0001 C CNN
F 1 "+3.3V" V 1965 5578 50  0000 L CNN
F 2 "" H 1950 5450 50  0001 C CNN
F 3 "" H 1950 5450 50  0001 C CNN
	1    1950 5450
	0    1    1    0   
$EndComp
$Comp
L power:+1V8 #PWR0159
U 1 1 5E297ACF
P 1950 5350
F 0 "#PWR0159" H 1950 5200 50  0001 C CNN
F 1 "+1V8" V 1965 5478 50  0000 L CNN
F 2 "" H 1950 5350 50  0001 C CNN
F 3 "" H 1950 5350 50  0001 C CNN
	1    1950 5350
	0    1    1    0   
$EndComp
$Comp
L Connector:TestPoint TP8
U 1 1 5E29CF4A
P 1450 5250
F 0 "TP8" H 1508 5368 50  0000 L CNN
F 1 "1.8v" H 1508 5277 50  0000 L CNN
F 2 "TestPoint:TestPoint_Pad_D1.0mm" H 1650 5250 50  0001 C CNN
F 3 "~" H 1650 5250 50  0001 C CNN
	1    1450 5250
	1    0    0    -1  
$EndComp
$Comp
L Connector:TestPoint TP7
U 1 1 5E29DEFA
P 1250 5350
F 0 "TP7" H 1308 5468 50  0000 L CNN
F 1 "3.3v" H 1308 5377 50  0000 L CNN
F 2 "TestPoint:TestPoint_Pad_D1.0mm" H 1450 5350 50  0001 C CNN
F 3 "~" H 1450 5350 50  0001 C CNN
	1    1250 5350
	1    0    0    -1  
$EndComp
$Comp
L Connector:TestPoint TP6
U 1 1 5E29E5E6
P 1050 5450
F 0 "TP6" H 1108 5568 50  0000 L CNN
F 1 "5v" H 1108 5477 50  0000 L CNN
F 2 "TestPoint:TestPoint_Pad_D1.0mm" H 1250 5450 50  0001 C CNN
F 3 "~" H 1250 5450 50  0001 C CNN
	1    1050 5450
	1    0    0    -1  
$EndComp
$Comp
L Connector:TestPoint TP5
U 1 1 5E29F821
P 850 5550
F 0 "TP5" H 908 5668 50  0000 L CNN
F 1 "GND" H 908 5577 50  0000 L CNN
F 2 "TestPoint:TestPoint_Pad_D1.0mm" H 1050 5550 50  0001 C CNN
F 3 "~" H 1050 5550 50  0001 C CNN
	1    850  5550
	1    0    0    -1  
$EndComp
Wire Wire Line
	1450 5350 1450 5250
Wire Wire Line
	1450 5350 1950 5350
Wire Wire Line
	1950 5450 1250 5450
Wire Wire Line
	1250 5450 1250 5350
Wire Wire Line
	1950 5550 1050 5550
Wire Wire Line
	1050 5550 1050 5450
Wire Wire Line
	1950 5650 850  5650
Wire Wire Line
	850  5650 850  5550
Wire Notes Line
	550  5950 2550 5950
Wire Notes Line
	2550 5950 2550 4950
Wire Notes Line
	2550 4950 550  4950
Wire Notes Line
	550  4950 550  5950
Text Notes 600  5900 0    50   ~ 0
Voltage Test Points
$Comp
L MainPCB:Adafruit_Powerboost_1000C J4
U 1 1 5E1F4758
P 3100 6750
F 0 "J4" H 3183 7275 50  0000 C CNN
F 1 "Adafruit_Powerboost_1000C" H 3183 7184 50  0000 C CNN
F 2 "PCB:AdafruitPowerboost1000WithMounting" H 3100 6750 50  0001 C CNN
F 3 "https://www.adafruit.com/product/2465" H 3100 6750 50  0001 C CNN
	1    3100 6750
	1    0    0    -1  
$EndComp
$Comp
L SparkFun-PowerSymbols:V_USB #SUPPLY0101
U 1 1 5E1F55F9
P 3800 6350
F 0 "#SUPPLY0101" H 3850 6350 45  0001 L BNN
F 1 "V_USB" H 3800 6626 45  0000 C CNN
F 2 "XXX-00000" H 3800 6531 60  0000 C CNN
F 3 "" H 3800 6350 60  0001 C CNN
	1    3800 6350
	1    0    0    -1  
$EndComp
$Comp
L power:+BATT #PWR0107
U 1 1 5E1F5F4A
P 3950 6500
F 0 "#PWR0107" H 3950 6350 50  0001 C CNN
F 1 "+BATT" H 3965 6673 50  0000 C CNN
F 2 "" H 3950 6500 50  0001 C CNN
F 3 "" H 3950 6500 50  0001 C CNN
	1    3950 6500
	1    0    0    -1  
$EndComp
Wire Wire Line
	3350 6450 3800 6450
Wire Wire Line
	3800 6450 3800 6350
Wire Wire Line
	3350 6550 3950 6550
Wire Wire Line
	3950 6550 3950 6500
NoConn ~ 3350 6650
NoConn ~ 3350 6750
$Comp
L power:GND #PWR0108
U 1 1 5E1F80F9
P 3450 7050
F 0 "#PWR0108" H 3450 6800 50  0001 C CNN
F 1 "GND" V 3455 6922 50  0000 R CNN
F 2 "" H 3450 7050 50  0001 C CNN
F 3 "" H 3450 7050 50  0001 C CNN
	1    3450 7050
	0    -1   -1   0   
$EndComp
$Comp
L power:+5V #PWR0109
U 1 1 5E1F8AA1
P 3600 7150
F 0 "#PWR0109" H 3600 7000 50  0001 C CNN
F 1 "+5V" V 3615 7278 50  0000 L CNN
F 2 "" H 3600 7150 50  0001 C CNN
F 3 "" H 3600 7150 50  0001 C CNN
	1    3600 7150
	0    1    1    0   
$EndComp
Wire Wire Line
	3600 7150 3350 7150
Wire Wire Line
	3350 7050 3450 7050
Wire Wire Line
	3350 6850 3450 6850
NoConn ~ 3350 6950
$Comp
L power:GND #PWR0169
U 1 1 5E333348
P 3450 6850
F 0 "#PWR0169" H 3450 6600 50  0001 C CNN
F 1 "GND" V 3455 6722 50  0000 R CNN
F 2 "" H 3450 6850 50  0001 C CNN
F 3 "" H 3450 6850 50  0001 C CNN
	1    3450 6850
	0    -1   -1   0   
$EndComp
$Comp
L Regulator_Linear:MCP1700-3302E_SOT23 U9
U 1 1 5ECDAEFC
P 3400 5350
F 0 "U9" H 3400 5592 50  0000 C CNN
F 1 "MCP1700-3302E_SOT23" H 3400 5501 50  0000 C CNN
F 2 "Package_TO_SOT_SMD:SOT-23" H 3400 5575 50  0001 C CNN
F 3 "http://ww1.microchip.com/downloads/en/DeviceDoc/20001826D.pdf" H 3400 5350 50  0001 C CNN
	1    3400 5350
	1    0    0    -1  
$EndComp
Wire Wire Line
	3700 5350 3900 5350
Wire Wire Line
	3900 5350 3900 5150
$Comp
L power:GND #PWR011
U 1 1 5ECE102F
P 3400 5750
F 0 "#PWR011" H 3400 5500 50  0001 C CNN
F 1 "GND" H 3405 5577 50  0000 C CNN
F 2 "" H 3400 5750 50  0001 C CNN
F 3 "" H 3400 5750 50  0001 C CNN
	1    3400 5750
	1    0    0    -1  
$EndComp
Wire Wire Line
	3400 5750 3400 5700
Wire Wire Line
	3100 5350 2950 5350
Wire Wire Line
	2950 5350 2950 5250
$Comp
L Device:C_Small C9
U 1 1 5ECE103E
P 2950 5450
F 0 "C9" H 3042 5496 50  0000 L CNN
F 1 "1uF" H 3042 5405 50  0000 L CNN
F 2 "Capacitor_SMD:C_0603_1608Metric_Pad1.05x0.95mm_HandSolder" H 2950 5450 50  0001 C CNN
F 3 "~" H 2950 5450 50  0001 C CNN
	1    2950 5450
	1    0    0    -1  
$EndComp
Connection ~ 2950 5350
$Comp
L Device:C_Small C10
U 1 1 5ECE1045
P 3900 5450
F 0 "C10" H 3992 5496 50  0000 L CNN
F 1 "1uF" H 3992 5405 50  0000 L CNN
F 2 "Capacitor_SMD:C_0603_1608Metric_Pad1.05x0.95mm_HandSolder" H 3900 5450 50  0001 C CNN
F 3 "~" H 3900 5450 50  0001 C CNN
	1    3900 5450
	1    0    0    -1  
$EndComp
Connection ~ 3900 5350
Wire Wire Line
	3900 5550 3900 5700
Wire Wire Line
	3900 5700 3400 5700
Connection ~ 3400 5700
Wire Wire Line
	3400 5700 3400 5650
Wire Wire Line
	2950 5550 2950 5700
Wire Wire Line
	2950 5700 3400 5700
$Comp
L power:+5V #PWR09
U 1 1 5ECE543D
P 1100 6400
F 0 "#PWR09" H 1100 6250 50  0001 C CNN
F 1 "+5V" H 1115 6573 50  0000 C CNN
F 2 "" H 1100 6400 50  0001 C CNN
F 3 "" H 1100 6400 50  0001 C CNN
	1    1100 6400
	1    0    0    -1  
$EndComp
Wire Wire Line
	1100 6600 1100 6400
Connection ~ 1100 6600
$Comp
L power:+5V #PWR010
U 1 1 5ECF0B6E
P 2950 5250
F 0 "#PWR010" H 2950 5100 50  0001 C CNN
F 1 "+5V" H 2965 5423 50  0000 C CNN
F 2 "" H 2950 5250 50  0001 C CNN
F 3 "" H 2950 5250 50  0001 C CNN
	1    2950 5250
	1    0    0    -1  
$EndComp
$Comp
L power:+3V3 #PWR012
U 1 1 5ECF11BB
P 3900 5150
F 0 "#PWR012" H 3900 5000 50  0001 C CNN
F 1 "+3V3" H 3915 5323 50  0000 C CNN
F 2 "" H 3900 5150 50  0001 C CNN
F 3 "" H 3900 5150 50  0001 C CNN
	1    3900 5150
	1    0    0    -1  
$EndComp
Text Notes 2650 5900 0    50   ~ 0
3.3v Rail
Wire Notes Line
	2600 5950 4250 5950
Wire Notes Line
	4250 5950 4250 4950
Wire Notes Line
	4250 4950 2600 4950
Wire Notes Line
	2600 4950 2600 5950
$EndSCHEMATC
