%!PS-Adobe-3.0
%%Creator: PCBNEW
%%CreationDate: Wed Jun 19 14:20:52 2019
%%Title: /home/core2idiot/Projects/SeniorProject/Electrical Design/lcd-devkit-adapter/lcd-devkit-adapter/Rendered/lcd-devkit-adapter-NPTH-drl_map.ps
%%Pages: 1
%%PageOrder: Ascend
%%BoundingBox: 0 0 596 842
%%DocumentMedia: A4 595 842 0 () ()
%%Orientation: Landscape
%%EndComments
%%BeginProlog
/line { newpath moveto lineto stroke } bind def
/cir0 { newpath 0 360 arc stroke } bind def
/cir1 { newpath 0 360 arc gsave fill grestore stroke } bind def
/cir2 { newpath 0 360 arc gsave fill grestore stroke } bind def
/arc0 { newpath arc stroke } bind def
/arc1 { newpath 4 index 4 index moveto arc closepath gsave fill
    grestore stroke } bind def
/arc2 { newpath 4 index 4 index moveto arc closepath gsave fill
    grestore stroke } bind def
/poly0 { stroke } bind def
/poly1 { closepath gsave fill grestore stroke } bind def
/poly2 { closepath gsave fill grestore stroke } bind def
/rect0 { rectstroke } bind def
/rect1 { rectfill } bind def
/rect2 { rectfill } bind def
/linemode0 { 0 setlinecap 0 setlinejoin 0 setlinewidth } bind def
/linemode1 { 1 setlinecap 1 setlinejoin } bind def
/dashedline { [200] 100 setdash } bind def
/solidline { [] 0 setdash } bind def
/phantomshow { moveto
    /KicadFont findfont 0.000001 scalefont setfont
    show } bind def
/textshow { gsave
    findfont exch scalefont setfont concat 1 scale 0 0 moveto show
    } bind def
/reencodefont {
  findfont dup length dict begin
  { 1 index /FID ne
    { def }
    { pop pop } ifelse
  } forall
  /Encoding ISOLatin1Encoding def
  currentdict
  end } bind def
/KicadFont /Helvetica reencodefont definefont pop
/KicadFont-Bold /Helvetica-Bold reencodefont definefont pop
/KicadFont-Oblique /Helvetica-Oblique reencodefont definefont pop
/KicadFont-BoldOblique /Helvetica-BoldOblique reencodefont definefont pop
%%EndProlog
%%Page: 1 1
%%BeginPageSetup
gsave
0.0072 0.0072 scale
linemode1
82680 0 translate 90 rotate
132.744 setlinewidth
%%EndPageSetup
0 0 0 setrgbcolor
52.2615 setlinewidth
newpath
28597.5 37035.1 moveto
28597.5 78716.9 lineto
stroke
0 0 0 setrgbcolor
newpath
88332.5 37035.1 moveto
28597.5 37035.1 lineto
stroke
0 0 0 setrgbcolor
newpath
88332.5 78716.9 moveto
88332.5 37035.1 lineto
stroke
0 0 0 setrgbcolor
newpath
28597.5 78716.9 moveto
88332.5 78716.9 lineto
stroke
78.7393 setlinewidth
118.11 setlinewidth
0 0 0 setrgbcolor
0 0 0 setrgbcolor
newpath
29699.1 35175.5 moveto
29699.1 36356.6 lineto
29980.3 36356.6 lineto
30149 36300.3 lineto
30261.5 36187.9 lineto
30317.7 36075.4 lineto
30374 35850.4 lineto
30374 35681.7 lineto
30317.7 35456.7 lineto
30261.5 35344.2 lineto
30149 35231.7 lineto
29980.3 35175.5 lineto
29699.1 35175.5 lineto
stroke
newpath
30880.2 35175.5 moveto
30880.2 35962.9 lineto
stroke
newpath
30880.2 35737.9 moveto
30936.4 35850.4 lineto
30992.7 35906.6 lineto
31105.1 35962.9 lineto
31217.6 35962.9 lineto
stroke
newpath
31611.3 35175.5 moveto
31611.3 35962.9 lineto
stroke
newpath
31611.3 36356.6 moveto
31555.1 36300.3 lineto
31611.3 36244.1 lineto
31667.6 36300.3 lineto
31611.3 36356.6 lineto
31611.3 36244.1 lineto
stroke
newpath
32342.5 35175.5 moveto
32230 35231.7 lineto
32173.8 35344.2 lineto
32173.8 36356.6 lineto
stroke
newpath
32961.2 35175.5 moveto
32848.7 35231.7 lineto
32792.4 35344.2 lineto
32792.4 36356.6 lineto
stroke
newpath
34311 35175.5 moveto
34311 36356.6 lineto
34704.7 35512.9 lineto
35098.4 36356.6 lineto
35098.4 35175.5 lineto
stroke
newpath
36167 35175.5 moveto
36167 35794.2 lineto
36110.8 35906.6 lineto
35998.3 35962.9 lineto
35773.3 35962.9 lineto
35660.8 35906.6 lineto
stroke
newpath
36167 35231.7 moveto
36054.5 35175.5 lineto
35773.3 35175.5 lineto
35660.8 35231.7 lineto
35604.6 35344.2 lineto
35604.6 35456.7 lineto
35660.8 35569.2 lineto
35773.3 35625.4 lineto
36054.5 35625.4 lineto
36167 35681.7 lineto
stroke
newpath
36729.4 35962.9 moveto
36729.4 34781.8 lineto
stroke
newpath
36729.4 35906.6 moveto
36841.9 35962.9 lineto
37066.9 35962.9 lineto
37179.4 35906.6 lineto
37235.6 35850.4 lineto
37291.9 35737.9 lineto
37291.9 35400.5 lineto
37235.6 35288 lineto
37179.4 35231.7 lineto
37066.9 35175.5 lineto
36841.9 35175.5 lineto
36729.4 35231.7 lineto
stroke
newpath
37798.1 35288 moveto
37854.3 35231.7 lineto
37798.1 35175.5 lineto
37741.8 35231.7 lineto
37798.1 35288 lineto
37798.1 35175.5 lineto
stroke
newpath
37798.1 35906.6 moveto
37854.3 35850.4 lineto
37798.1 35794.2 lineto
37741.8 35850.4 lineto
37798.1 35906.6 lineto
37798.1 35794.2 lineto
stroke
showpage
grestore
%%EOF
