(export (version D)
  (design
    (source "/home/core2idiot/Projects/SeniorProject/Electrical Design/lcd-devkit-adapter/lcd-devkit-adapter/lcd-devkit-adapter.sch")
    (date "Mon 17 Jun 2019 07:29:54 PM PDT")
    (tool "Eeschema 5.1.2")
    (sheet (number 1) (name /) (tstamps /)
      (title_block
        (title)
        (company)
        (rev)
        (date)
        (source lcd-devkit-adapter.sch)
        (comment (number 1) (value ""))
        (comment (number 2) (value ""))
        (comment (number 3) (value ""))
        (comment (number 4) (value "")))))
  (components
    (comp (ref J1)
      (value LCD)
      (footprint lcd-devkit-adapter:FPC_30)
      (datasheet ~)
      (libsource (lib Connector_Generic) (part Conn_01x30) (description "Generic connector, single row, 01x30, script generated (kicad-library-utils/schlib/autogen/connector/)"))
      (sheetpath (names /) (tstamps /))
      (tstamp 5D06FE6F))
    (comp (ref J2)
      (value "Hummingbird Pulse J24")
      (footprint lcd-devkit-adapter:FPC_22)
      (datasheet ~)
      (libsource (lib Connector_Generic) (part Conn_01x22) (description "Generic connector, single row, 01x22, script generated (kicad-library-utils/schlib/autogen/connector/)"))
      (sheetpath (names /) (tstamps /))
      (tstamp 5D0759DA))
    (comp (ref J4)
      (value LCD_MISC)
      (footprint Connector_PinSocket_2.54mm:PinSocket_1x04_P2.54mm_Vertical)
      (datasheet ~)
      (libsource (lib Connector) (part Conn_01x04_Male) (description "Generic connector, single row, 01x04, script generated (kicad-library-utils/schlib/autogen/connector/)"))
      (sheetpath (names /) (tstamps /))
      (tstamp 5D0CEE97))
    (comp (ref TP0)
      (value CLK_N)
      (footprint TestPoint:TestPoint_Pad_2.0x2.0mm)
      (datasheet ~)
      (libsource (lib Connector) (part TestPoint) (description "test point"))
      (sheetpath (names /) (tstamps /))
      (tstamp 5D0890A6))
    (comp (ref TP1)
      (value CLK_P)
      (footprint TestPoint:TestPoint_Pad_2.0x2.0mm)
      (datasheet ~)
      (libsource (lib Connector) (part TestPoint) (description "test point"))
      (sheetpath (names /) (tstamps /))
      (tstamp 5D08BE19))
    (comp (ref TP2)
      (value D1_P)
      (footprint TestPoint:TestPoint_Pad_2.0x2.0mm)
      (datasheet ~)
      (libsource (lib Connector) (part TestPoint) (description "test point"))
      (sheetpath (names /) (tstamps /))
      (tstamp 5D08C730))
    (comp (ref TP4)
      (value D0_N)
      (footprint TestPoint:TestPoint_Pad_2.0x2.0mm)
      (datasheet ~)
      (libsource (lib Connector) (part TestPoint) (description "test point"))
      (sheetpath (names /) (tstamps /))
      (tstamp 5D08C376))
    (comp (ref J3)
      (value Power)
      (footprint Connector_PinSocket_2.54mm:PinSocket_1x04_P2.54mm_Vertical)
      (datasheet ~)
      (libsource (lib Connector) (part Conn_01x04_Male) (description "Generic connector, single row, 01x04, script generated (kicad-library-utils/schlib/autogen/connector/)"))
      (sheetpath (names /) (tstamps /))
      (tstamp 5D074FD4))
    (comp (ref TP3)
      (value D1_N)
      (footprint TestPoint:TestPoint_Pad_2.0x2.0mm)
      (datasheet ~)
      (libsource (lib Connector) (part TestPoint) (description "test point"))
      (sheetpath (names /) (tstamps /))
      (tstamp 5D09101B))
    (comp (ref TP5)
      (value D0_P)
      (footprint TestPoint:TestPoint_Pad_2.0x2.0mm)
      (datasheet ~)
      (libsource (lib Connector) (part TestPoint) (description "test point"))
      (sheetpath (names /) (tstamps /))
      (tstamp 5D0A45BA)))
  (libparts
    (libpart (lib Connector) (part Conn_01x04_Male)
      (description "Generic connector, single row, 01x04, script generated (kicad-library-utils/schlib/autogen/connector/)")
      (docs ~)
      (footprints
        (fp Connector*:*_1x??_*))
      (fields
        (field (name Reference) J)
        (field (name Value) Conn_01x04_Male))
      (pins
        (pin (num 1) (name Pin_1) (type passive))
        (pin (num 2) (name Pin_2) (type passive))
        (pin (num 3) (name Pin_3) (type passive))
        (pin (num 4) (name Pin_4) (type passive))))
    (libpart (lib Connector) (part TestPoint)
      (description "test point")
      (docs ~)
      (footprints
        (fp Pin*)
        (fp Test*))
      (fields
        (field (name Reference) TP)
        (field (name Value) TestPoint))
      (pins
        (pin (num 1) (name 1) (type passive))))
    (libpart (lib Connector_Generic) (part Conn_01x22)
      (description "Generic connector, single row, 01x22, script generated (kicad-library-utils/schlib/autogen/connector/)")
      (docs ~)
      (footprints
        (fp Connector*:*_1x??_*))
      (fields
        (field (name Reference) J)
        (field (name Value) Conn_01x22))
      (pins
        (pin (num 1) (name Pin_1) (type passive))
        (pin (num 2) (name Pin_2) (type passive))
        (pin (num 3) (name Pin_3) (type passive))
        (pin (num 4) (name Pin_4) (type passive))
        (pin (num 5) (name Pin_5) (type passive))
        (pin (num 6) (name Pin_6) (type passive))
        (pin (num 7) (name Pin_7) (type passive))
        (pin (num 8) (name Pin_8) (type passive))
        (pin (num 9) (name Pin_9) (type passive))
        (pin (num 10) (name Pin_10) (type passive))
        (pin (num 11) (name Pin_11) (type passive))
        (pin (num 12) (name Pin_12) (type passive))
        (pin (num 13) (name Pin_13) (type passive))
        (pin (num 14) (name Pin_14) (type passive))
        (pin (num 15) (name Pin_15) (type passive))
        (pin (num 16) (name Pin_16) (type passive))
        (pin (num 17) (name Pin_17) (type passive))
        (pin (num 18) (name Pin_18) (type passive))
        (pin (num 19) (name Pin_19) (type passive))
        (pin (num 20) (name Pin_20) (type passive))
        (pin (num 21) (name Pin_21) (type passive))
        (pin (num 22) (name Pin_22) (type passive))))
    (libpart (lib Connector_Generic) (part Conn_01x30)
      (description "Generic connector, single row, 01x30, script generated (kicad-library-utils/schlib/autogen/connector/)")
      (docs ~)
      (footprints
        (fp Connector*:*_1x??_*))
      (fields
        (field (name Reference) J)
        (field (name Value) Conn_01x30))
      (pins
        (pin (num 1) (name Pin_1) (type passive))
        (pin (num 2) (name Pin_2) (type passive))
        (pin (num 3) (name Pin_3) (type passive))
        (pin (num 4) (name Pin_4) (type passive))
        (pin (num 5) (name Pin_5) (type passive))
        (pin (num 6) (name Pin_6) (type passive))
        (pin (num 7) (name Pin_7) (type passive))
        (pin (num 8) (name Pin_8) (type passive))
        (pin (num 9) (name Pin_9) (type passive))
        (pin (num 10) (name Pin_10) (type passive))
        (pin (num 11) (name Pin_11) (type passive))
        (pin (num 12) (name Pin_12) (type passive))
        (pin (num 13) (name Pin_13) (type passive))
        (pin (num 14) (name Pin_14) (type passive))
        (pin (num 15) (name Pin_15) (type passive))
        (pin (num 16) (name Pin_16) (type passive))
        (pin (num 17) (name Pin_17) (type passive))
        (pin (num 18) (name Pin_18) (type passive))
        (pin (num 19) (name Pin_19) (type passive))
        (pin (num 20) (name Pin_20) (type passive))
        (pin (num 21) (name Pin_21) (type passive))
        (pin (num 22) (name Pin_22) (type passive))
        (pin (num 23) (name Pin_23) (type passive))
        (pin (num 24) (name Pin_24) (type passive))
        (pin (num 25) (name Pin_25) (type passive))
        (pin (num 26) (name Pin_26) (type passive))
        (pin (num 27) (name Pin_27) (type passive))
        (pin (num 28) (name Pin_28) (type passive))
        (pin (num 29) (name Pin_29) (type passive))
        (pin (num 30) (name Pin_30) (type passive)))))
  (libraries
    (library (logical Connector)
      (uri /usr/share/kicad/library/Connector.lib))
    (library (logical Connector_Generic)
      (uri /usr/share/kicad/library/Connector_Generic.lib)))
  (nets
    (net (code 1) (name GND)
      (node (ref J1) (pin 23))
      (node (ref J1) (pin 24))
      (node (ref J3) (pin 4))
      (node (ref J1) (pin 25))
      (node (ref J1) (pin 22))
      (node (ref J3) (pin 2))
      (node (ref J2) (pin 10))
      (node (ref J1) (pin 4))
      (node (ref J1) (pin 5))
      (node (ref J1) (pin 8))
      (node (ref J2) (pin 13))
      (node (ref J2) (pin 16))
      (node (ref J2) (pin 19))
      (node (ref J2) (pin 22))
      (node (ref J1) (pin 11))
      (node (ref J1) (pin 14))
      (node (ref J1) (pin 17))
      (node (ref J1) (pin 21)))
    (net (code 2) (name +3V3)
      (node (ref J1) (pin 2))
      (node (ref J1) (pin 20))
      (node (ref J1) (pin 1))
      (node (ref J3) (pin 3)))
    (net (code 3) (name "Net-(J2-Pad12)")
      (node (ref J2) (pin 12)))
    (net (code 4) (name +5V)
      (node (ref J2) (pin 1))
      (node (ref J2) (pin 4))
      (node (ref J2) (pin 7))
      (node (ref J3) (pin 1)))
    (net (code 5) (name "Net-(J2-Pad2)")
      (node (ref J2) (pin 2)))
    (net (code 6) (name "Net-(J2-Pad6)")
      (node (ref J2) (pin 6)))
    (net (code 7) (name LED_A)
      (node (ref J1) (pin 26))
      (node (ref J4) (pin 3)))
    (net (code 8) (name LED_K)
      (node (ref J1) (pin 28))
      (node (ref J4) (pin 4)))
    (net (code 9) (name /DSI2)
      (node (ref J2) (pin 11)))
    (net (code 10) (name "Net-(J2-Pad9)")
      (node (ref J2) (pin 9)))
    (net (code 11) (name /DSI3)
      (node (ref J2) (pin 8)))
    (net (code 12) (name "Net-(J2-Pad5)")
      (node (ref J2) (pin 5)))
    (net (code 13) (name "Net-(J2-Pad3)")
      (node (ref J2) (pin 3)))
    (net (code 14) (name CLK_N)
      (node (ref J2) (pin 14))
      (node (ref TP0) (pin 1))
      (node (ref J1) (pin 13)))
    (net (code 15) (name TE)
      (node (ref J1) (pin 6))
      (node (ref J4) (pin 2)))
    (net (code 16) (name RESET)
      (node (ref J4) (pin 1))
      (node (ref J1) (pin 7)))
    (net (code 17) (name "Net-(J1-Pad30)")
      (node (ref J1) (pin 30)))
    (net (code 18) (name CLK_P)
      (node (ref J1) (pin 12))
      (node (ref J2) (pin 15))
      (node (ref TP1) (pin 1)))
    (net (code 19) (name D1_P)
      (node (ref J2) (pin 17))
      (node (ref TP2) (pin 1))
      (node (ref J1) (pin 9)))
    (net (code 20) (name D1_N)
      (node (ref TP3) (pin 1))
      (node (ref J2) (pin 18))
      (node (ref J1) (pin 10)))
    (net (code 21) (name D0_N)
      (node (ref TP4) (pin 1))
      (node (ref J1) (pin 16))
      (node (ref J2) (pin 20)))
    (net (code 22) (name D0_P)
      (node (ref J1) (pin 15))
      (node (ref TP5) (pin 1))
      (node (ref J2) (pin 21)))
    (net (code 23) (name "Net-(J1-Pad18)")
      (node (ref J1) (pin 18)))
    (net (code 24) (name "Net-(J1-Pad19)")
      (node (ref J1) (pin 19)))
    (net (code 25) (name "Net-(J1-Pad27)")
      (node (ref J1) (pin 27)))
    (net (code 26) (name "Net-(J1-Pad29)")
      (node (ref J1) (pin 29)))
    (net (code 27) (name "Net-(J1-Pad3)")
      (node (ref J1) (pin 3)))))