%!PS-Adobe-3.0
%%Creator: PCBNEW
%%CreationDate: Wed Jun 19 14:20:52 2019
%%Title: /home/core2idiot/Projects/SeniorProject/Electrical Design/lcd-devkit-adapter/lcd-devkit-adapter/Rendered/lcd-devkit-adapter-PTH-drl_map.ps
%%Pages: 1
%%PageOrder: Ascend
%%BoundingBox: 0 0 596 842
%%DocumentMedia: A4 595 842 0 () ()
%%Orientation: Landscape
%%EndComments
%%BeginProlog
/line { newpath moveto lineto stroke } bind def
/cir0 { newpath 0 360 arc stroke } bind def
/cir1 { newpath 0 360 arc gsave fill grestore stroke } bind def
/cir2 { newpath 0 360 arc gsave fill grestore stroke } bind def
/arc0 { newpath arc stroke } bind def
/arc1 { newpath 4 index 4 index moveto arc closepath gsave fill
    grestore stroke } bind def
/arc2 { newpath 4 index 4 index moveto arc closepath gsave fill
    grestore stroke } bind def
/poly0 { stroke } bind def
/poly1 { closepath gsave fill grestore stroke } bind def
/poly2 { closepath gsave fill grestore stroke } bind def
/rect0 { rectstroke } bind def
/rect1 { rectfill } bind def
/rect2 { rectfill } bind def
/linemode0 { 0 setlinecap 0 setlinejoin 0 setlinewidth } bind def
/linemode1 { 1 setlinecap 1 setlinejoin } bind def
/dashedline { [200] 100 setdash } bind def
/solidline { [] 0 setdash } bind def
/phantomshow { moveto
    /KicadFont findfont 0.000001 scalefont setfont
    show } bind def
/textshow { gsave
    findfont exch scalefont setfont concat 1 scale 0 0 moveto show
    } bind def
/reencodefont {
  findfont dup length dict begin
  { 1 index /FID ne
    { def }
    { pop pop } ifelse
  } forall
  /Encoding ISOLatin1Encoding def
  currentdict
  end } bind def
/KicadFont /Helvetica reencodefont definefont pop
/KicadFont-Bold /Helvetica-Bold reencodefont definefont pop
/KicadFont-Oblique /Helvetica-Oblique reencodefont definefont pop
/KicadFont-BoldOblique /Helvetica-BoldOblique reencodefont definefont pop
%%EndProlog
%%Page: 1 1
%%BeginPageSetup
gsave
0.0072 0.0072 scale
linemode1
82680 0 translate 90 rotate
132.744 setlinewidth
%%EndPageSetup
0 0 0 setrgbcolor
52.2615 setlinewidth
newpath
28597.5 37035.1 moveto
28597.5 78716.9 lineto
stroke
0 0 0 setrgbcolor
newpath
88332.5 37035.1 moveto
28597.5 37035.1 lineto
stroke
0 0 0 setrgbcolor
newpath
88332.5 78716.9 moveto
88332.5 37035.1 lineto
stroke
0 0 0 setrgbcolor
newpath
28597.5 78716.9 moveto
88332.5 78716.9 lineto
stroke
78.7393 setlinewidth
newpath
29041.7 37897.5 moveto
29459.8 37479.4 lineto
stroke
newpath
29459.8 37897.5 moveto
29041.7 37479.4 lineto
stroke
newpath
30777.9 62200.1 moveto
31196 61782 lineto
stroke
newpath
31196 62200.1 moveto
30777.9 61782 lineto
stroke
newpath
37415.1 58748.8 moveto
37833.2 58330.7 lineto
stroke
newpath
37833.2 58748.8 moveto
37415.1 58330.7 lineto
stroke
newpath
37623.2 57478.7 moveto
38041.3 57060.6 lineto
stroke
newpath
38041.3 57478.7 moveto
37623.2 57060.6 lineto
stroke
newpath
37641.9 53399.6 moveto
38060 52981.5 lineto
stroke
newpath
38060 53399.6 moveto
37641.9 52981.5 lineto
stroke
newpath
37641.9 52354.3 moveto
38060 51936.2 lineto
stroke
newpath
38060 52354.3 moveto
37641.9 51936.2 lineto
stroke
newpath
41687.3 53034.2 moveto
42105.4 52616.1 lineto
stroke
newpath
42105.4 53034.2 moveto
41687.3 52616.1 lineto
stroke
newpath
41687.3 53034.2 moveto
42105.4 52616.1 lineto
stroke
newpath
42105.4 53034.2 moveto
41687.3 52616.1 lineto
stroke
newpath
42193.9 38040.7 moveto
42612 37622.6 lineto
stroke
newpath
42612 38040.7 moveto
42193.9 37622.6 lineto
stroke
newpath
42691.3 72353.5 moveto
43109.4 71935.4 lineto
stroke
newpath
43109.4 72353.5 moveto
42691.3 71935.4 lineto
stroke
newpath
43127.8 70203.4 moveto
43545.9 69785.4 lineto
stroke
newpath
43545.9 70203.4 moveto
43127.8 69785.4 lineto
stroke
newpath
43786.8 52377 moveto
44204.9 51958.9 lineto
stroke
newpath
44204.9 52377 moveto
43786.8 51958.9 lineto
stroke
newpath
47105.8 47569.6 moveto
47523.9 47151.5 lineto
stroke
newpath
47523.9 47569.6 moveto
47105.8 47151.5 lineto
stroke
newpath
47576.8 49922.8 moveto
47994.9 49504.8 lineto
stroke
newpath
47994.9 49922.8 moveto
47576.8 49504.8 lineto
stroke
newpath
57592.2 68024.2 moveto
58010.3 67606.1 lineto
stroke
newpath
58010.3 68024.2 moveto
57592.2 67606.1 lineto
stroke
newpath
57592.2 66978.9 moveto
58010.3 66560.8 lineto
stroke
newpath
58010.3 66978.9 moveto
57592.2 66560.8 lineto
stroke
newpath
57592.2 66978.9 moveto
58010.3 66560.8 lineto
stroke
newpath
58010.3 66978.9 moveto
57592.2 66560.8 lineto
stroke
newpath
58123.2 65120.5 moveto
58541.3 64702.4 lineto
stroke
newpath
58541.3 65120.5 moveto
58123.2 64702.4 lineto
stroke
newpath
59716.1 51846.1 moveto
60134.2 51428 lineto
stroke
newpath
60134.2 51846.1 moveto
59716.1 51428 lineto
stroke
newpath
61309.1 54500.9 moveto
61727.2 54082.9 lineto
stroke
newpath
61727.2 54500.9 moveto
61309.1 54082.9 lineto
stroke
newpath
66618.8 38571.6 moveto
67036.9 38153.5 lineto
stroke
newpath
67036.9 38571.6 moveto
66618.8 38153.5 lineto
stroke
newpath
77769.4 66182.4 moveto
78187.5 65764.3 lineto
stroke
newpath
78187.5 66182.4 moveto
77769.4 65764.3 lineto
stroke
newpath
78300.3 64589.5 moveto
78718.4 64171.4 lineto
stroke
newpath
78718.4 64589.5 moveto
78300.3 64171.4 lineto
stroke
33376.3 73407.1 522.615 cir0
33376.3 70752.2 522.615 cir0
33376.3 68097.3 522.615 cir0
33376.3 65442.4 522.615 cir0
33110.8 57743.3 522.615 cir0
33110.8 55088.4 522.615 cir0
33110.8 52433.5 522.615 cir0
33110.8 49778.6 522.615 cir0
118.11 setlinewidth
0 0 0 setrgbcolor
0 0 0 setrgbcolor
newpath
29699.1 35175.5 moveto
29699.1 36356.6 lineto
29980.3 36356.6 lineto
30149 36300.3 lineto
30261.5 36187.9 lineto
30317.7 36075.4 lineto
30374 35850.4 lineto
30374 35681.7 lineto
30317.7 35456.7 lineto
30261.5 35344.2 lineto
30149 35231.7 lineto
29980.3 35175.5 lineto
29699.1 35175.5 lineto
stroke
newpath
30880.2 35175.5 moveto
30880.2 35962.9 lineto
stroke
newpath
30880.2 35737.9 moveto
30936.4 35850.4 lineto
30992.7 35906.6 lineto
31105.1 35962.9 lineto
31217.6 35962.9 lineto
stroke
newpath
31611.3 35175.5 moveto
31611.3 35962.9 lineto
stroke
newpath
31611.3 36356.6 moveto
31555.1 36300.3 lineto
31611.3 36244.1 lineto
31667.6 36300.3 lineto
31611.3 36356.6 lineto
31611.3 36244.1 lineto
stroke
newpath
32342.5 35175.5 moveto
32230 35231.7 lineto
32173.8 35344.2 lineto
32173.8 36356.6 lineto
stroke
newpath
32961.2 35175.5 moveto
32848.7 35231.7 lineto
32792.4 35344.2 lineto
32792.4 36356.6 lineto
stroke
newpath
34311 35175.5 moveto
34311 36356.6 lineto
34704.7 35512.9 lineto
35098.4 36356.6 lineto
35098.4 35175.5 lineto
stroke
newpath
36167 35175.5 moveto
36167 35794.2 lineto
36110.8 35906.6 lineto
35998.3 35962.9 lineto
35773.3 35962.9 lineto
35660.8 35906.6 lineto
stroke
newpath
36167 35231.7 moveto
36054.5 35175.5 lineto
35773.3 35175.5 lineto
35660.8 35231.7 lineto
35604.6 35344.2 lineto
35604.6 35456.7 lineto
35660.8 35569.2 lineto
35773.3 35625.4 lineto
36054.5 35625.4 lineto
36167 35681.7 lineto
stroke
newpath
36729.4 35962.9 moveto
36729.4 34781.8 lineto
stroke
newpath
36729.4 35906.6 moveto
36841.9 35962.9 lineto
37066.9 35962.9 lineto
37179.4 35906.6 lineto
37235.6 35850.4 lineto
37291.9 35737.9 lineto
37291.9 35400.5 lineto
37235.6 35288 lineto
37179.4 35231.7 lineto
37066.9 35175.5 lineto
36841.9 35175.5 lineto
36729.4 35231.7 lineto
stroke
newpath
37798.1 35288 moveto
37854.3 35231.7 lineto
37798.1 35175.5 lineto
37741.8 35231.7 lineto
37798.1 35288 lineto
37798.1 35175.5 lineto
stroke
newpath
37798.1 35906.6 moveto
37854.3 35850.4 lineto
37798.1 35794.2 lineto
37741.8 35850.4 lineto
37798.1 35906.6 lineto
37798.1 35794.2 lineto
stroke
newpath
28153.3 33438.5 moveto
28571.4 33020.4 lineto
stroke
newpath
28571.4 33438.5 moveto
28153.3 33020.4 lineto
stroke
0 0 0 setrgbcolor
0 0 0 setrgbcolor
newpath
29924 33876.3 moveto
30036.5 33876.3 lineto
30149 33820 lineto
30205.3 33763.8 lineto
30261.5 33651.3 lineto
30317.7 33426.3 lineto
30317.7 33145.1 lineto
30261.5 32920.1 lineto
30205.3 32807.7 lineto
30149 32751.4 lineto
30036.5 32695.2 lineto
29924 32695.2 lineto
29811.5 32751.4 lineto
29755.3 32807.7 lineto
29699.1 32920.1 lineto
29642.8 33145.1 lineto
29642.8 33426.3 lineto
29699.1 33651.3 lineto
29755.3 33763.8 lineto
29811.5 33820 lineto
29924 33876.3 lineto
stroke
newpath
30823.9 32807.7 moveto
30880.2 32751.4 lineto
30823.9 32695.2 lineto
30767.7 32751.4 lineto
30823.9 32807.7 lineto
30823.9 32695.2 lineto
stroke
newpath
31892.5 33482.6 moveto
31892.5 32695.2 lineto
stroke
newpath
31611.3 33932.5 moveto
31330.1 33088.9 lineto
32061.3 33088.9 lineto
stroke
newpath
32736.2 33876.3 moveto
32848.7 33876.3 lineto
32961.2 33820 lineto
33017.4 33763.8 lineto
33073.6 33651.3 lineto
33129.9 33426.3 lineto
33129.9 33145.1 lineto
33073.6 32920.1 lineto
33017.4 32807.7 lineto
32961.2 32751.4 lineto
32848.7 32695.2 lineto
32736.2 32695.2 lineto
32623.7 32751.4 lineto
32567.5 32807.7 lineto
32511.2 32920.1 lineto
32455 33145.1 lineto
32455 33426.3 lineto
32511.2 33651.3 lineto
32567.5 33763.8 lineto
32623.7 33820 lineto
32736.2 33876.3 lineto
stroke
newpath
33636.1 32695.2 moveto
33636.1 33482.6 lineto
stroke
newpath
33636.1 33370.1 moveto
33692.3 33426.3 lineto
33804.8 33482.6 lineto
33973.5 33482.6 lineto
34086 33426.3 lineto
34142.3 33313.8 lineto
34142.3 32695.2 lineto
stroke
newpath
34142.3 33313.8 moveto
34198.5 33426.3 lineto
34311 33482.6 lineto
34479.7 33482.6 lineto
34592.2 33426.3 lineto
34648.4 33313.8 lineto
34648.4 32695.2 lineto
stroke
newpath
35210.9 32695.2 moveto
35210.9 33482.6 lineto
stroke
newpath
35210.9 33370.1 moveto
35267.1 33426.3 lineto
35379.6 33482.6 lineto
35548.3 33482.6 lineto
35660.8 33426.3 lineto
35717.1 33313.8 lineto
35717.1 32695.2 lineto
stroke
newpath
35717.1 33313.8 moveto
35773.3 33426.3 lineto
35885.8 33482.6 lineto
36054.5 33482.6 lineto
36167 33426.3 lineto
36223.2 33313.8 lineto
36223.2 32695.2 lineto
stroke
newpath
38529.2 33932.5 moveto
37516.8 32414 lineto
stroke
newpath
40047.8 33876.3 moveto
40160.3 33876.3 lineto
40272.7 33820 lineto
40329 33763.8 lineto
40385.2 33651.3 lineto
40441.5 33426.3 lineto
40441.5 33145.1 lineto
40385.2 32920.1 lineto
40329 32807.7 lineto
40272.7 32751.4 lineto
40160.3 32695.2 lineto
40047.8 32695.2 lineto
39935.3 32751.4 lineto
39879 32807.7 lineto
39822.8 32920.1 lineto
39766.6 33145.1 lineto
39766.6 33426.3 lineto
39822.8 33651.3 lineto
39879 33763.8 lineto
39935.3 33820 lineto
40047.8 33876.3 lineto
stroke
newpath
40947.7 32807.7 moveto
41003.9 32751.4 lineto
40947.7 32695.2 lineto
40891.4 32751.4 lineto
40947.7 32807.7 lineto
40947.7 32695.2 lineto
stroke
newpath
41735.1 33876.3 moveto
41847.5 33876.3 lineto
41960 33820 lineto
42016.3 33763.8 lineto
42072.5 33651.3 lineto
42128.8 33426.3 lineto
42128.8 33145.1 lineto
42072.5 32920.1 lineto
42016.3 32807.7 lineto
41960 32751.4 lineto
41847.5 32695.2 lineto
41735.1 32695.2 lineto
41622.6 32751.4 lineto
41566.3 32807.7 lineto
41510.1 32920.1 lineto
41453.8 33145.1 lineto
41453.8 33426.3 lineto
41510.1 33651.3 lineto
41566.3 33763.8 lineto
41622.6 33820 lineto
41735.1 33876.3 lineto
stroke
newpath
43253.6 32695.2 moveto
42578.7 32695.2 lineto
stroke
newpath
42916.2 32695.2 moveto
42916.2 33876.3 lineto
42803.7 33707.5 lineto
42691.2 33595.1 lineto
42578.7 33538.8 lineto
stroke
newpath
44266 33876.3 moveto
44041 33876.3 lineto
43928.5 33820 lineto
43872.3 33763.8 lineto
43759.8 33595.1 lineto
43703.6 33370.1 lineto
43703.6 32920.1 lineto
43759.8 32807.7 lineto
43816.1 32751.4 lineto
43928.5 32695.2 lineto
44153.5 32695.2 lineto
44266 32751.4 lineto
44322.2 32807.7 lineto
44378.5 32920.1 lineto
44378.5 33201.4 lineto
44322.2 33313.8 lineto
44266 33370.1 lineto
44153.5 33426.3 lineto
43928.5 33426.3 lineto
43816.1 33370.1 lineto
43759.8 33313.8 lineto
43703.6 33201.4 lineto
stroke
newpath
44828.4 33876.3 moveto
44828.4 33651.3 lineto
stroke
newpath
45278.4 33876.3 moveto
45278.4 33651.3 lineto
stroke
newpath
47021.9 32245.2 moveto
46965.7 32301.5 lineto
46853.2 32470.2 lineto
46796.9 32582.7 lineto
46740.7 32751.4 lineto
46684.4 33032.6 lineto
46684.4 33257.6 lineto
46740.7 33538.8 lineto
46796.9 33707.5 lineto
46853.2 33820 lineto
46965.7 33988.8 lineto
47021.9 34045 lineto
stroke
newpath
47415.6 33763.8 moveto
47471.8 33820 lineto
47584.3 33876.3 lineto
47865.5 33876.3 lineto
47978 33820 lineto
48034.3 33763.8 lineto
48090.5 33651.3 lineto
48090.5 33538.8 lineto
48034.3 33370.1 lineto
47359.4 32695.2 lineto
48090.5 32695.2 lineto
stroke
newpath
48484.2 33876.3 moveto
49215.4 33876.3 lineto
48821.7 33426.3 lineto
48990.4 33426.3 lineto
49102.9 33370.1 lineto
49159.1 33313.8 lineto
49215.4 33201.4 lineto
49215.4 32920.1 lineto
49159.1 32807.7 lineto
49102.9 32751.4 lineto
48990.4 32695.2 lineto
48652.9 32695.2 lineto
48540.5 32751.4 lineto
48484.2 32807.7 lineto
stroke
newpath
50621.5 32695.2 moveto
50621.5 33876.3 lineto
stroke
newpath
51127.6 32695.2 moveto
51127.6 33313.8 lineto
51071.4 33426.3 lineto
50958.9 33482.6 lineto
50790.2 33482.6 lineto
50677.7 33426.3 lineto
50621.5 33370.1 lineto
stroke
newpath
51858.8 32695.2 moveto
51746.3 32751.4 lineto
51690.1 32807.7 lineto
51633.8 32920.1 lineto
51633.8 33257.6 lineto
51690.1 33370.1 lineto
51746.3 33426.3 lineto
51858.8 33482.6 lineto
52027.5 33482.6 lineto
52140 33426.3 lineto
52196.3 33370.1 lineto
52252.5 33257.6 lineto
52252.5 32920.1 lineto
52196.3 32807.7 lineto
52140 32751.4 lineto
52027.5 32695.2 lineto
51858.8 32695.2 lineto
stroke
newpath
52927.4 32695.2 moveto
52814.9 32751.4 lineto
52758.7 32863.9 lineto
52758.7 33876.3 lineto
stroke
newpath
53827.3 32751.4 moveto
53714.8 32695.2 lineto
53489.8 32695.2 lineto
53377.4 32751.4 lineto
53321.1 32863.9 lineto
53321.1 33313.8 lineto
53377.4 33426.3 lineto
53489.8 33482.6 lineto
53714.8 33482.6 lineto
53827.3 33426.3 lineto
53883.5 33313.8 lineto
53883.5 33201.4 lineto
53321.1 33088.9 lineto
stroke
newpath
54333.5 32751.4 moveto
54446 32695.2 lineto
54670.9 32695.2 lineto
54783.4 32751.4 lineto
54839.7 32863.9 lineto
54839.7 32920.1 lineto
54783.4 33032.6 lineto
54670.9 33088.9 lineto
54502.2 33088.9 lineto
54389.7 33145.1 lineto
54333.5 33257.6 lineto
54333.5 33313.8 lineto
54389.7 33426.3 lineto
54502.2 33482.6 lineto
54670.9 33482.6 lineto
54783.4 33426.3 lineto
stroke
newpath
55233.4 32245.2 moveto
55289.6 32301.5 lineto
55402.1 32470.2 lineto
55458.3 32582.7 lineto
55514.6 32751.4 lineto
55570.8 33032.6 lineto
55570.8 33257.6 lineto
55514.6 33538.8 lineto
55458.3 33707.5 lineto
55402.1 33820 lineto
55289.6 33988.8 lineto
55233.4 34045 lineto
stroke
28048.8 31670.4 522.615 cir0
0 0 0 setrgbcolor
0 0 0 setrgbcolor
newpath
30317.7 31136.1 moveto
29642.8 31136.1 lineto
stroke
newpath
29980.3 31136.1 moveto
29980.3 32317.2 lineto
29867.8 32148.5 lineto
29755.3 32036 lineto
29642.8 31979.8 lineto
stroke
newpath
30823.9 31248.6 moveto
30880.2 31192.4 lineto
30823.9 31136.1 lineto
30767.7 31192.4 lineto
30823.9 31248.6 lineto
30823.9 31136.1 lineto
stroke
newpath
31611.3 32317.2 moveto
31723.8 32317.2 lineto
31836.3 32261 lineto
31892.5 32204.7 lineto
31948.8 32092.2 lineto
32005 31867.3 lineto
32005 31586.1 lineto
31948.8 31361.1 lineto
31892.5 31248.6 lineto
31836.3 31192.4 lineto
31723.8 31136.1 lineto
31611.3 31136.1 lineto
31498.8 31192.4 lineto
31442.6 31248.6 lineto
31386.4 31361.1 lineto
31330.1 31586.1 lineto
31330.1 31867.3 lineto
31386.4 32092.2 lineto
31442.6 32204.7 lineto
31498.8 32261 lineto
31611.3 32317.2 lineto
stroke
newpath
32736.2 32317.2 moveto
32848.7 32317.2 lineto
32961.2 32261 lineto
33017.4 32204.7 lineto
33073.6 32092.2 lineto
33129.9 31867.3 lineto
33129.9 31586.1 lineto
33073.6 31361.1 lineto
33017.4 31248.6 lineto
32961.2 31192.4 lineto
32848.7 31136.1 lineto
32736.2 31136.1 lineto
32623.7 31192.4 lineto
32567.5 31248.6 lineto
32511.2 31361.1 lineto
32455 31586.1 lineto
32455 31867.3 lineto
32511.2 32092.2 lineto
32567.5 32204.7 lineto
32623.7 32261 lineto
32736.2 32317.2 lineto
stroke
newpath
33636.1 31136.1 moveto
33636.1 31923.5 lineto
stroke
newpath
33636.1 31811 moveto
33692.3 31867.3 lineto
33804.8 31923.5 lineto
33973.5 31923.5 lineto
34086 31867.3 lineto
34142.3 31754.8 lineto
34142.3 31136.1 lineto
stroke
newpath
34142.3 31754.8 moveto
34198.5 31867.3 lineto
34311 31923.5 lineto
34479.7 31923.5 lineto
34592.2 31867.3 lineto
34648.4 31754.8 lineto
34648.4 31136.1 lineto
stroke
newpath
35210.9 31136.1 moveto
35210.9 31923.5 lineto
stroke
newpath
35210.9 31811 moveto
35267.1 31867.3 lineto
35379.6 31923.5 lineto
35548.3 31923.5 lineto
35660.8 31867.3 lineto
35717.1 31754.8 lineto
35717.1 31136.1 lineto
stroke
newpath
35717.1 31754.8 moveto
35773.3 31867.3 lineto
35885.8 31923.5 lineto
36054.5 31923.5 lineto
36167 31867.3 lineto
36223.2 31754.8 lineto
36223.2 31136.1 lineto
stroke
newpath
38529.2 32373.5 moveto
37516.8 30854.9 lineto
stroke
newpath
40047.8 32317.2 moveto
40160.3 32317.2 lineto
40272.7 32261 lineto
40329 32204.7 lineto
40385.2 32092.2 lineto
40441.5 31867.3 lineto
40441.5 31586.1 lineto
40385.2 31361.1 lineto
40329 31248.6 lineto
40272.7 31192.4 lineto
40160.3 31136.1 lineto
40047.8 31136.1 lineto
39935.3 31192.4 lineto
39879 31248.6 lineto
39822.8 31361.1 lineto
39766.6 31586.1 lineto
39766.6 31867.3 lineto
39822.8 32092.2 lineto
39879 32204.7 lineto
39935.3 32261 lineto
40047.8 32317.2 lineto
stroke
newpath
40947.7 31248.6 moveto
41003.9 31192.4 lineto
40947.7 31136.1 lineto
40891.4 31192.4 lineto
40947.7 31248.6 lineto
40947.7 31136.1 lineto
stroke
newpath
41735.1 32317.2 moveto
41847.5 32317.2 lineto
41960 32261 lineto
42016.3 32204.7 lineto
42072.5 32092.2 lineto
42128.8 31867.3 lineto
42128.8 31586.1 lineto
42072.5 31361.1 lineto
42016.3 31248.6 lineto
41960 31192.4 lineto
41847.5 31136.1 lineto
41735.1 31136.1 lineto
41622.6 31192.4 lineto
41566.3 31248.6 lineto
41510.1 31361.1 lineto
41453.8 31586.1 lineto
41453.8 31867.3 lineto
41510.1 32092.2 lineto
41566.3 32204.7 lineto
41622.6 32261 lineto
41735.1 32317.2 lineto
stroke
newpath
42522.5 32317.2 moveto
43253.6 32317.2 lineto
42859.9 31867.3 lineto
43028.7 31867.3 lineto
43141.1 31811 lineto
43197.4 31754.8 lineto
43253.6 31642.3 lineto
43253.6 31361.1 lineto
43197.4 31248.6 lineto
43141.1 31192.4 lineto
43028.7 31136.1 lineto
42691.2 31136.1 lineto
42578.7 31192.4 lineto
42522.5 31248.6 lineto
stroke
newpath
43816.1 31136.1 moveto
44041 31136.1 lineto
44153.5 31192.4 lineto
44209.8 31248.6 lineto
44322.2 31417.3 lineto
44378.5 31642.3 lineto
44378.5 32092.2 lineto
44322.2 32204.7 lineto
44266 32261 lineto
44153.5 32317.2 lineto
43928.5 32317.2 lineto
43816.1 32261 lineto
43759.8 32204.7 lineto
43703.6 32092.2 lineto
43703.6 31811 lineto
43759.8 31698.5 lineto
43816.1 31642.3 lineto
43928.5 31586.1 lineto
44153.5 31586.1 lineto
44266 31642.3 lineto
44322.2 31698.5 lineto
44378.5 31811 lineto
stroke
newpath
44828.4 32317.2 moveto
44828.4 32092.2 lineto
stroke
newpath
45278.4 32317.2 moveto
45278.4 32092.2 lineto
stroke
newpath
47021.9 30686.2 moveto
46965.7 30742.4 lineto
46853.2 30911.1 lineto
46796.9 31023.6 lineto
46740.7 31192.4 lineto
46684.4 31473.6 lineto
46684.4 31698.5 lineto
46740.7 31979.8 lineto
46796.9 32148.5 lineto
46853.2 32261 lineto
46965.7 32429.7 lineto
47021.9 32485.9 lineto
stroke
newpath
47640.6 31811 moveto
47528.1 31867.3 lineto
47471.8 31923.5 lineto
47415.6 32036 lineto
47415.6 32092.2 lineto
47471.8 32204.7 lineto
47528.1 32261 lineto
47640.6 32317.2 lineto
47865.5 32317.2 lineto
47978 32261 lineto
48034.3 32204.7 lineto
48090.5 32092.2 lineto
48090.5 32036 lineto
48034.3 31923.5 lineto
47978 31867.3 lineto
47865.5 31811 lineto
47640.6 31811 lineto
47528.1 31754.8 lineto
47471.8 31698.5 lineto
47415.6 31586.1 lineto
47415.6 31361.1 lineto
47471.8 31248.6 lineto
47528.1 31192.4 lineto
47640.6 31136.1 lineto
47865.5 31136.1 lineto
47978 31192.4 lineto
48034.3 31248.6 lineto
48090.5 31361.1 lineto
48090.5 31586.1 lineto
48034.3 31698.5 lineto
47978 31754.8 lineto
47865.5 31811 lineto
stroke
newpath
49496.6 31136.1 moveto
49496.6 32317.2 lineto
stroke
newpath
50002.8 31136.1 moveto
50002.8 31754.8 lineto
49946.5 31867.3 lineto
49834.1 31923.5 lineto
49665.3 31923.5 lineto
49552.8 31867.3 lineto
49496.6 31811 lineto
stroke
newpath
50733.9 31136.1 moveto
50621.5 31192.4 lineto
50565.2 31248.6 lineto
50509 31361.1 lineto
50509 31698.5 lineto
50565.2 31811 lineto
50621.5 31867.3 lineto
50733.9 31923.5 lineto
50902.7 31923.5 lineto
51015.2 31867.3 lineto
51071.4 31811 lineto
51127.6 31698.5 lineto
51127.6 31361.1 lineto
51071.4 31248.6 lineto
51015.2 31192.4 lineto
50902.7 31136.1 lineto
50733.9 31136.1 lineto
stroke
newpath
51802.6 31136.1 moveto
51690.1 31192.4 lineto
51633.8 31304.8 lineto
51633.8 32317.2 lineto
stroke
newpath
52702.4 31192.4 moveto
52590 31136.1 lineto
52365 31136.1 lineto
52252.5 31192.4 lineto
52196.3 31304.8 lineto
52196.3 31754.8 lineto
52252.5 31867.3 lineto
52365 31923.5 lineto
52590 31923.5 lineto
52702.4 31867.3 lineto
52758.7 31754.8 lineto
52758.7 31642.3 lineto
52196.3 31529.8 lineto
stroke
newpath
53208.6 31192.4 moveto
53321.1 31136.1 lineto
53546.1 31136.1 lineto
53658.6 31192.4 lineto
53714.8 31304.8 lineto
53714.8 31361.1 lineto
53658.6 31473.6 lineto
53546.1 31529.8 lineto
53377.4 31529.8 lineto
53264.9 31586.1 lineto
53208.6 31698.5 lineto
53208.6 31754.8 lineto
53264.9 31867.3 lineto
53377.4 31923.5 lineto
53546.1 31923.5 lineto
53658.6 31867.3 lineto
stroke
newpath
54108.5 30686.2 moveto
54164.8 30742.4 lineto
54277.2 30911.1 lineto
54333.5 31023.6 lineto
54389.7 31192.4 lineto
54446 31473.6 lineto
54446 31698.5 lineto
54389.7 31979.8 lineto
54333.5 32148.5 lineto
54277.2 32261 lineto
54164.8 32429.7 lineto
54108.5 32485.9 lineto
stroke
showpage
grestore
%%EOF
