G04 #@! TF.GenerationSoftware,KiCad,Pcbnew,5.1.2*
G04 #@! TF.CreationDate,2019-06-19T14:20:35-07:00*
G04 #@! TF.ProjectId,lcd-devkit-adapter,6c63642d-6465-4766-9b69-742d61646170,rev?*
G04 #@! TF.SameCoordinates,Original*
G04 #@! TF.FileFunction,Copper,L2,Bot*
G04 #@! TF.FilePolarity,Positive*
%FSLAX46Y46*%
G04 Gerber Fmt 4.6, Leading zero omitted, Abs format (unit mm)*
G04 Created by KiCad (PCBNEW 5.1.2) date 2019-06-19 14:20:35*
%MOMM*%
%LPD*%
G04 APERTURE LIST*
%ADD10O,1.700000X1.700000*%
%ADD11R,1.700000X1.700000*%
%ADD12C,0.800000*%
%ADD13C,0.200000*%
%ADD14C,0.250000*%
G04 APERTURE END LIST*
D10*
X92456000Y-56388000D03*
X92456000Y-53848000D03*
X92456000Y-51308000D03*
D11*
X92456000Y-48768000D03*
D10*
X92710000Y-41402000D03*
X92710000Y-38862000D03*
X92710000Y-36322000D03*
D11*
X92710000Y-33782000D03*
D12*
X106045372Y-58701423D03*
X106495946Y-56449990D03*
X88763000Y-67955000D03*
X101346000Y-67818000D03*
X90424000Y-44704000D03*
X96991010Y-54123718D03*
X118110000Y-54610000D03*
X102870004Y-54102000D03*
X119634000Y-52070000D03*
X96991010Y-53123705D03*
X100861301Y-53473287D03*
X100861301Y-53473288D03*
X101821888Y-34990010D03*
X102239525Y-37047010D03*
X116078000Y-40132000D03*
X116078000Y-40132000D03*
X96973115Y-49221115D03*
X135382000Y-40894008D03*
X116586000Y-41910000D03*
X116078000Y-39131997D03*
X96774000Y-48006000D03*
X135890000Y-42418000D03*
X124714000Y-67310000D03*
D13*
X95892012Y-59824012D02*
X104825679Y-59824012D01*
X105918000Y-58731691D02*
X105918000Y-58166006D01*
X105918000Y-58166006D02*
X106045372Y-58293378D01*
X106045372Y-58293378D02*
X106045372Y-58701423D01*
X92456000Y-56388000D02*
X95892012Y-59824012D01*
X104825679Y-59824012D02*
X105918000Y-58731691D01*
D14*
X105930261Y-56449990D02*
X106495946Y-56449990D01*
X92456000Y-53848000D02*
X95057990Y-56449990D01*
X95057990Y-56449990D02*
X105930261Y-56449990D01*
D13*
X88763000Y-67389315D02*
X88900000Y-67252315D01*
X88763000Y-67955000D02*
X88763000Y-67389315D01*
X88900000Y-45212000D02*
X92710000Y-41402000D01*
X88900000Y-67252315D02*
X88900000Y-45212000D01*
D14*
X93559999Y-40552001D02*
X92710000Y-41402000D01*
X93885001Y-40226999D02*
X93559999Y-40552001D01*
X93885001Y-38297999D02*
X93885001Y-40226999D01*
X92710000Y-37122998D02*
X93885001Y-38297999D01*
X92710000Y-36322000D02*
X92710000Y-37122998D01*
D13*
X101346000Y-67818000D02*
X91186000Y-67818000D01*
X89515990Y-45612010D02*
X90424000Y-44704000D01*
X91186000Y-67818000D02*
X89515990Y-66147990D01*
X89515990Y-66147990D02*
X89515990Y-45612010D01*
D14*
X118110000Y-54610000D02*
X117602000Y-54102000D01*
X117602000Y-54102000D02*
X103435689Y-54102000D01*
X103435689Y-54102000D02*
X102870004Y-54102000D01*
D13*
X102448287Y-54523717D02*
X102470005Y-54501999D01*
X102470005Y-54501999D02*
X102870004Y-54102000D01*
X97391009Y-54523717D02*
X102448287Y-54523717D01*
X96991010Y-54123718D02*
X97391009Y-54523717D01*
X100511719Y-53123705D02*
X100861301Y-53473287D01*
D14*
X102264588Y-52070000D02*
X101261300Y-53073288D01*
D13*
X96991010Y-53123705D02*
X100511719Y-53123705D01*
D14*
X119634000Y-52070000D02*
X102264588Y-52070000D01*
X101261300Y-53073288D02*
X100861301Y-53473287D01*
X101821888Y-34990010D02*
X102239525Y-35407647D01*
X102239525Y-35407647D02*
X102239525Y-37047010D01*
X97373114Y-48821116D02*
X96973115Y-49221115D01*
X106062230Y-40132000D02*
X97373114Y-48821116D01*
X116078000Y-40132000D02*
X106062230Y-40132000D01*
X134982001Y-40494009D02*
X135382000Y-40894008D01*
X134619992Y-40132000D02*
X134982001Y-40494009D01*
X116078000Y-40132000D02*
X134619992Y-40132000D01*
X97173999Y-47606001D02*
X96774000Y-48006000D01*
X105648003Y-39131997D02*
X97173999Y-47606001D01*
X116078000Y-39131997D02*
X105648003Y-39131997D01*
X135382000Y-41910000D02*
X135490001Y-42018001D01*
X135490001Y-42018001D02*
X135890000Y-42418000D01*
X116586000Y-41910000D02*
X135382000Y-41910000D01*
D13*
X124314001Y-66910001D02*
X92818001Y-66910001D01*
X94549999Y-41594001D02*
X94549999Y-34571999D01*
X124714000Y-67310000D02*
X124314001Y-66910001D01*
X89916000Y-46228000D02*
X94549999Y-41594001D01*
X93760000Y-33782000D02*
X92710000Y-33782000D01*
X92818001Y-66910001D02*
X89916000Y-64008000D01*
X89916000Y-64008000D02*
X89916000Y-46228000D01*
X94549999Y-34571999D02*
X93760000Y-33782000D01*
M02*
