module gitlab.com/startx1/k8s/sxlimits

go 1.23.3

require (
	gitlab.com/startx1/k8s/go-libs v0.2.5
	k8s.io/api v0.32.2
	k8s.io/apimachinery v0.32.2
	k8s.io/kube-openapi v0.0.0-20250304201544-e5f78fe3ede9
	sigs.k8s.io/yaml v1.4.0
)

require (
	github.com/davecgh/go-spew v1.1.2-0.20180830191138-d8f796af33cc // indirect
	github.com/emicklei/go-restful/v3 v3.12.2 // indirect
	github.com/fxamacker/cbor/v2 v2.7.0 // indirect
	github.com/go-logr/logr v1.4.2 // indirect
	github.com/go-openapi/jsonpointer v0.21.0 // indirect
	github.com/go-openapi/jsonreference v0.21.0 // indirect
	github.com/go-openapi/swag v0.23.0 // indirect
	github.com/gogo/protobuf v1.3.2 // indirect
	github.com/golang/protobuf v1.5.4 // indirect
	github.com/google/gnostic-models v0.6.9 // indirect
	github.com/google/go-cmp v0.7.0 // indirect
	github.com/google/gofuzz v1.2.0 // indirect
	github.com/google/uuid v1.6.0 // indirect
	github.com/josharian/intern v1.0.0 // indirect
	github.com/json-iterator/go v1.1.12 // indirect
	github.com/mailru/easyjson v0.9.0 // indirect
	github.com/modern-go/concurrent v0.0.0-20180306012644-bacd9c7ef1dd // indirect
	github.com/modern-go/reflect2 v1.0.2 // indirect
	github.com/munnerz/goautoneg v0.0.0-20191010083416-a7dc8b61c822 // indirect
	github.com/openshift/api v0.0.0-20250305225826-b8da3bfeaf77 // indirect
	github.com/openshift/client-go v0.0.0-20250131180035-f7ec47e2d87a // indirect
	github.com/pkg/errors v0.9.1 // indirect
	github.com/spf13/pflag v1.0.6 // indirect
	github.com/x448/float16 v0.8.4 // indirect
	golang.org/x/net v0.37.0 // indirect
	golang.org/x/oauth2 v0.28.0 // indirect
	golang.org/x/sys v0.31.0 // indirect
	golang.org/x/term v0.30.0 // indirect
	golang.org/x/text v0.23.0 // indirect
	golang.org/x/time v0.11.0 // indirect
	google.golang.org/protobuf v1.36.5 // indirect
	gopkg.in/evanphx/json-patch.v4 v4.12.0 // indirect
	gopkg.in/inf.v0 v0.9.1 // indirect
	gopkg.in/yaml.v2 v2.4.0 // indirect
	gopkg.in/yaml.v3 v3.0.1 // indirect
	k8s.io/client-go v0.32.2 // indirect
	k8s.io/klog/v2 v2.130.1 // indirect
	k8s.io/utils v0.0.0-20241210054802-24370beab758 // indirect
	sigs.k8s.io/json v0.0.0-20241014173422-cfa47c3a1cc8 // indirect
	sigs.k8s.io/randfill v1.0.0 // indirect
	sigs.k8s.io/structured-merge-diff/v4 v4.6.0 // indirect
)
